{
    "companies" : [
        {
            "id" : "0031",
            "Bedrijfsnaam": "Train Charter Events B.V.",
            "Functie" : "Chaffeur",
            "Adres": "Kerkhovensestraat 9B",
            "Woonplaats": "5061 PJ Oisterwijk",
            "Tarief": 21.00
        },
        {
            "id" : "0032",
            "Bedrijfsnaam": "Train Charter Events B.V.",
            "Functie" : "Catering",
            "Adres": "Kerkhovensestraat 9B",
            "Woonplaats": "5061 PJ Oisterwijk",
            "Tarief": 21.00
        }
    ]
}
