<svg xmlns="http://www.w3.org/2000/svg" width="69.215141mm" height="69.519264mm" viewBox="0 0 245.2505 246.3281" version="1.1">
  <g transform="translate(-252.37475,-409.19817)">
    <g transform="matrix(1.25,0,0,-1.25,3.62525,1057.9484)">
      <g>
        <g>
          <g transform="translate(333.5312,485.1191)">
            <path style="fill:#004098;fill-rule:nonzero;stroke:none;" d="m 0,0 c -22.006,5.178 -47.497,0.178 -69.944,-13.716 -22.447,-13.894 -38.287,-34.482 -43.465,-56.487 -3.628,-15.423 -1.607,-29.938 5.85,-41.985 18.553,-29.969 65.618,-34.566 104.912,-10.241 39.294,24.326 56.166,68.497 37.613,98.469 C 27.51,-11.913 15.419,-3.629 0,0 m -6.603,-116.038 c -35.769,-22.14 -78.191,-18.637 -94.563,7.809 -6.384,10.313 -8.087,22.866 -4.925,36.3 4.654,19.785 19.647,39.157 40.104,51.819 20.456,12.666 44.481,17.444 64.265,12.788 13.435,-3.16 23.909,-10.281 30.294,-20.594 16.372,-26.45 0.594,-65.978 -35.175,-88.122" />
          </g>
          <g transform="translate(239.8031,386.3127)">
            <path style="fill:#004098;fill-rule:nonzero;stroke:none;" d="M 0,0 C 15.556,0 90.075,27.869 88.469,49.172 86.944,69.359 43.881,48.943 30.031,42.084 l 1.716,16.503 c 9.434,7.551 69.756,33.719 79.675,2.716 C 123.613,23.206 32.491,-2.5 0,0" />
          </g>
          <g transform="translate(268.3062,420.0215)">
            <path style="fill:#8d93c8;fill-rule:nonzero;stroke:none;" d="M 0,0 C 8.147,0 14.753,6.603 14.753,14.754 14.753,22.9 8.147,29.503 0,29.503 -8.144,29.503 -14.75,22.9 -14.75,14.754 -14.75,6.603 -8.144,0 0,0" />
          </g>
          <g transform="translate(279.3656,361.7407)">
            <path style="fill:#8d93c8;fill-rule:nonzero;stroke:none;" d="m 0,0 c 0.018,13.89 -0.028,39.6 -0.028,40 0,6.034 -4.894,10.928 -10.925,10.928 -6.038,0 -10.931,-4.894 -10.931,-10.928 l 0,-36.806 C -15.178,0.969 -7.769,-0.103 0,0" />
          </g>
          <g transform="translate(200.2406,427.9847)">
            <path style="fill:#8d93c8;fill-rule:nonzero;stroke:none;" d="M 0,0 C 0.934,-0.491 1.112,-0.578 1.866,-0.978 L 3.303,2.784 6.05,1.734 4.478,-2.378 c 4.706,-2.597 6.972,-4.188 10.469,-6.797 l -1.975,-2.363 c -2.669,2.522 -7.35,5.36 -9.491,6.556 l -0.822,-2.152 -2.743,1.046 0.943,2.472 c -0.875,0.428 -1.159,0.556 -2.1,0.975 L 0,0 Z m 11.891,-0.71 c 0.225,-0.412 0.625,-1.075 1.234,-1.309 0.975,-0.372 1.484,0.572 2.122,2.247 0.447,1.159 0.872,2.328 1.162,3.528 L 19.294,2.69 C 19.147,2.253 19.006,1.771 18.506,0.462 17.556,-2.022 16.959,-3.313 15.969,-4.132 15.5,-4.526 14.281,-5.294 12.716,-4.694 c -1.272,0.488 -2.194,1.503 -2.841,2.625 l 2.016,1.359 z M 10.628,5.759 C 10.406,5.234 10.181,4.753 9.894,4.006 8.994,1.653 8.9,0.412 8.941,-0.8 l -2.716,0.128 c -0.2,1.843 0.059,3.853 1.534,7.49 l 2.869,-1.059 z" />
          </g>
          <g transform="translate(207.8781,442.5439)">
            <path style="fill:#8d93c8;fill-rule:nonzero;stroke:none;" d="m 0,0 c 1.575,-1.285 3.203,-2.519 4.941,-3.572 1.162,-0.703 2.856,-1.644 4.172,-2.025 0.543,-0.162 1.5,-0.409 1.859,0.181 0.269,0.441 0.012,0.969 -0.272,1.454 -0.344,0.577 -0.975,1.437 -1.769,2.334 l 2.494,1.187 c 1.234,-1.387 3.959,-4.656 2.544,-6.997 -0.972,-1.609 -2.772,-1.493 -4.094,-1.278 -1.834,0.322 -4.641,1.666 -6.666,2.894 -1.722,1.04 -3.678,2.453 -4.99,3.412 L 0,0 Z M 16.666,0.787 C 16.337,1.009 16.006,1.228 15.484,1.543 13.578,2.7 11.45,3.756 9.372,4.246 7.822,4.622 6.209,4.812 4.763,4.4 L 4.487,7.222 C 6.962,7.656 8.953,7.859 13.178,6.115 15.259,5.25 16.941,4.253 18.112,3.525 L 16.666,0.787 Z" />
          </g>
          <g transform="translate(223.6593,466.3871)">
            <path style="fill:#8d93c8;fill-rule:nonzero;stroke:none;" d="M 0,0 C 0.578,-0.418 1.091,-0.784 2.847,-2.253 L 4.466,-0.25 6.694,-2.134 5.075,-4.137 c 2.953,-2.644 4.675,-4.241 2.644,-6.637 -0.15,-0.176 -0.757,-0.894 -1.857,-1.732 l -2.171,1.794 c 0.89,0.687 1.553,1.406 1.553,1.406 0.584,0.691 0.028,1.256 -1.95,2.978 L 0.112,-10.262 3.4,-13.097 c 2.3,-1.946 2.45,-2.074 4.978,0.903 1.125,1.328 2.375,2.804 3.234,4.123 l 2.347,-1.991 c -0.603,-0.86 -1.715,-2.175 -2.612,-3.232 -2.144,-2.531 -3.706,-4.372 -5.9,-4.093 -0.813,0.106 -1.609,0.359 -3.609,2.056 l -3.46,2.931 -1.631,-2.015 -2.238,1.872 1.644,2.028 -2.662,2.256 1.812,2.141 2.591,-2.219 3.147,3.894 c -1.644,1.325 -2.16,1.69 -2.853,2.184 L 0,0 Z" />
          </g>
          <g transform="translate(238.5375,462.0655)">
            <path style="fill:#8d93c8;fill-rule:nonzero;stroke:none;" d="M 0,0 C 1.331,1.119 3.184,2.775 4.378,4.4 5.1,5.406 6.884,7.919 4.356,10.79 3.588,11.662 2.838,12.056 2.156,12.19 1.3,12.356 0.391,12.238 -0.756,11.231 -1.731,10.375 -3.228,8.425 -4.291,6.838 -5.859,4.513 -6.031,4.254 -6.234,3.947 l -2.76,2.143 c 0.681,0.807 1.138,1.392 2.288,2.876 2.331,3.047 3.262,4 4.172,4.796 2.715,2.392 6.422,2.128 9.156,-0.98 C 9.278,9.762 8.978,6.61 8.128,4.838 6.978,2.382 5.162,0.419 2.512,-1.887 L 0,0 Z" />
          </g>
          <g transform="translate(245.9,484.9527)">
            <path style="fill:#8d93c8;fill-rule:nonzero;stroke:none;" d="m 0,0 c 1.328,-2.881 2.878,-5.637 4.631,-8.284 0.857,-1.3 2.466,-3.641 4.335,-5.594 l -2.313,-1.84 c -1.562,1.684 -2.934,3.565 -4.187,5.459 -1.869,2.828 -3.519,5.803 -5.085,8.809 L 0,0 Z m 9.631,5.126 1.716,-2.6 -7.606,-5.038 -1.716,2.6 7.606,5.038 z M 8.85,-4.828 c -0.038,-1.35 0.425,-2.084 0.566,-2.297 0.75,-1.137 2.025,-0.553 3.431,0.379 1.05,0.696 2.409,1.665 3.344,2.5 l 1.793,-2.644 c -0.412,-0.344 -1.131,-0.963 -2.596,-1.932 -2.425,-1.606 -5.722,-3.603 -7.919,-0.28 -0.775,1.168 -1.141,2.556 -1.216,3.924 l 2.597,0.35 z" />
          </g>
          <g transform="translate(261.1218,494.7032)">
            <path style="fill:#8d93c8;fill-rule:nonzero;stroke:none;" d="m 0,0 c 1.297,-2.947 4.1,-8.862 4.328,-9.322 1.128,-2.281 2.131,-3.237 4.203,-2.212 3.469,1.712 2.635,5.196 1.825,7.675 l 3.003,0.012 c 0.297,-1.04 1.094,-3.771 0.272,-6.356 -0.493,-1.566 -1.393,-2.91 -3.731,-4.066 -4.775,-2.359 -6.716,0.728 -8.494,4.338 -0.675,1.359 -3.575,7.387 -4.178,8.606 L 0,0 Z" />
          </g>
          <g transform="translate(279.2872,500.8935)">
            <path style="fill:#8d93c8;fill-rule:nonzero;stroke:none;" d="M 0,0 -0.518,1.51 2.166,2.434 2.688,0.926 7.757,2.669 8.654,0.059 3.585,-1.687 4.06,-3.066 l 4.7,1.62 0.871,-2.538 -4.697,-1.619 0.654,-1.903 c 2.194,-0.203 4.556,-1.016 5.878,-1.647 l -0.784,-3.272 c -0.756,0.447 -2.472,1.338 -4.004,1.751 l 0.082,-0.348 c 0.209,-0.824 0.346,-1.384 -0.147,-2.24 -0.379,-0.653 -0.982,-1.404 -2.644,-1.976 -2.953,-1.018 -4.966,0.023 -5.666,2.054 -0.771,2.259 0.597,4.272 3.316,5.21 0.553,0.19 0.75,0.218 1.047,0.233 L 2.247,-6.528 -3.393,-8.469 -4.265,-5.934 1.372,-3.99 0.9,-2.612 -5.09,-4.674 -5.99,-2.062 0,0 Z m 3.534,-10.215 c -0.371,-0.003 -0.812,0.012 -1.38,-0.185 -0.638,-0.218 -1.669,-0.822 -1.328,-1.812 0.359,-1.044 1.624,-0.691 1.996,-0.562 1.425,0.49 1.163,1.256 1.004,1.721 l -0.292,0.838 z" />
          </g>
          <g transform="translate(297.456,507.5439)">
            <path style="fill:#8d93c8;fill-rule:nonzero;stroke:none;" d="m 0,0 2.86,0.546 0.34,-1.78 4.603,0.877 0.544,-2.846 -4.603,-0.879 0.794,-4.165 c 0.237,-0.597 0.606,-1.491 0.822,-2.612 0.553,-2.907 -0.644,-4.5 -2.072,-5.538 -1.122,-0.834 -2.544,-1.447 -4.491,-1.841 l -1.371,2.55 c 0.662,0.126 2.471,0.491 3.612,1.05 1.384,0.707 1.493,1.35 1.578,1.869 -0.272,-0.293 -0.613,-0.678 -1.522,-0.853 -2.263,-0.432 -3.96,1.253 -4.353,3.325 -0.325,1.706 0.347,4.163 3.103,4.687 0.541,0.104 0.987,0.028 1.356,-0.021 L 0.988,-4.606 -7.05,-6.144 -7.59,-3.294 0.375,-1.772 0,0 Z m 1.941,-9.044 c -0.072,0.287 -0.384,1.353 -1.535,1.131 -0.278,-0.049 -1.418,-0.409 -1.128,-1.941 0.119,-0.637 0.584,-1.652 1.738,-1.434 0.834,0.16 1.19,0.85 1.028,1.703 l -0.103,0.541 z" />
          </g>
          <g transform="translate(321.4184,515.7751)">
            <path style="fill:#004098;fill-rule:nonzero;stroke:none;" d="M 0,0 C 0.113,-3.519 1.491,-4.39 2.875,-4.375 2.429,-11.541 0.834,-20.906 -8.406,-24.178 l -1.403,4.478 c 7.253,1.831 9.138,7.859 9.619,15.025 L -11.14,-4.803 -11.194,-0.128 0,0 Z M 2.616,-3.431 C 1.498,-3.444 0.594,-1.975 0.572,-0.113 0.55,1.722 1.419,3.212 2.538,3.225 3.657,3.238 4.56,1.769 4.582,-0.066 4.603,-1.928 3.732,-3.419 2.616,-3.431 M 2.56,1.272 C 2.098,1.269 1.732,0.641 1.741,-0.097 1.75,-0.866 2.132,-1.485 2.594,-1.478 c 0.46,0.003 0.825,0.631 0.816,1.4 -0.01,0.74 -0.391,1.356 -0.85,1.35" />
          </g>
          <g transform="translate(342.5128,514.3311)">
            <path style="fill:#004098;fill-rule:nonzero;stroke:none;" d="m 0,0 -0.703,-4.29 -12.031,1.965 0.696,4.294 L 0,0 Z m -0.01,-7.312 c -2.172,-9.66 -5.55,-16.034 -14.665,-15.682 l -0.128,4.488 c 6.149,-0.553 9.012,1.884 10.743,7.419 l -11.143,1.821 0.706,4.32 14.487,-2.366 z" />
          </g>
          <g transform="translate(348.9872,486.1503)">
            <path style="fill:#004098;fill-rule:nonzero;stroke:none;" d="M 0,0 -2.803,1.069 1.5,12.346 C -1.571,11.018 -4.015,10.587 -5.609,10.34 l -0.034,4.291 c 2.972,0.225 6.09,1.284 9.19,2.887 3.41,1.772 6.072,4.019 8.166,5.879 l 1.328,-3.641 C 10.663,17.75 8.626,16.246 5.491,14.402 L 0,0 Z" />
          </g>
          <g transform="translate(354.8688,487.9751)">
            <path style="fill:#004098;fill-rule:nonzero;stroke:none;" d="m 0,0 c 2.931,1.603 5.515,3.984 7.687,6.362 3.541,3.882 5.928,7.156 7.188,8.876 L 16.91,13.246 C 8.947,2.89 4.882,-1.559 -0.106,-4.285 L 0,0 Z M 21.697,10.528 C 20.906,8.734 20.756,8.369 19.787,6.662 L 20.09,6.6 C 17.028,1.7 14.406,-4.619 13.578,-9.447 l -4.112,-1.284 c 1.259,6.043 4.006,12.134 10.24,22.1 l 1.991,-0.841 z M 20.718,6.881 c 0.554,0.985 1.579,3.081 2.051,4.413 l 1.525,-0.45 C 24.028,10.056 23.234,8.015 22.369,6.487 L 20.718,6.881 Z M 22.953,5.9 c 1.206,2.481 1.569,3.344 1.962,4.438 L 26.413,9.91 C 25.756,8.062 24.925,6.403 24.484,5.522 L 22.953,5.9 Z" />
          </g>
          <g transform="translate(383.656,482.1935)">
            <path style="fill:#004098;fill-rule:nonzero;stroke:none;" d="M 0,0 C 0.057,2.269 -0.334,4.334 -0.918,6.266 L 2.766,7.972 C 3.426,6.328 3.947,4.006 3.96,1.791 L 0,0 Z m -6.509,-3.303 c 0.135,2.081 -0.106,4.244 -0.631,6.244 l 3.697,1.741 c 0.509,-1.372 1.018,-3.866 0.897,-6.148 l -3.963,-1.837 z m -7.069,-0.231 C -9.4,-7.341 -5.6,-9.278 6.372,-2.609 l 0.047,-3.425 c -12.837,-6.778 -18.257,-5.569 -23.444,-1.325 l 3.447,3.825 z" />
          </g>
          <g transform="translate(395.2,456.2471)">
            <path style="fill:#004098;fill-rule:nonzero;stroke:none;" d="M 0,0 -4.556,-1.91 -10.603,12.531 -6.044,14.44 0,0 Z" />
          </g>
          <g transform="translate(247,337.0297)">
            <path style="fill:#004098;fill-rule:nonzero;stroke:none;" d="m 0,0 0.379,0 c 2.566,0 3.246,1.781 3.305,3.125 l 2.183,0 0,-17.977 -2.656,0 0,12.372 L 0,-2.48 0,0 Z" />
          </g>
          <g transform="translate(262.5383,331.1727)">
            <path style="fill:#004098;fill-rule:nonzero;stroke:none;" d="m 0,0 c 0,4.637 0.418,6.383 1.941,6.383 1.528,0 1.95,-1.746 1.95,-6.383 0,-4.633 -0.422,-6.407 -1.95,-6.407 C 0.418,-6.407 0,-4.633 0,0 m -2.738,0 c 0,-6.305 1.5,-9.235 4.679,-9.235 3.18,0 4.684,2.93 4.684,9.235 0,6.304 -1.504,9.211 -4.684,9.211 -3.179,0 -4.679,-2.907 -4.679,-9.211" />
          </g>
          <g transform="translate(278.1305,333.1447)">
            <path style="fill:#004098;fill-rule:nonzero;stroke:none;" d="m 0,0 c -1.16,0 -1.762,1.184 -1.762,2.258 0,1.332 0.637,2.25 1.856,2.25 0.871,0 1.586,-0.875 1.586,-2.25 C 1.68,0.95 1.062,0 0,0 m 4.687,-5.367 c 0,2.328 -0.722,3.481 -2.023,4.348 1.086,0.765 1.563,2.097 1.563,3.656 0,2.508 -1.485,4.719 -4.305,4.719 -2.387,0 -4.231,-1.86 -4.231,-4.945 0,-1.692 0.571,-2.84 1.637,-3.555 -2.058,-1.281 -2.058,-3.664 -2.058,-4.578 0,-2.457 1.203,-5.485 4.71,-5.485 3.602,0 4.707,3.559 4.707,5.84 m -2.75,-0.152 c 0,-1.242 -0.535,-2.84 -1.937,-2.84 -1.23,0 -1.977,1.141 -1.977,2.863 0,1.953 0.942,2.789 1.918,2.789 1.496,0 1.996,-1.547 1.996,-2.812" />
          </g>
          <g transform="translate(293.6641,328.2158)">
            <path style="fill:#004098;fill-rule:nonzero;stroke:none;" d="m 0,0 c 0,-2.442 -0.895,-3.43 -1.871,-3.43 -1.277,0 -2.117,1.395 -2.117,3.352 0,2.261 1.031,3.097 2.043,3.097 C -1.109,3.019 0,2.285 0,0 m 2.406,7.691 c -0.246,1.922 -0.515,2.453 -1.258,3.418 -0.668,0.887 -2.214,1.168 -2.769,1.168 -4.699,0 -5.043,-6.039 -5.043,-9.48 0,-4.5 0.805,-9.075 4.91,-9.075 2.613,0 4.43,2.641 4.43,6.582 0,2.692 -1.336,5.559 -4.145,5.559 -1.508,0 -2.176,-0.836 -2.539,-1.496 l -0.039,0.051 c 0.094,2.347 0.496,5.011 2.231,5.011 0.996,0 1.492,-0.714 1.566,-1.742 l 2.656,0.004 z" />
          </g>
          <g transform="translate(303.3383,331.1727)">
            <path style="fill:#004098;fill-rule:nonzero;stroke:none;" d="m 0,0 c 0,4.637 0.418,6.383 1.941,6.383 1.528,0 1.95,-1.746 1.95,-6.383 0,-4.633 -0.422,-6.407 -1.95,-6.407 C 0.418,-6.407 0,-4.633 0,0 m -2.738,0 c 0,-6.305 1.5,-9.235 4.679,-9.235 3.18,0 4.684,2.93 4.684,9.235 0,6.304 -1.504,9.211 -4.684,9.211 -3.179,0 -4.679,-2.907 -4.679,-9.211" />
          </g>
          <g transform="translate(316.9383,331.1727)">
            <path style="fill:#004098;fill-rule:nonzero;stroke:none;" d="m 0,0 c 0,4.637 0.418,6.383 1.941,6.383 1.528,0 1.95,-1.746 1.95,-6.383 0,-4.633 -0.422,-6.407 -1.95,-6.407 C 0.418,-6.407 0,-4.633 0,0 m -2.738,0 c 0,-6.305 1.5,-9.235 4.679,-9.235 3.18,0 4.684,2.93 4.684,9.235 0,6.304 -1.504,9.211 -4.684,9.211 -3.179,0 -4.679,-2.907 -4.679,-9.211" />
          </g>
          <g transform="translate(330.6047,333.2467)">
            <path style="fill:#004098;fill-rule:nonzero;stroke:none;" d="m 0,0 c 0.496,0.457 1.105,0.988 2.418,0.988 1.809,0 4.098,-1.672 4.098,-5.816 0,-2.469 -0.934,-6.481 -4.918,-6.481 -2.114,0 -4.27,1.676 -4.403,5.309 l 2.668,0 c 0.117,-1.473 0.707,-2.469 1.887,-2.469 1.277,0 2.02,1.453 2.02,3.387 0,1.601 -0.571,3.23 -1.981,3.23 C 1.426,-1.852 0.516,-1.875 0,-3.148 L -2.387,-3 l 0.934,9.922 7.437,0 0,-3.004 -5.511,0 L 0,0 Z" />
          </g>
          <g transform="translate(342.2,337.0297)">
            <path style="fill:#004098;fill-rule:nonzero;stroke:none;" d="m 0,0 0.379,0 c 2.566,0 3.246,1.781 3.305,3.125 l 2.183,0 0,-17.977 -2.656,0 0,12.372 L 0,-2.48 0,0 Z" />
          </g>
        </g>
      </g>
    </g>
  </g>
</svg>
