{
  "prepare_queue": {
    "installed": [],
    "uninstalled": []
  },
  "config_munge": {
    "files": {}
  },
  "installed_plugins": {
    "cordova-plugin-whitelist": {
      "PACKAGE_NAME": "com.example.hello"
    },
    "cordova-plugin-camera": {
      "PACKAGE_NAME": "com.example.hello"
    },
    "cordova-plugin-browsersync": {
      "PACKAGE_NAME": "com.example.hello"
    },
    "cordova-plugin-bluetooth-serial": {
      "PACKAGE_NAME": "com.example.hello"
    }
  },
  "dependent_plugins": {}
}
