{
	"info": {
		"_postman_id": "d6938edb-0568-405a-84d3-1cff8c083aa2",
		"name": "Firmar-Api - Usuarios",
		"schema": "https://schema.getpostman.com/json/collection/v2.1.0/collection.json"
	},
	"item": [
		{
			"name": "Login",
			"item": [
				{
					"name": "FIRMAR-API - Login",
					"event": [
						{
							"listen": "test",
							"script": {
								"exec": [
									"pm.environment.set(\"TOKEN\", pm.response.json().access_token);",
									"pm.environment.set(\"RTOKEN\", pm.response.json().refresh_token);"
								],
								"type": "text/javascript"
							}
						}
					],
					"request": {
						"method": "POST",
						"header": [],
						"body": {
							"mode": "raw",
							"raw": "{\n\t\"usuario\": \"usuario\",\n  \t\"password\": \"password\"\n}",
							"options": {
								"raw": {
									"language": "json"
								}
							}
						},
						"url": {
							"raw": "https://{{HOST}}/v1/login",
							"protocol": "https",
							"host": [
								"{{HOST}}"
							],
							"path": [
								"v1",
								"login"
							]
						}
					},
					"response": []
				},
				{
					"name": "FIRMAR-API - Restablecer Contraseña",
					"request": {
						"method": "POST",
						"header": [],
						"body": {
							"mode": "raw",
							"raw": "{\n\t\"token\": \"Codigo de restablecimiento enviado al email\",\n  \t\"password\": \"Contraseña\",\n  \t\"password_confirm\": \"Confirmar Contraseña\"\n}",
							"options": {
								"raw": {
									"language": "json"
								}
							}
						},
						"url": {
							"raw": "https://{{HOST}}/v1/restablecimiento",
							"protocol": "https",
							"host": [
								"{{HOST}}"
							],
							"path": [
								"v1",
								"restablecimiento"
							]
						}
					},
					"response": []
				},
				{
					"name": "FIRMAR-API - Renovar Token",
					"event": [
						{
							"listen": "test",
							"script": {
								"exec": [
									"pm.environment.set(\"TOKEN\", pm.response.json().access_token);",
									"pm.environment.set(\"RTOKEN\", pm.response.json().refresh_token);"
								],
								"type": "text/javascript"
							}
						}
					],
					"request": {
						"auth": {
							"type": "bearer",
							"bearer": [
								{
									"key": "token",
									"value": "{{RTOKEN}}",
									"type": "string"
								}
							]
						},
						"method": "POST",
						"header": [],
						"url": {
							"raw": "https://{{HOST}}/v1/refresh",
							"protocol": "https",
							"host": [
								"{{HOST}}"
							],
							"path": [
								"v1",
								"refresh"
							]
						}
					},
					"response": []
				},
				{
					"name": "FIRMAR-API - Recuperar Contraseña",
					"request": {
						"auth": {
							"type": "bearer",
							"bearer": [
								{
									"key": "token",
									"value": "{{TOKEN}}",
									"type": "string"
								}
							]
						},
						"method": "POST",
						"header": [],
						"body": {
							"mode": "raw",
							"raw": "{\n    \"email\":\"email@dominio.gob.ar\"\n}",
							"options": {
								"raw": {
									"language": "json"
								}
							}
						},
						"url": {
							"raw": "https://{{HOST}}/v1/recuperar",
							"protocol": "https",
							"host": [
								"{{HOST}}"
							],
							"path": [
								"v1",
								"recuperar"
							]
						}
					},
					"response": []
				}
			]
		},
		{
			"name": "Perfil",
			"item": [
				{
					"name": "FIRMAR-API - Cerrar Sesión Actual",
					"request": {
						"auth": {
							"type": "bearer",
							"bearer": [
								{
									"key": "token",
									"value": "{{TOKEN}}",
									"type": "string"
								}
							]
						},
						"method": "POST",
						"header": [],
						"url": {
							"raw": "https://{{HOST}}/v1/perfil/logout",
							"protocol": "https",
							"host": [
								"{{HOST}}"
							],
							"path": [
								"v1",
								"perfil",
								"logout"
							]
						}
					},
					"response": []
				},
				{
					"name": "FIRMAR-API - Cerrar Todas las Sesiones",
					"request": {
						"auth": {
							"type": "bearer",
							"bearer": [
								{
									"key": "token",
									"value": "{{TOKEN}}",
									"type": "string"
								}
							]
						},
						"method": "POST",
						"header": [],
						"url": {
							"raw": "https://{{HOST}}/v1/perfil/logouts",
							"protocol": "https",
							"host": [
								"{{HOST}}"
							],
							"path": [
								"v1",
								"perfil",
								"logouts"
							]
						}
					},
					"response": []
				},
				{
					"name": "FIRMAR-API - Modificar Mi Contraseña",
					"request": {
						"auth": {
							"type": "bearer",
							"bearer": [
								{
									"key": "token",
									"value": "{{TOKEN}}",
									"type": "string"
								}
							]
						},
						"method": "PATCH",
						"header": [],
						"body": {
							"mode": "raw",
							"raw": "{\n\t\"password\": \"Contraseña actual\",\n  \t\"nuevo_password\": \"Nueva contraseña\"\n}",
							"options": {
								"raw": {
									"language": "json"
								}
							}
						},
						"url": {
							"raw": "https://{{HOST}}/v1/perfil/password",
							"protocol": "https",
							"host": [
								"{{HOST}}"
							],
							"path": [
								"v1",
								"perfil",
								"password"
							]
						}
					},
					"response": []
				}
			]
		},
		{
			"name": "Firmar",
			"item": [
				{
					"name": "FIRMAR-API - Descargar Documento PDF",
					"protocolProfileBehavior": {
						"disableBodyPruning": true
					},
					"request": {
						"auth": {
							"type": "bearer",
							"bearer": [
								{
									"key": "token",
									"value": "{{TOKEN}}",
									"type": "string"
								}
							]
						},
						"method": "GET",
						"header": [],
						"body": {
							"mode": "raw",
							"raw": "{\n    \"IdArchivo\": \"Id_archivo\"\n}",
							"options": {
								"raw": {
									"language": "json"
								}
							}
						},
						"url": {
							"raw": "https://{{HOST}}/v1/descargar",
							"protocol": "https",
							"host": [
								"{{HOST}}"
							],
							"path": [
								"v1",
								"descargar"
							]
						}
					},
					"response": []
				},
				{
					"name": "FIRMAR-API - Firmar Documento PDF",
					"request": {
						"auth": {
							"type": "bearer",
							"bearer": [
								{
									"key": "token",
									"value": "{{TOKEN}}",
									"type": "string"
								}
							]
						},
						"method": "POST",
						"header": [],
						"body": {
							"mode": "raw",
							"raw": "{\n    \"cuil\": \"10-12345678-0\",\n    \"documento\": \"[DOCUMENTO FIRMADO EN BASE64]\",\n    \"metadata\": {\n        \"sistemaOrigen\" : \"origen\"\n        //Se pueden agregar los campos que se consideren necesarios\n    },\n    \"type\": \"tipo_documento\",\n    \"urlRedirect\": \"url_redirect\"\n}",
							"options": {
								"raw": {
									"language": "json"
								}
							}
						},
						"url": {
							"raw": "https://{{HOST}}/firmador",
							"protocol": "https",
							"host": [
								"{{HOST}}"
							],
							"path": [
								"firmador"
							]
						}
					},
					"response": []
				}
			]
		}
	]
}