{
	"info": {
		"_postman_id": "5c53bd71-1987-4e06-a9e9-26159c375bd4",
		"name": "BDU",
		"schema": "https://schema.getpostman.com/json/collection/v2.1.0/collection.json"
	},
	"item": [
		{
			"name": "Login",
			"item": [
				{
					"name": "BDU - Login",
					"event": [
						{
							"listen": "test",
							"script": {
								"exec": [
									"var json = JSON.parse(responseBody);\r",
									"pm.environment.set(\"TOKEN\", `${json.access_token}`);"
								],
								"type": "text/javascript"
							}
						}
					],
					"request": {
						"method": "POST",
						"header": [],
						"body": {
							"mode": "raw",
							"raw": "{\n\t\"usuario\": \"admin\",\n  \t\"password\": \"admin\"\n}",
							"options": {
								"raw": {
									"language": "json"
								}
							}
						},
						"url": {
							"raw": "https://{{HOST}}/v1/login",
							"protocol": "https",
							"host": [
								"{{HOST}}"
							],
							"path": [
								"v1",
								"login"
							]
						}
					},
					"response": []
				},
				{
					"name": "BDU - Registrar Nuevo Usuario",
					"request": {
						"method": "POST",
						"header": [],
						"body": {
							"mode": "raw",
							"raw": "{\n\t\"email\": \"email@dominio.gob.ar\",\n  \t\"password\": \"Password\",\n  \t\"nombre\": \"Nombre\", \n    \"apellido\": \"Apellido\",\n  \t\"usuario\": \"Usuario\",\n    \"descripcion\": \"Usuario Administrador. Clave por defecto: admin\"\n}",
							"options": {
								"raw": {
									"language": "json"
								}
							}
						},
						"url": {
							"raw": "https://{{HOST}}/v1/register",
							"protocol": "https",
							"host": [
								"{{HOST}}"
							],
							"path": [
								"v1",
								"register"
							]
						}
					},
					"response": []
				},
				{
					"name": "BDU - Restablecer Contraseña",
					"request": {
						"method": "POST",
						"header": [],
						"body": {
							"mode": "raw",
							"raw": "{\n\t\"token\": \"Codigo de restablecimiento enviado al email\",\n  \t\"password\": \"Contraseña\",\n  \t\"password_confirm\": \"Confirmar Contraseña\"\n}",
							"options": {
								"raw": {
									"language": "json"
								}
							}
						},
						"url": {
							"raw": "https://{{HOST}}/v1/restablecimiento",
							"protocol": "https",
							"host": [
								"{{HOST}}"
							],
							"path": [
								"v1",
								"restablecimiento"
							]
						}
					},
					"response": []
				},
				{
					"name": "BDU - Renovar Token",
					"request": {
						"auth": {
							"type": "bearer",
							"bearer": [
								{
									"key": "token",
									"value": "{{RTOKEN}}",
									"type": "string"
								}
							]
						},
						"method": "POST",
						"header": [],
						"url": {
							"raw": "https://{{HOST}}/v1/refresh",
							"protocol": "https",
							"host": [
								"{{HOST}}"
							],
							"path": [
								"v1",
								"refresh"
							]
						}
					},
					"response": []
				},
				{
					"name": "BDU - Recuperar contraseña",
					"request": {
						"auth": {
							"type": "bearer",
							"bearer": [
								{
									"key": "token",
									"value": "{{RTOKEN}}",
									"type": "string"
								}
							]
						},
						"method": "POST",
						"header": [],
						"body": {
							"mode": "raw",
							"raw": "{\n    \"email\":\"email@dominio.gob.ar\"\n}",
							"options": {
								"raw": {
									"language": "json"
								}
							}
						},
						"url": {
							"raw": "https://{{HOST}}/v1/recuperar",
							"protocol": "https",
							"host": [
								"{{HOST}}"
							],
							"path": [
								"v1",
								"recuperar"
							]
						}
					},
					"response": []
				}
			]
		},
		{
			"name": "Perfil",
			"item": [
				{
					"name": "BDU - Obtener Perfil de Usuario",
					"request": {
						"auth": {
							"type": "bearer",
							"bearer": [
								{
									"key": "token",
									"value": "{{TOKEN}}",
									"type": "string"
								}
							]
						},
						"method": "GET",
						"header": [],
						"url": {
							"raw": "https://{{HOST}}/v1/perfil",
							"protocol": "https",
							"host": [
								"{{HOST}}"
							],
							"path": [
								"v1",
								"perfil"
							]
						}
					},
					"response": []
				},
				{
					"name": "BDU - Modificar Perfil de Usuario",
					"protocolProfileBehavior": {
						"disabledSystemHeaders": {}
					},
					"request": {
						"auth": {
							"type": "bearer",
							"bearer": [
								{
									"key": "token",
									"value": "{{TOKEN}}",
									"type": "string"
								}
							]
						},
						"method": "PUT",
						"header": [],
						"body": {
							"mode": "raw",
							"raw": "{\r\n\t\"email\": \"email@dominio.gob.ar\",\r\n    \"nombre\": \"Nombre\",\r\n    \"apellido\": \"Apellido\",\r\n    \"usuario\": \"Usuario\",\r\n    \"descripcion\": \"Descripcion del usuario\"\r\n}",
							"options": {
								"raw": {
									"language": "json"
								}
							}
						},
						"url": {
							"raw": "https://{{HOST}}/v1/perfil",
							"protocol": "https",
							"host": [
								"{{HOST}}"
							],
							"path": [
								"v1",
								"perfil"
							]
						}
					},
					"response": []
				},
				{
					"name": "BDU - Modificar Mi Nombre",
					"protocolProfileBehavior": {
						"disabledSystemHeaders": {}
					},
					"request": {
						"auth": {
							"type": "bearer",
							"bearer": [
								{
									"key": "token",
									"value": "{{TOKEN}}",
									"type": "string"
								}
							]
						},
						"method": "PATCH",
						"header": [],
						"body": {
							"mode": "raw",
							"raw": "{\r\n    \"nombre\": \"Nuevo Nombre\"\r\n}",
							"options": {
								"raw": {
									"language": "json"
								}
							}
						},
						"url": {
							"raw": "https://{{HOST}}/v1/perfil/nombre",
							"protocol": "https",
							"host": [
								"{{HOST}}"
							],
							"path": [
								"v1",
								"perfil",
								"nombre"
							]
						}
					},
					"response": []
				},
				{
					"name": "BDU - Modificar Mi Nombre de Usuario",
					"protocolProfileBehavior": {
						"disabledSystemHeaders": {}
					},
					"request": {
						"auth": {
							"type": "bearer",
							"bearer": [
								{
									"key": "token",
									"value": "{{TOKEN}}",
									"type": "string"
								}
							]
						},
						"method": "PATCH",
						"header": [],
						"body": {
							"mode": "raw",
							"raw": "{\r\n    \"usuario\": \"Nuevo nombre de usuario\"\r\n}",
							"options": {
								"raw": {
									"language": "json"
								}
							}
						},
						"url": {
							"raw": "https://{{HOST}}/v1/perfil/usuario",
							"protocol": "https",
							"host": [
								"{{HOST}}"
							],
							"path": [
								"v1",
								"perfil",
								"usuario"
							]
						}
					},
					"response": []
				},
				{
					"name": "BDU - Modificar Mi Email",
					"protocolProfileBehavior": {
						"disabledSystemHeaders": {}
					},
					"request": {
						"auth": {
							"type": "bearer",
							"bearer": [
								{
									"key": "token",
									"value": "{{TOKEN}}",
									"type": "string"
								}
							]
						},
						"method": "PATCH",
						"header": [],
						"body": {
							"mode": "raw",
							"raw": "{\r\n    \"email\": \"email@dominio.gob.ar\"\r\n}",
							"options": {
								"raw": {
									"language": "json"
								}
							}
						},
						"url": {
							"raw": "https://{{HOST}}/v1/perfil/email",
							"protocol": "https",
							"host": [
								"{{HOST}}"
							],
							"path": [
								"v1",
								"perfil",
								"email"
							]
						}
					},
					"response": []
				},
				{
					"name": "BDU - Modificar Mi Apellido",
					"protocolProfileBehavior": {
						"disabledSystemHeaders": {}
					},
					"request": {
						"auth": {
							"type": "bearer",
							"bearer": [
								{
									"key": "token",
									"value": "{{TOKEN}}",
									"type": "string"
								}
							]
						},
						"method": "PATCH",
						"header": [],
						"body": {
							"mode": "raw",
							"raw": "{\r\n    \"apellido\": \"Nuevo Apellido\"\r\n}",
							"options": {
								"raw": {
									"language": "json"
								}
							}
						},
						"url": {
							"raw": "https://{{HOST}}/v1/perfil/apellido",
							"protocol": "https",
							"host": [
								"{{HOST}}"
							],
							"path": [
								"v1",
								"perfil",
								"apellido"
							]
						}
					},
					"response": []
				},
				{
					"name": "BDU - Modificar Mi Descripcion",
					"protocolProfileBehavior": {
						"disabledSystemHeaders": {}
					},
					"request": {
						"auth": {
							"type": "bearer",
							"bearer": [
								{
									"key": "token",
									"value": "{{TOKEN}}",
									"type": "string"
								}
							]
						},
						"method": "PATCH",
						"header": [],
						"body": {
							"mode": "raw",
							"raw": "{\r\n    \"descripcion\": \"Nueva Descripcion de usuario\"\r\n}",
							"options": {
								"raw": {
									"language": "json"
								}
							}
						},
						"url": {
							"raw": "https://{{HOST}}/v1/perfil/descripcion",
							"protocol": "https",
							"host": [
								"{{HOST}}"
							],
							"path": [
								"v1",
								"perfil",
								"descripcion"
							]
						}
					},
					"response": []
				},
				{
					"name": "BDU - Modificar Mi Contraseña",
					"protocolProfileBehavior": {
						"disabledSystemHeaders": {}
					},
					"request": {
						"auth": {
							"type": "bearer",
							"bearer": [
								{
									"key": "token",
									"value": "{{TOKEN}}",
									"type": "string"
								}
							]
						},
						"method": "PATCH",
						"header": [],
						"body": {
							"mode": "raw",
							"raw": "{\r\n\t\"password\": \"Contraseña actual\",\r\n  \t\"nuevo_password\": \"Nueva contraseña\"\r\n}",
							"options": {
								"raw": {
									"language": "json"
								}
							}
						},
						"url": {
							"raw": "https://{{HOST}}/v1/perfil/password",
							"protocol": "https",
							"host": [
								"{{HOST}}"
							],
							"path": [
								"v1",
								"perfil",
								"password"
							]
						}
					},
					"response": []
				},
				{
					"name": "BDU - Listar Rutas Accesibles por Usuario",
					"protocolProfileBehavior": {
						"disableBodyPruning": true
					},
					"request": {
						"auth": {
							"type": "bearer",
							"bearer": [
								{
									"key": "token",
									"value": "{{TOKEN}}",
									"type": "string"
								}
							]
						},
						"method": "GET",
						"header": [],
						"body": {
							"mode": "formdata",
							"formdata": [
								{
									"key": "",
									"value": "",
									"type": "text",
									"disabled": true
								}
							]
						},
						"url": {
							"raw": "https://{{HOST}}/v1/perfil/listado-rutas",
							"protocol": "https",
							"host": [
								"{{HOST}}"
							],
							"path": [
								"v1",
								"perfil",
								"listado-rutas"
							]
						}
					},
					"response": []
				},
				{
					"name": "BDU - Cerrar Sesion Actual",
					"request": {
						"auth": {
							"type": "bearer",
							"bearer": [
								{
									"key": "token",
									"value": "{{TOKEN}}",
									"type": "string"
								}
							]
						},
						"method": "POST",
						"header": [],
						"url": {
							"raw": "https://{{HOST}}/v1/logout",
							"protocol": "https",
							"host": [
								"{{HOST}}"
							],
							"path": [
								"v1",
								"logout"
							]
						}
					},
					"response": []
				},
				{
					"name": "BDU - Cerrar todas las sesiones",
					"request": {
						"auth": {
							"type": "bearer",
							"bearer": [
								{
									"key": "token",
									"value": "{{TOKEN}}",
									"type": "string"
								}
							]
						},
						"method": "POST",
						"header": [],
						"url": {
							"raw": "https://{{HOST}}/v1/logouts",
							"protocol": "https",
							"host": [
								"{{HOST}}"
							],
							"path": [
								"v1",
								"logouts"
							]
						}
					},
					"response": []
				}
			]
		},
		{
			"name": "Admin",
			"item": [
				{
					"name": "Usuarios",
					"item": [
						{
							"name": "BDU - Obtener Usuarios",
							"request": {
								"auth": {
									"type": "bearer",
									"bearer": [
										{
											"key": "token",
											"value": "{{TOKEN}}",
											"type": "string"
										}
									]
								},
								"method": "GET",
								"header": [],
								"url": {
									"raw": "https://{{HOST}}/v1/admin/usuarios",
									"protocol": "https",
									"host": [
										"{{HOST}}"
									],
									"path": [
										"v1",
										"admin",
										"usuarios"
									]
								}
							},
							"response": []
						},
						{
							"name": "BDU - Activar un usuario",
							"request": {
								"auth": {
									"type": "bearer",
									"bearer": [
										{
											"key": "token",
											"value": "{{TOKEN}}",
											"type": "string"
										}
									]
								},
								"method": "PUT",
								"header": [],
								"body": {
									"mode": "raw",
									"raw": "{\n    \"id_usuario\":\"Id del usuario\"\n}",
									"options": {
										"raw": {
											"language": "json"
										}
									}
								},
								"url": {
									"raw": "https://{{HOST}}/v1/admin/usuarios/habilitado",
									"protocol": "https",
									"host": [
										"{{HOST}}"
									],
									"path": [
										"v1",
										"admin",
										"usuarios",
										"habilitado"
									]
								}
							},
							"response": []
						},
						{
							"name": "BDU - Desactivar un usuario",
							"request": {
								"auth": {
									"type": "bearer",
									"bearer": [
										{
											"key": "token",
											"value": "{{TOKEN}}",
											"type": "string"
										}
									]
								},
								"method": "PUT",
								"header": [],
								"body": {
									"mode": "raw",
									"raw": "{\n    \"id_usuario\":\"Id del usuario\"\n}",
									"options": {
										"raw": {
											"language": "json"
										}
									}
								},
								"url": {
									"raw": "https://{{HOST}}/v1/admin/usuarios/deshabilitado",
									"protocol": "https",
									"host": [
										"{{HOST}}"
									],
									"path": [
										"v1",
										"admin",
										"usuarios",
										"deshabilitado"
									]
								}
							},
							"response": []
						},
						{
							"name": "BDU - Crear nuevo Usuario",
							"protocolProfileBehavior": {
								"disabledSystemHeaders": {}
							},
							"request": {
								"auth": {
									"type": "bearer",
									"bearer": [
										{
											"key": "token",
											"value": "{{TOKEN}}",
											"type": "string"
										}
									]
								},
								"method": "POST",
								"header": [],
								"body": {
									"mode": "raw",
									"raw": "{\r\n\t\"email\": \"correo@dominio.gob.ar\",\r\n  \t\"password\": \"Contraseña\",\r\n  \t\"nombre\": \"Nombre\", \r\n\t\"apellido\": \"Apellido\",\r\n  \t\"usuario\": \"Usuario\",\r\n  \t\"descripcion\": \"Descripcion de usuario\"\r\n}",
									"options": {
										"raw": {
											"language": "json"
										}
									}
								},
								"url": {
									"raw": "https://{{HOST}}/v1/admin/usuarios",
									"protocol": "https",
									"host": [
										"{{HOST}}"
									],
									"path": [
										"v1",
										"admin",
										"usuarios"
									]
								}
							},
							"response": []
						},
						{
							"name": "BDU - Obtener Usuario por email",
							"request": {
								"auth": {
									"type": "bearer",
									"bearer": [
										{
											"key": "token",
											"value": "{{TOKEN}}",
											"type": "string"
										}
									]
								},
								"method": "GET",
								"header": [],
								"url": {
									"raw": "https://{{HOST}}/v1/admin/usuarios/email/{email}",
									"protocol": "https",
									"host": [
										"{{HOST}}"
									],
									"path": [
										"v1",
										"admin",
										"usuarios",
										"email",
										"{email}"
									]
								}
							},
							"response": []
						},
						{
							"name": "BDU - Obtener Usuario por Nombre",
							"protocolProfileBehavior": {
								"strictSSL": true
							},
							"request": {
								"auth": {
									"type": "bearer",
									"bearer": [
										{
											"key": "token",
											"value": "{{TOKEN}}",
											"type": "string"
										}
									]
								},
								"method": "GET",
								"header": [],
								"url": {
									"raw": "https://{{HOST}}/v1/admin/usuarios/usuario/{nombre}",
									"protocol": "https",
									"host": [
										"{{HOST}}"
									],
									"path": [
										"v1",
										"admin",
										"usuarios",
										"usuario",
										"{nombre}"
									]
								}
							},
							"response": []
						},
						{
							"name": "BDU - Obtener Usuario por ID",
							"request": {
								"auth": {
									"type": "bearer",
									"bearer": [
										{
											"key": "token",
											"value": "{{TOKEN}}",
											"type": "string"
										}
									]
								},
								"method": "GET",
								"header": [],
								"url": {
									"raw": "https://{{HOST}}/v1/admin/usuarios/{id_usuario}",
									"protocol": "https",
									"host": [
										"{{HOST}}"
									],
									"path": [
										"v1",
										"admin",
										"usuarios",
										"{id_usuario}"
									]
								}
							},
							"response": []
						},
						{
							"name": "BDU - Eliminar Usuario",
							"request": {
								"auth": {
									"type": "bearer",
									"bearer": [
										{
											"key": "token",
											"value": "{{TOKEN}}",
											"type": "string"
										}
									]
								},
								"method": "DELETE",
								"header": [],
								"url": {
									"raw": "https://{{HOST}}/v1/admin/usuarios/{id_usuario}",
									"protocol": "https",
									"host": [
										"{{HOST}}"
									],
									"path": [
										"v1",
										"admin",
										"usuarios",
										"{id_usuario}"
									]
								}
							},
							"response": []
						},
						{
							"name": "BDU - Modificar Usuario",
							"protocolProfileBehavior": {
								"disabledSystemHeaders": {}
							},
							"request": {
								"auth": {
									"type": "bearer",
									"bearer": [
										{
											"key": "token",
											"value": "{{TOKEN}}",
											"type": "string"
										}
									]
								},
								"method": "PUT",
								"header": [],
								"body": {
									"mode": "raw",
									"raw": "{\r\n\t\"email\": \"correo@dominio.gob.ar\",\r\n  \t\"nombre\": \"Nombre\", \r\n\t\"apellido\": \"Apellido\",\r\n  \t\"usuario\": \"Usuario\",\r\n  \t\"descripcion\": \"Descripcion de usuario\"\r\n}",
									"options": {
										"raw": {
											"language": "json"
										}
									}
								},
								"url": {
									"raw": "https://{{HOST}}/v1/admin/usuarios/{id_usuario}",
									"protocol": "https",
									"host": [
										"{{HOST}}"
									],
									"path": [
										"v1",
										"admin",
										"usuarios",
										"{id_usuario}"
									]
								}
							},
							"response": []
						},
						{
							"name": "BDU - Modificar Usuario - Nombre",
							"protocolProfileBehavior": {
								"disabledSystemHeaders": {}
							},
							"request": {
								"auth": {
									"type": "bearer",
									"bearer": [
										{
											"key": "token",
											"value": "{{TOKEN}}",
											"type": "string"
										}
									]
								},
								"method": "PATCH",
								"header": [],
								"body": {
									"mode": "raw",
									"raw": "{\r\n  \t\"nombre\": \"Nuevo nombre\"\r\n}",
									"options": {
										"raw": {
											"language": "json"
										}
									}
								},
								"url": {
									"raw": "https://{{HOST}}/v1/admin/usuarios/{id_usuario}/nombre",
									"protocol": "https",
									"host": [
										"{{HOST}}"
									],
									"path": [
										"v1",
										"admin",
										"usuarios",
										"{id_usuario}",
										"nombre"
									]
								}
							},
							"response": []
						},
						{
							"name": "BDU - Modificar Usuario - Email",
							"protocolProfileBehavior": {
								"disabledSystemHeaders": {}
							},
							"request": {
								"auth": {
									"type": "bearer",
									"bearer": [
										{
											"key": "token",
											"value": "{{TOKEN}}",
											"type": "string"
										}
									]
								},
								"method": "PATCH",
								"header": [],
								"body": {
									"mode": "raw",
									"raw": "{\r\n  \t\"email\": \"correo@dominio.gob.ar\"\r\n}",
									"options": {
										"raw": {
											"language": "json"
										}
									}
								},
								"url": {
									"raw": "https://{{HOST}}/v1/admin/usuarios/{id_usuario}/email",
									"protocol": "https",
									"host": [
										"{{HOST}}"
									],
									"path": [
										"v1",
										"admin",
										"usuarios",
										"{id_usuario}",
										"email"
									]
								}
							},
							"response": []
						},
						{
							"name": "BDU - Modificar Usuario - Apellido",
							"protocolProfileBehavior": {
								"disabledSystemHeaders": {}
							},
							"request": {
								"auth": {
									"type": "bearer",
									"bearer": [
										{
											"key": "token",
											"value": "{{TOKEN}}",
											"type": "string"
										}
									]
								},
								"method": "PATCH",
								"header": [],
								"body": {
									"mode": "raw",
									"raw": "{\r\n  \t\"apellido\": \"Nuevo apeliido\"\r\n}",
									"options": {
										"raw": {
											"language": "json"
										}
									}
								},
								"url": {
									"raw": "https://{{HOST}}/v1/admin/usuarios/{id_usuario}/apellido",
									"protocol": "https",
									"host": [
										"{{HOST}}"
									],
									"path": [
										"v1",
										"admin",
										"usuarios",
										"{id_usuario}",
										"apellido"
									]
								}
							},
							"response": []
						},
						{
							"name": "BDU - Modificar Usuario - Nombre Usuario",
							"protocolProfileBehavior": {
								"disabledSystemHeaders": {}
							},
							"request": {
								"auth": {
									"type": "bearer",
									"bearer": [
										{
											"key": "token",
											"value": "{{TOKEN}}",
											"type": "string"
										}
									]
								},
								"method": "PATCH",
								"header": [],
								"body": {
									"mode": "raw",
									"raw": "{\r\n  \t\"usuario\": \"Nuevo nombre de usuario\"\r\n}",
									"options": {
										"raw": {
											"language": "json"
										}
									}
								},
								"url": {
									"raw": "https://{{HOST}}/v1/admin/usuarios/{id_usuario}/usuario",
									"protocol": "https",
									"host": [
										"{{HOST}}"
									],
									"path": [
										"v1",
										"admin",
										"usuarios",
										"{id_usuario}",
										"usuario"
									]
								}
							},
							"response": []
						},
						{
							"name": "BDU - Modificar Usuario - Descripcion",
							"protocolProfileBehavior": {
								"disabledSystemHeaders": {}
							},
							"request": {
								"auth": {
									"type": "bearer",
									"bearer": [
										{
											"key": "token",
											"value": "{{TOKEN}}",
											"type": "string"
										}
									]
								},
								"method": "PATCH",
								"header": [],
								"body": {
									"mode": "raw",
									"raw": "{\r\n  \t\"descripcion\": \"Usuario de prueba\"\r\n}",
									"options": {
										"raw": {
											"language": "json"
										}
									}
								},
								"url": {
									"raw": "https://{{HOST}}/v1/admin/usuarios/{id_usuario}/descripcion",
									"protocol": "https",
									"host": [
										"{{HOST}}"
									],
									"path": [
										"v1",
										"admin",
										"usuarios",
										"{id_usuario}",
										"descripcion"
									]
								}
							},
							"response": []
						},
						{
							"name": "BDU - Modificar Contraseña de Usuario",
							"protocolProfileBehavior": {
								"disabledSystemHeaders": {}
							},
							"request": {
								"auth": {
									"type": "bearer",
									"bearer": [
										{
											"key": "token",
											"value": "{{TOKEN}}",
											"type": "string"
										}
									]
								},
								"method": "PATCH",
								"header": [],
								"body": {
									"mode": "raw",
									"raw": "{\r\n\t\"password\": \"Nueva Contraseña\"\r\n}",
									"options": {
										"raw": {
											"language": "json"
										}
									}
								},
								"url": {
									"raw": "https://{{HOST}}/v1/admin/usuario/{id_usuario}/password",
									"protocol": "https",
									"host": [
										"{{HOST}}"
									],
									"path": [
										"v1",
										"admin",
										"usuario",
										"{id_usuario}",
										"password"
									]
								}
							},
							"response": []
						},
						{
							"name": "Obtener Usuario por apellido",
							"request": {
								"auth": {
									"type": "bearer",
									"bearer": [
										{
											"key": "token",
											"value": "{{TOKEN}}",
											"type": "string"
										}
									]
								},
								"method": "GET",
								"header": [],
								"url": {
									"raw": "https://{{HOST}}/v1/admin/usuarios/apellido/{Apellido}",
									"protocol": "https",
									"host": [
										"{{HOST}}"
									],
									"path": [
										"v1",
										"admin",
										"usuarios",
										"apellido",
										"{Apellido}"
									]
								}
							},
							"response": []
						}
					]
				},
				{
					"name": "Grupos",
					"item": [
						{
							"name": "BDU - Crear Grupo",
							"protocolProfileBehavior": {
								"disabledSystemHeaders": {}
							},
							"request": {
								"auth": {
									"type": "bearer",
									"bearer": [
										{
											"key": "token",
											"value": "{{TOKEN}}",
											"type": "string"
										}
									]
								},
								"method": "POST",
								"header": [],
								"body": {
									"mode": "raw",
									"raw": "{\r\n\t\"nombre\": \"Nombre del grupo\",\r\n  \t\"descripcion\": \"Descripción del grupo\"\r\n}",
									"options": {
										"raw": {
											"language": "json"
										}
									}
								},
								"url": {
									"raw": "https://{{HOST}}/v1/admin/grupos",
									"protocol": "https",
									"host": [
										"{{HOST}}"
									],
									"path": [
										"v1",
										"admin",
										"grupos"
									]
								}
							},
							"response": []
						},
						{
							"name": "BDU - Modificar Grupo",
							"protocolProfileBehavior": {
								"disabledSystemHeaders": {}
							},
							"request": {
								"auth": {
									"type": "bearer",
									"bearer": [
										{
											"key": "token",
											"value": "{{TOKEN}}",
											"type": "string"
										}
									]
								},
								"method": "PUT",
								"header": [],
								"body": {
									"mode": "raw",
									"raw": "{\r\n\t\"nombre_grupo\": \"Nuevo nombre del Grupo\",\r\n  \t\"descripcion\": \"Nueva descripcion del Grupo\"\r\n}",
									"options": {
										"raw": {
											"language": "json"
										}
									}
								},
								"url": {
									"raw": "https://{{HOST}}/v1/admin/grupos/{id_Grupo}",
									"protocol": "https",
									"host": [
										"{{HOST}}"
									],
									"path": [
										"v1",
										"admin",
										"grupos",
										"{id_Grupo}"
									]
								}
							},
							"response": []
						},
						{
							"name": "BDU - Eliminar Grupo",
							"request": {
								"auth": {
									"type": "bearer",
									"bearer": [
										{
											"key": "token",
											"value": "{{TOKEN}}",
											"type": "string"
										}
									]
								},
								"method": "DELETE",
								"header": [],
								"url": {
									"raw": "https://{{HOST}}/v1/admin/grupos/{id_grupo}",
									"protocol": "https",
									"host": [
										"{{HOST}}"
									],
									"path": [
										"v1",
										"admin",
										"grupos",
										"{id_grupo}"
									]
								}
							},
							"response": []
						},
						{
							"name": "BDU - Obtener Grupos",
							"request": {
								"auth": {
									"type": "bearer",
									"bearer": [
										{
											"key": "token",
											"value": "{{TOKEN}}",
											"type": "string"
										}
									]
								},
								"method": "GET",
								"header": [],
								"url": {
									"raw": "https://{{HOST}}/v1/admin/grupos",
									"protocol": "https",
									"host": [
										"{{HOST}}"
									],
									"path": [
										"v1",
										"admin",
										"grupos"
									]
								}
							},
							"response": []
						},
						{
							"name": "BDU - Obtener Grupo por ID",
							"request": {
								"auth": {
									"type": "bearer",
									"bearer": [
										{
											"key": "token",
											"value": "{{TOKEN}}",
											"type": "string"
										}
									]
								},
								"method": "GET",
								"header": [],
								"url": {
									"raw": "https://{{HOST}}/v1/admin/grupos/{id_grupo}",
									"protocol": "https",
									"host": [
										"{{HOST}}"
									],
									"path": [
										"v1",
										"admin",
										"grupos",
										"{id_grupo}"
									]
								}
							},
							"response": []
						},
						{
							"name": "BDU - Obtener Grupo por su nombre",
							"request": {
								"auth": {
									"type": "bearer",
									"bearer": [
										{
											"key": "token",
											"value": "{{TOKEN}}",
											"type": "string"
										}
									]
								},
								"method": "GET",
								"header": [],
								"url": {
									"raw": "https://{{HOST}}/v1/admin/grupos/nombre/{nombre del grupo}",
									"protocol": "https",
									"host": [
										"{{HOST}}"
									],
									"path": [
										"v1",
										"admin",
										"grupos",
										"nombre",
										"{nombre del grupo}"
									]
								}
							},
							"response": []
						},
						{
							"name": "BDU - Agregar Usuario a Grupo",
							"protocolProfileBehavior": {
								"disabledSystemHeaders": {}
							},
							"request": {
								"auth": {
									"type": "bearer",
									"bearer": [
										{
											"key": "token",
											"value": "{{TOKEN}}",
											"type": "string"
										}
									]
								},
								"method": "POST",
								"header": [],
								"body": {
									"mode": "raw",
									"raw": "{\r\n    \"flagHabilitado\": \"S\"\r\n}",
									"options": {
										"raw": {
											"language": "json"
										}
									}
								},
								"url": {
									"raw": "https://{{HOST}}/v1/admin/grupos/{id_grupo}/usuarios/{id_usuario}",
									"protocol": "https",
									"host": [
										"{{HOST}}"
									],
									"path": [
										"v1",
										"admin",
										"grupos",
										"{id_grupo}",
										"usuarios",
										"{id_usuario}"
									]
								}
							},
							"response": []
						},
						{
							"name": "BDU - Eliminar Usuario de Grupo",
							"protocolProfileBehavior": {
								"disabledSystemHeaders": {}
							},
							"request": {
								"auth": {
									"type": "bearer",
									"bearer": [
										{
											"key": "token",
											"value": "{{TOKEN}}",
											"type": "string"
										}
									]
								},
								"method": "DELETE",
								"header": [],
								"body": {
									"mode": "raw",
									"raw": "",
									"options": {
										"raw": {
											"language": "json"
										}
									}
								},
								"url": {
									"raw": "https://{{HOST}}/v1/admin/grupos/{id_grupo}/usuarios/}{id_usuario}",
									"protocol": "https",
									"host": [
										"{{HOST}}"
									],
									"path": [
										"v1",
										"admin",
										"grupos",
										"{id_grupo}",
										"usuarios",
										"}{id_usuario}"
									]
								}
							},
							"response": []
						},
						{
							"name": "BDU - Obtener grupos con usuarios",
							"request": {
								"auth": {
									"type": "bearer",
									"bearer": [
										{
											"key": "token",
											"value": "{{TOKEN}}",
											"type": "string"
										}
									]
								},
								"method": "GET",
								"header": [],
								"url": {
									"raw": "https://{{HOST}}/v1/admin/grupos/usuarios",
									"protocol": "https",
									"host": [
										"{{HOST}}"
									],
									"path": [
										"v1",
										"admin",
										"grupos",
										"usuarios"
									]
								}
							},
							"response": []
						},
						{
							"name": "BDU - Obtener Usuarios de un Grupo",
							"request": {
								"auth": {
									"type": "bearer",
									"bearer": [
										{
											"key": "token",
											"value": "{{TOKEN}}",
											"type": "string"
										}
									]
								},
								"method": "GET",
								"header": [],
								"url": {
									"raw": "https://{{HOST}}/v1/admin/grupos/{id_gruṕos}/usuarios",
									"protocol": "https",
									"host": [
										"{{HOST}}"
									],
									"path": [
										"v1",
										"admin",
										"grupos",
										"{id_gruṕos}",
										"usuarios"
									]
								}
							},
							"response": []
						},
						{
							"name": "BDU - Obtener Grupos de un Usuario",
							"request": {
								"auth": {
									"type": "bearer",
									"bearer": [
										{
											"key": "token",
											"value": "{{TOKEN}}",
											"type": "string"
										}
									]
								},
								"method": "GET",
								"header": [],
								"url": {
									"raw": "https://{{HOST}}/v1/admin/usuarios/{id_usuario}/grupos",
									"protocol": "https",
									"host": [
										"{{HOST}}"
									],
									"path": [
										"v1",
										"admin",
										"usuarios",
										"{id_usuario}",
										"grupos"
									]
								}
							},
							"response": []
						}
					]
				},
				{
					"name": "Rutas",
					"item": [
						{
							"name": "BDU - Crear Ruta",
							"protocolProfileBehavior": {
								"disabledSystemHeaders": {}
							},
							"request": {
								"auth": {
									"type": "bearer",
									"bearer": [
										{
											"key": "token",
											"value": "{{TOKEN}}",
											"type": "string"
										}
									]
								},
								"method": "POST",
								"header": [],
								"body": {
									"mode": "raw",
									"raw": "{\r\n\t\"ruta\": \"/v1/Nueva Ruta\",\r\n  \t\"descripcion\": \"Descripcion de la nueva ruta\"\r\n}",
									"options": {
										"raw": {
											"language": "json"
										}
									}
								},
								"url": {
									"raw": "https://{{HOST}}/v1/admin/rutas",
									"protocol": "https",
									"host": [
										"{{HOST}}"
									],
									"path": [
										"v1",
										"admin",
										"rutas"
									]
								}
							},
							"response": []
						},
						{
							"name": "BDU - Obtener Rutas",
							"request": {
								"auth": {
									"type": "bearer",
									"bearer": [
										{
											"key": "token",
											"value": "{{TOKEN}}",
											"type": "string"
										}
									]
								},
								"method": "GET",
								"header": [],
								"url": {
									"raw": "https://{{HOST}}/v1/admin/rutas",
									"protocol": "https",
									"host": [
										"{{HOST}}"
									],
									"path": [
										"v1",
										"admin",
										"rutas"
									]
								}
							},
							"response": []
						},
						{
							"name": "BDU - Obtener Ruta por ID",
							"protocolProfileBehavior": {
								"disableBodyPruning": true
							},
							"request": {
								"auth": {
									"type": "bearer",
									"bearer": [
										{
											"key": "token",
											"value": "{{TOKEN}}",
											"type": "string"
										}
									]
								},
								"method": "GET",
								"header": [],
								"body": {
									"mode": "formdata",
									"formdata": [
										{
											"key": "",
											"value": "",
											"type": "text",
											"disabled": true
										}
									]
								},
								"url": {
									"raw": "https://{{HOST}}/v1/admin/rutas/{id_ruta}",
									"protocol": "https",
									"host": [
										"{{HOST}}"
									],
									"path": [
										"v1",
										"admin",
										"rutas",
										"{id_ruta}"
									]
								}
							},
							"response": []
						},
						{
							"name": "BDU - Eliminar Ruta",
							"request": {
								"auth": {
									"type": "bearer",
									"bearer": [
										{
											"key": "token",
											"value": "{{TOKEN}}",
											"type": "string"
										}
									]
								},
								"method": "DELETE",
								"header": [],
								"body": {
									"mode": "formdata",
									"formdata": []
								},
								"url": {
									"raw": "https://{{HOST}}/v1/admin/rutas/{id_ruta}",
									"protocol": "https",
									"host": [
										"{{HOST}}"
									],
									"path": [
										"v1",
										"admin",
										"rutas",
										"{id_ruta}"
									]
								}
							},
							"response": []
						},
						{
							"name": "BDU - Eliminar Ruta de un Grupo",
							"protocolProfileBehavior": {
								"disabledSystemHeaders": {}
							},
							"request": {
								"auth": {
									"type": "bearer",
									"bearer": [
										{
											"key": "token",
											"value": "{{TOKEN}}",
											"type": "string"
										}
									]
								},
								"method": "DELETE",
								"header": [],
								"body": {
									"mode": "raw",
									"raw": "{\n    \"metodo_acceso\":\"GET\"\n}",
									"options": {
										"raw": {
											"language": "json"
										}
									}
								},
								"url": {
									"raw": "https://{{HOST}}/v1/admin/grupos/{id_grupo}/rutas/{id_ruta}",
									"protocol": "https",
									"host": [
										"{{HOST}}"
									],
									"path": [
										"v1",
										"admin",
										"grupos",
										"{id_grupo}",
										"rutas",
										"{id_ruta}"
									]
								}
							},
							"response": []
						},
						{
							"name": "BDU - Eliminar Ruta por Metodo (3 parametros)",
							"request": {
								"auth": {
									"type": "bearer",
									"bearer": [
										{
											"key": "token",
											"value": "{{TOKEN}}",
											"type": "string"
										}
									]
								},
								"method": "DELETE",
								"header": [],
								"body": {
									"mode": "raw",
									"raw": "{\n    \"id_grupo\": 1,\n    \"id_ruta\": 36,\n    \"metodo_acceso\": \"DELETE\"\n}",
									"options": {
										"raw": {
											"language": "json"
										}
									}
								},
								"url": {
									"raw": "https://{{HOST}}/v1/admin/rutasmetodo",
									"protocol": "https",
									"host": [
										"{{HOST}}"
									],
									"path": [
										"v1",
										"admin",
										"rutasmetodo"
									]
								}
							},
							"response": []
						},
						{
							"name": "BDU - Eliminar Ruta por Metodo (pk tabla)",
							"request": {
								"auth": {
									"type": "bearer",
									"bearer": [
										{
											"key": "token",
											"value": "{{TOKEN}}",
											"type": "string"
										}
									]
								},
								"method": "DELETE",
								"header": [],
								"body": {
									"mode": "raw",
									"raw": ""
								},
								"url": {
									"raw": "https://{{HOST}}/v1/admin/rutasmetodo/{id_gruporutametodo}",
									"protocol": "https",
									"host": [
										"{{HOST}}"
									],
									"path": [
										"v1",
										"admin",
										"rutasmetodo",
										"{id_gruporutametodo}"
									]
								}
							},
							"response": []
						},
						{
							"name": "BDU - Modificar Ruta",
							"protocolProfileBehavior": {
								"disabledSystemHeaders": {}
							},
							"request": {
								"auth": {
									"type": "bearer",
									"bearer": [
										{
											"key": "token",
											"value": "{{TOKEN}}",
											"type": "string"
										},
										{
											"key": "password",
											"value": "{{TOKEN}}",
											"type": "string"
										}
									]
								},
								"method": "PUT",
								"header": [],
								"body": {
									"mode": "raw",
									"raw": "{\r\n\t\"ruta\": \"ruta/{id}\",\r\n  \t\"descripcion\": \"descripcion de la ruta\"\r\n}",
									"options": {
										"raw": {
											"language": "json"
										}
									}
								},
								"url": {
									"raw": "https://{{HOST}}/v1/admin/rutas/{id_ruta}",
									"protocol": "https",
									"host": [
										"{{HOST}}"
									],
									"path": [
										"v1",
										"admin",
										"rutas",
										"{id_ruta}"
									]
								}
							},
							"response": []
						},
						{
							"name": "BDU - Agregar Ruta a un Grupo",
							"protocolProfileBehavior": {
								"disabledSystemHeaders": {}
							},
							"request": {
								"auth": {
									"type": "bearer",
									"bearer": [
										{
											"key": "token",
											"value": "{{TOKEN}}",
											"type": "string"
										}
									]
								},
								"method": "POST",
								"header": [],
								"body": {
									"mode": "raw",
									"raw": "{\r\n    \"metodoAcceso\": \"Metodo que utilizara: PUT, GET, PATCH, PUT, DELETE\",\r\n    \"flagHabilitado\": \"S\",\r\n    \"descripcion\": \"descripcion de la ruta\"\r\n}",
									"options": {
										"raw": {
											"language": "json"
										}
									}
								},
								"url": {
									"raw": "https://{{HOST}}/v1/admin/grupos/4/rutas/6",
									"protocol": "https",
									"host": [
										"{{HOST}}"
									],
									"path": [
										"v1",
										"admin",
										"grupos",
										"4",
										"rutas",
										"6"
									]
								}
							},
							"response": []
						},
						{
							"name": "BDU - Obtener todos los grupos con rutas",
							"request": {
								"auth": {
									"type": "bearer",
									"bearer": [
										{
											"key": "token",
											"value": "{{TOKEN}}",
											"type": "string"
										}
									]
								},
								"method": "GET",
								"header": [],
								"url": {
									"raw": "https://{{HOST}}/v1/admin/grupos/rutas",
									"protocol": "https",
									"host": [
										"{{HOST}}"
									],
									"path": [
										"v1",
										"admin",
										"grupos",
										"rutas"
									]
								}
							},
							"response": []
						},
						{
							"name": "BDU - Obtener Rutas de un Grupo",
							"request": {
								"auth": {
									"type": "bearer",
									"bearer": [
										{
											"key": "token",
											"value": "{{TOKEN}}",
											"type": "string"
										}
									]
								},
								"method": "GET",
								"header": [],
								"url": {
									"raw": "https://{{HOST}}/v1/admin/grupos/{id_grupo}/rutas",
									"protocol": "https",
									"host": [
										"{{HOST}}"
									],
									"path": [
										"v1",
										"admin",
										"grupos",
										"{id_grupo}",
										"rutas"
									]
								}
							},
							"response": []
						},
						{
							"name": "BDU - Obtener Grupos de una Ruta",
							"request": {
								"auth": {
									"type": "bearer",
									"bearer": [
										{
											"key": "token",
											"value": "{{TOKEN}}",
											"type": "string"
										}
									]
								},
								"method": "GET",
								"header": [],
								"url": {
									"raw": "https://{{HOST}}/v1/admin/rutas/{id_ruta}/grupos",
									"protocol": "https",
									"host": [
										"{{HOST}}"
									],
									"path": [
										"v1",
										"admin",
										"rutas",
										"{id_ruta}",
										"grupos"
									]
								}
							},
							"response": []
						}
					]
				}
			]
		}
	]
}
