%YAML 1.1
%TAG !u! tag:unity3d.com,2011:
--- !u!114 &11400000
MonoBehaviour:
  m_ObjectHideFlags: 0
  m_CorrespondingSourceObject: {fileID: 0}
  m_PrefabInstance: {fileID: 0}
  m_PrefabAsset: {fileID: 0}
  m_GameObject: {fileID: 0}
  m_Enabled: 1
  m_EditorHideFlags: 0
  m_Script: {fileID: 11500000, guid: 145f2e9e71e67a84d93d5a5cbff72e19, type: 3}
  m_Name: Minion_3
  m_EditorClassIdentifier: 
  name: pap'and'oil
  Portrait: {fileID: 21300000, guid: 99891eaa6fd2a2649840fede914fe01b, type: 3}
  Life: 3
  Attack: 1
