-- Merging decision tree log ---
provider#android.support.v4.content.FileProvider
INJECTED from /Users/toni/Desktop/mobile-app-eperformance/app/src/main/AndroidManifest.xml:124:9-132:20
	android:grantUriPermissions
		ADDED from /Users/toni/Desktop/mobile-app-eperformance/app/src/main/AndroidManifest.xml:128:13-47
	android:authorities
		INJECTED from /Users/toni/Desktop/mobile-app-eperformance/app/src/main/AndroidManifest.xml
		ADDED from /Users/toni/Desktop/mobile-app-eperformance/app/src/main/AndroidManifest.xml:126:13-60
	android:exported
		ADDED from /Users/toni/Desktop/mobile-app-eperformance/app/src/main/AndroidManifest.xml:127:13-37
	android:name
		ADDED from /Users/toni/Desktop/mobile-app-eperformance/app/src/main/AndroidManifest.xml:125:13-67
manifest
ADDED from /Users/toni/Desktop/mobile-app-eperformance/app/src/main/AndroidManifest.xml:2:1-136:12
INJECTED from /Users/toni/Desktop/mobile-app-eperformance/app/src/main/AndroidManifest.xml:2:1-136:12
INJECTED from /Users/toni/Desktop/mobile-app-eperformance/app/src/main/AndroidManifest.xml:2:1-136:12
INJECTED from /Users/toni/Desktop/mobile-app-eperformance/app/src/main/AndroidManifest.xml:2:1-136:12
MERGED from [com.google.firebase:firebase-core:11.0.4] /Users/toni/.gradle/caches/transforms-2/files-2.1/c04b2a4a2b54ddd628d96d651ac90379/firebase-core-11.0.4/AndroidManifest.xml:2:1-6:12
MERGED from [com.android.support.constraint:constraint-layout:1.0.2] /Users/toni/.gradle/caches/transforms-2/files-2.1/a820c02b64b1d0ef710388d46f9b7aa6/constraint-layout-1.0.2/AndroidManifest.xml:2:1-11:12
MERGED from [com.android.support:design:22.2.0] /Users/toni/.gradle/caches/transforms-2/files-2.1/7a605ed841c05abab4a688613094f768/design-22.2.0/AndroidManifest.xml:17:1-24:12
MERGED from [com.android.support:appcompat-v7:22.2.0] /Users/toni/.gradle/caches/transforms-2/files-2.1/dc044531f6dbd908e4ad63c1707bf147/appcompat-v7-22.2.0/AndroidManifest.xml:17:1-24:12
MERGED from [com.android.support:recyclerview-v7:22.2.0] /Users/toni/.gradle/caches/transforms-2/files-2.1/040597d2010986458b30033e13b2bf84/recyclerview-v7-22.2.0/AndroidManifest.xml:17:1-22:12
MERGED from [com.google.firebase:firebase-messaging:11.0.4] /Users/toni/.gradle/caches/transforms-2/files-2.1/afd02a6774fd2a273cc89f6dc44f635c/firebase-messaging-11.0.4/AndroidManifest.xml:16:1-30:12
MERGED from [com.google.android.gms:play-services-ads:11.0.4] /Users/toni/.gradle/caches/transforms-2/files-2.1/a1c5c559252dad87aa75d4c887b558d1/play-services-ads-11.0.4/AndroidManifest.xml:16:1-18:12
MERGED from [com.google.android.gms:play-services-location:11.0.4] /Users/toni/.gradle/caches/transforms-2/files-2.1/ddc2d76bba015527c3786df731c4e999/play-services-location-11.0.4/AndroidManifest.xml:2:1-5:12
MERGED from [com.google.firebase:firebase-analytics:11.0.4] /Users/toni/.gradle/caches/transforms-2/files-2.1/21f41f56f291300a47d6c956a40c205d/firebase-analytics-11.0.4/AndroidManifest.xml:16:1-35:12
MERGED from [com.google.firebase:firebase-analytics-impl:11.0.4] /Users/toni/.gradle/caches/transforms-2/files-2.1/3e6c1acfda79bc19536aa0bcf5e44bf0/firebase-analytics-impl-11.0.4/AndroidManifest.xml:16:1-29:12
MERGED from [com.google.firebase:firebase-iid:11.0.4] /Users/toni/.gradle/caches/transforms-2/files-2.1/b473bf03b92bdec01d0f65e4f3f3a1ad/firebase-iid-11.0.4/AndroidManifest.xml:16:1-50:12
MERGED from [com.google.firebase:firebase-common:11.0.4] /Users/toni/.gradle/caches/transforms-2/files-2.1/4b1eba66e4e552fed9e7b1205d4b065a/firebase-common-11.0.4/AndroidManifest.xml:2:1-8:12
MERGED from [com.google.android.gms:play-services-ads-lite:11.0.4] /Users/toni/.gradle/caches/transforms-2/files-2.1/df68d9873d2a6faa3088b073efa14849/play-services-ads-lite-11.0.4/AndroidManifest.xml:16:1-27:12
MERGED from [com.google.android.gms:play-services-clearcut:11.0.4] /Users/toni/.gradle/caches/transforms-2/files-2.1/593882478e0d6b313177ff0e37e7c4cb/play-services-clearcut-11.0.4/AndroidManifest.xml:16:1-19:12
MERGED from [com.google.android.gms:play-services-safetynet:11.0.4] /Users/toni/.gradle/caches/transforms-2/files-2.1/795dd1e28bdb1d374fddf0de5dc029aa/play-services-safetynet-11.0.4/AndroidManifest.xml:16:1-19:12
MERGED from [com.google.android.gms:play-services-base:11.0.4] /Users/toni/.gradle/caches/transforms-2/files-2.1/ab68c9472975602043b76751eb765750/play-services-base-11.0.4/AndroidManifest.xml:16:1-21:12
MERGED from [com.google.android.gms:play-services-gass:11.0.4] /Users/toni/.gradle/caches/transforms-2/files-2.1/2c3f4a36668a2c11413fb59a4942f26f/play-services-gass-11.0.4/AndroidManifest.xml:2:1-5:12
MERGED from [com.google.android.gms:play-services-tasks:11.0.4] /Users/toni/.gradle/caches/transforms-2/files-2.1/8e15687da029c205dc220d2371471690/play-services-tasks-11.0.4/AndroidManifest.xml:2:1-5:12
MERGED from [com.google.android.gms:play-services-basement:11.0.4] /Users/toni/.gradle/caches/transforms-2/files-2.1/a5c25c91643413c4847de03d398c4a2f/play-services-basement-11.0.4/AndroidManifest.xml:16:1-23:12
MERGED from [com.android.support:support-v4:26.1.0] /Users/toni/.gradle/caches/transforms-2/files-2.1/396d4851f8828002631185ff549de862/support-v4-26.1.0/AndroidManifest.xml:17:1-31:12
MERGED from [com.android.support:cardview-v7:22.2.0] /Users/toni/.gradle/caches/transforms-2/files-2.1/690b5fe214121ecbbc7f0cfcda118fbc/cardview-v7-22.2.0/AndroidManifest.xml:17:1-24:12
MERGED from [com.squareup.picasso:picasso:2.71828] /Users/toni/.gradle/caches/transforms-2/files-2.1/f4135b0f0f67409568f966ae3835f8a9/picasso-2.71828/AndroidManifest.xml:2:1-14:12
MERGED from [me.leolin:ShortcutBadger:1.1.21] /Users/toni/.gradle/caches/transforms-2/files-2.1/82af709f76ee4f922d798dbd4d5c207a/ShortcutBadger-1.1.21/AndroidManifest.xml:2:1-52:12
MERGED from [com.ablanco.zoomy:zoomy:1.0.0] /Users/toni/.gradle/caches/transforms-2/files-2.1/0d8730a132e12bc66444dbabc5b64b40/zoomy-1.0.0/AndroidManifest.xml:2:1-17:12
MERGED from [com.google.android.play:core:1.6.3] /Users/toni/.gradle/caches/transforms-2/files-2.1/4c37b9e4c9d478bb88b14169995438da/core-1.6.3/AndroidManifest.xml:2:1-12:12
MERGED from [com.android.support:support-media-compat:26.1.0] /Users/toni/.gradle/caches/transforms-2/files-2.1/ae8863d4a545e526a667609d2bf4e482/support-media-compat-26.1.0/AndroidManifest.xml:17:1-31:12
MERGED from [com.android.support:support-fragment:26.1.0] /Users/toni/.gradle/caches/transforms-2/files-2.1/ce437d9281bad04486162c3834ee1d75/support-fragment-26.1.0/AndroidManifest.xml:17:1-31:12
MERGED from [com.android.support:support-core-utils:26.1.0] /Users/toni/.gradle/caches/transforms-2/files-2.1/5555fef4487714d57d17e10d38a89759/support-core-utils-26.1.0/AndroidManifest.xml:17:1-31:12
MERGED from [com.android.support:support-core-ui:26.1.0] /Users/toni/.gradle/caches/transforms-2/files-2.1/fa067c15d0c043b2d035b9a7a31c1afb/support-core-ui-26.1.0/AndroidManifest.xml:17:1-31:12
MERGED from [com.android.support:support-compat:26.1.0] /Users/toni/.gradle/caches/transforms-2/files-2.1/3fde149d1e63f728b4a05f29a68a4323/support-compat-26.1.0/AndroidManifest.xml:17:1-31:12
MERGED from [com.android.support:exifinterface:27.1.0] /Users/toni/.gradle/caches/transforms-2/files-2.1/ed1dd9becd7b28e222446a6a00b47569/exifinterface-27.1.0/AndroidManifest.xml:17:1-22:12
MERGED from [android.arch.lifecycle:runtime:1.0.0] /Users/toni/.gradle/caches/transforms-2/files-2.1/cb768713c927f18e66d3a77a377f0e67/runtime-1.0.0/AndroidManifest.xml:17:1-30:12
INJECTED from /Users/toni/Desktop/mobile-app-eperformance/app/src/main/AndroidManifest.xml:2:1-136:12
INJECTED from /Users/toni/Desktop/mobile-app-eperformance/app/src/main/AndroidManifest.xml:2:1-136:12
INJECTED from /Users/toni/Desktop/mobile-app-eperformance/app/src/main/AndroidManifest.xml:2:1-136:12
	package
		ADDED from /Users/toni/Desktop/mobile-app-eperformance/app/src/main/AndroidManifest.xml:4:5-46
		INJECTED from /Users/toni/Desktop/mobile-app-eperformance/app/src/main/AndroidManifest.xml
		INJECTED from /Users/toni/Desktop/mobile-app-eperformance/app/src/main/AndroidManifest.xml
	android:versionName
		ADDED from /Users/toni/Desktop/mobile-app-eperformance/app/src/main/AndroidManifest.xml:6:5-32
		INJECTED from /Users/toni/Desktop/mobile-app-eperformance/app/src/main/AndroidManifest.xml
		INJECTED from /Users/toni/Desktop/mobile-app-eperformance/app/src/main/AndroidManifest.xml
	xmlns:tools
		ADDED from /Users/toni/Desktop/mobile-app-eperformance/app/src/main/AndroidManifest.xml:3:5-51
	xmlns:android
		ADDED from /Users/toni/Desktop/mobile-app-eperformance/app/src/main/AndroidManifest.xml:2:11-69
	android:versionCode
		ADDED from /Users/toni/Desktop/mobile-app-eperformance/app/src/main/AndroidManifest.xml:5:5-30
		INJECTED from /Users/toni/Desktop/mobile-app-eperformance/app/src/main/AndroidManifest.xml
		INJECTED from /Users/toni/Desktop/mobile-app-eperformance/app/src/main/AndroidManifest.xml
uses-permission#android.permission.CAMERA
ADDED from /Users/toni/Desktop/mobile-app-eperformance/app/src/main/AndroidManifest.xml:8:5-64
	android:name
		ADDED from /Users/toni/Desktop/mobile-app-eperformance/app/src/main/AndroidManifest.xml:8:22-62
uses-feature#android.hardware.camera
ADDED from /Users/toni/Desktop/mobile-app-eperformance/app/src/main/AndroidManifest.xml:9:5-60
	android:name
		ADDED from /Users/toni/Desktop/mobile-app-eperformance/app/src/main/AndroidManifest.xml:9:19-57
uses-feature#android.hardware.camera.autofocus
ADDED from /Users/toni/Desktop/mobile-app-eperformance/app/src/main/AndroidManifest.xml:10:5-70
	android:name
		ADDED from /Users/toni/Desktop/mobile-app-eperformance/app/src/main/AndroidManifest.xml:10:19-67
uses-permission#android.permission.ACCESS_NETWORK_STATE
ADDED from /Users/toni/Desktop/mobile-app-eperformance/app/src/main/AndroidManifest.xml:11:5-79
MERGED from [com.google.firebase:firebase-analytics:11.0.4] /Users/toni/.gradle/caches/transforms-2/files-2.1/21f41f56f291300a47d6c956a40c205d/firebase-analytics-11.0.4/AndroidManifest.xml:21:5-78
MERGED from [com.google.firebase:firebase-analytics:11.0.4] /Users/toni/.gradle/caches/transforms-2/files-2.1/21f41f56f291300a47d6c956a40c205d/firebase-analytics-11.0.4/AndroidManifest.xml:21:5-78
MERGED from [com.google.firebase:firebase-analytics-impl:11.0.4] /Users/toni/.gradle/caches/transforms-2/files-2.1/3e6c1acfda79bc19536aa0bcf5e44bf0/firebase-analytics-impl-11.0.4/AndroidManifest.xml:21:5-78
MERGED from [com.google.firebase:firebase-analytics-impl:11.0.4] /Users/toni/.gradle/caches/transforms-2/files-2.1/3e6c1acfda79bc19536aa0bcf5e44bf0/firebase-analytics-impl-11.0.4/AndroidManifest.xml:21:5-78
MERGED from [com.google.firebase:firebase-iid:11.0.4] /Users/toni/.gradle/caches/transforms-2/files-2.1/b473bf03b92bdec01d0f65e4f3f3a1ad/firebase-iid-11.0.4/AndroidManifest.xml:19:5-78
MERGED from [com.google.firebase:firebase-iid:11.0.4] /Users/toni/.gradle/caches/transforms-2/files-2.1/b473bf03b92bdec01d0f65e4f3f3a1ad/firebase-iid-11.0.4/AndroidManifest.xml:19:5-78
MERGED from [com.google.android.gms:play-services-ads-lite:11.0.4] /Users/toni/.gradle/caches/transforms-2/files-2.1/df68d9873d2a6faa3088b073efa14849/play-services-ads-lite-11.0.4/AndroidManifest.xml:20:5-78
MERGED from [com.google.android.gms:play-services-ads-lite:11.0.4] /Users/toni/.gradle/caches/transforms-2/files-2.1/df68d9873d2a6faa3088b073efa14849/play-services-ads-lite-11.0.4/AndroidManifest.xml:20:5-78
	android:name
		ADDED from /Users/toni/Desktop/mobile-app-eperformance/app/src/main/AndroidManifest.xml:11:22-76
uses-permission#android.permission.INTERNET
ADDED from /Users/toni/Desktop/mobile-app-eperformance/app/src/main/AndroidManifest.xml:12:5-67
MERGED from [com.google.firebase:firebase-analytics:11.0.4] /Users/toni/.gradle/caches/transforms-2/files-2.1/21f41f56f291300a47d6c956a40c205d/firebase-analytics-11.0.4/AndroidManifest.xml:20:5-66
MERGED from [com.google.firebase:firebase-analytics:11.0.4] /Users/toni/.gradle/caches/transforms-2/files-2.1/21f41f56f291300a47d6c956a40c205d/firebase-analytics-11.0.4/AndroidManifest.xml:20:5-66
MERGED from [com.google.firebase:firebase-analytics-impl:11.0.4] /Users/toni/.gradle/caches/transforms-2/files-2.1/3e6c1acfda79bc19536aa0bcf5e44bf0/firebase-analytics-impl-11.0.4/AndroidManifest.xml:20:5-66
MERGED from [com.google.firebase:firebase-analytics-impl:11.0.4] /Users/toni/.gradle/caches/transforms-2/files-2.1/3e6c1acfda79bc19536aa0bcf5e44bf0/firebase-analytics-impl-11.0.4/AndroidManifest.xml:20:5-66
MERGED from [com.google.firebase:firebase-iid:11.0.4] /Users/toni/.gradle/caches/transforms-2/files-2.1/b473bf03b92bdec01d0f65e4f3f3a1ad/firebase-iid-11.0.4/AndroidManifest.xml:20:5-66
MERGED from [com.google.firebase:firebase-iid:11.0.4] /Users/toni/.gradle/caches/transforms-2/files-2.1/b473bf03b92bdec01d0f65e4f3f3a1ad/firebase-iid-11.0.4/AndroidManifest.xml:20:5-66
MERGED from [com.google.android.gms:play-services-ads-lite:11.0.4] /Users/toni/.gradle/caches/transforms-2/files-2.1/df68d9873d2a6faa3088b073efa14849/play-services-ads-lite-11.0.4/AndroidManifest.xml:19:5-66
MERGED from [com.google.android.gms:play-services-ads-lite:11.0.4] /Users/toni/.gradle/caches/transforms-2/files-2.1/df68d9873d2a6faa3088b073efa14849/play-services-ads-lite-11.0.4/AndroidManifest.xml:19:5-66
	android:name
		ADDED from /Users/toni/Desktop/mobile-app-eperformance/app/src/main/AndroidManifest.xml:12:22-64
uses-permission#android.permission.READ_EXTERNAL_STORAGE
ADDED from /Users/toni/Desktop/mobile-app-eperformance/app/src/main/AndroidManifest.xml:13:5-80
	android:name
		ADDED from /Users/toni/Desktop/mobile-app-eperformance/app/src/main/AndroidManifest.xml:13:22-77
uses-permission#android.permission.READ_PHONE_STATE
ADDED from /Users/toni/Desktop/mobile-app-eperformance/app/src/main/AndroidManifest.xml:14:5-75
	android:name
		ADDED from /Users/toni/Desktop/mobile-app-eperformance/app/src/main/AndroidManifest.xml:14:22-72
uses-permission#android.permission.WRITE_EXTERNAL_STORAGE
ADDED from /Users/toni/Desktop/mobile-app-eperformance/app/src/main/AndroidManifest.xml:15:5-81
	android:name
		ADDED from /Users/toni/Desktop/mobile-app-eperformance/app/src/main/AndroidManifest.xml:15:22-78
uses-permission#android.permission.VIBRATE
ADDED from /Users/toni/Desktop/mobile-app-eperformance/app/src/main/AndroidManifest.xml:16:5-66
	android:name
		ADDED from /Users/toni/Desktop/mobile-app-eperformance/app/src/main/AndroidManifest.xml:16:22-63
uses-permission#android.permission.GET_ACCOUNTS
ADDED from /Users/toni/Desktop/mobile-app-eperformance/app/src/main/AndroidManifest.xml:17:5-71
	android:name
		ADDED from /Users/toni/Desktop/mobile-app-eperformance/app/src/main/AndroidManifest.xml:17:22-68
uses-permission#android.permission.GET_TASKS
ADDED from /Users/toni/Desktop/mobile-app-eperformance/app/src/main/AndroidManifest.xml:18:5-68
	android:name
		ADDED from /Users/toni/Desktop/mobile-app-eperformance/app/src/main/AndroidManifest.xml:18:22-65
uses-permission#android.permission.WRITE_SETTINGS
ADDED from /Users/toni/Desktop/mobile-app-eperformance/app/src/main/AndroidManifest.xml:19:5-73
	android:name
		ADDED from /Users/toni/Desktop/mobile-app-eperformance/app/src/main/AndroidManifest.xml:19:22-70
uses-permission#com.google.android.c2dm.permission.RECEIVE
ADDED from /Users/toni/Desktop/mobile-app-eperformance/app/src/main/AndroidManifest.xml:21:5-82
MERGED from [com.google.firebase:firebase-iid:11.0.4] /Users/toni/.gradle/caches/transforms-2/files-2.1/b473bf03b92bdec01d0f65e4f3f3a1ad/firebase-iid-11.0.4/AndroidManifest.xml:22:5-81
MERGED from [com.google.firebase:firebase-iid:11.0.4] /Users/toni/.gradle/caches/transforms-2/files-2.1/b473bf03b92bdec01d0f65e4f3f3a1ad/firebase-iid-11.0.4/AndroidManifest.xml:22:5-81
	android:name
		ADDED from /Users/toni/Desktop/mobile-app-eperformance/app/src/main/AndroidManifest.xml:21:22-79
uses-permission#android.permission.ACCESS_FINE_LOCATION
ADDED from /Users/toni/Desktop/mobile-app-eperformance/app/src/main/AndroidManifest.xml:22:5-79
	android:name
		ADDED from /Users/toni/Desktop/mobile-app-eperformance/app/src/main/AndroidManifest.xml:22:22-76
uses-permission#android.permission.ACCESS_COARSE_LOCATION
ADDED from /Users/toni/Desktop/mobile-app-eperformance/app/src/main/AndroidManifest.xml:23:5-81
	android:name
		ADDED from /Users/toni/Desktop/mobile-app-eperformance/app/src/main/AndroidManifest.xml:23:22-78
uses-permission#android.permission.SET_WALLPAPER
ADDED from /Users/toni/Desktop/mobile-app-eperformance/app/src/main/AndroidManifest.xml:24:5-72
	android:name
		ADDED from /Users/toni/Desktop/mobile-app-eperformance/app/src/main/AndroidManifest.xml:24:22-69
uses-permission#com.sec.android.provider.badge.permission.READ
ADDED from /Users/toni/Desktop/mobile-app-eperformance/app/src/main/AndroidManifest.xml:27:5-86
MERGED from [me.leolin:ShortcutBadger:1.1.21] /Users/toni/.gradle/caches/transforms-2/files-2.1/82af709f76ee4f922d798dbd4d5c207a/ShortcutBadger-1.1.21/AndroidManifest.xml:19:5-86
MERGED from [me.leolin:ShortcutBadger:1.1.21] /Users/toni/.gradle/caches/transforms-2/files-2.1/82af709f76ee4f922d798dbd4d5c207a/ShortcutBadger-1.1.21/AndroidManifest.xml:19:5-86
	android:name
		ADDED from /Users/toni/Desktop/mobile-app-eperformance/app/src/main/AndroidManifest.xml:27:22-83
uses-permission#com.sec.android.provider.badge.permission.WRITE
ADDED from /Users/toni/Desktop/mobile-app-eperformance/app/src/main/AndroidManifest.xml:28:5-87
MERGED from [me.leolin:ShortcutBadger:1.1.21] /Users/toni/.gradle/caches/transforms-2/files-2.1/82af709f76ee4f922d798dbd4d5c207a/ShortcutBadger-1.1.21/AndroidManifest.xml:20:5-87
MERGED from [me.leolin:ShortcutBadger:1.1.21] /Users/toni/.gradle/caches/transforms-2/files-2.1/82af709f76ee4f922d798dbd4d5c207a/ShortcutBadger-1.1.21/AndroidManifest.xml:20:5-87
	android:name
		ADDED from /Users/toni/Desktop/mobile-app-eperformance/app/src/main/AndroidManifest.xml:28:22-84
uses-permission#com.sonyericsson.home.permission.BROADCAST_BADGE
ADDED from /Users/toni/Desktop/mobile-app-eperformance/app/src/main/AndroidManifest.xml:30:5-88
MERGED from [me.leolin:ShortcutBadger:1.1.21] /Users/toni/.gradle/caches/transforms-2/files-2.1/82af709f76ee4f922d798dbd4d5c207a/ShortcutBadger-1.1.21/AndroidManifest.xml:27:5-88
MERGED from [me.leolin:ShortcutBadger:1.1.21] /Users/toni/.gradle/caches/transforms-2/files-2.1/82af709f76ee4f922d798dbd4d5c207a/ShortcutBadger-1.1.21/AndroidManifest.xml:27:5-88
	android:name
		ADDED from /Users/toni/Desktop/mobile-app-eperformance/app/src/main/AndroidManifest.xml:30:22-85
uses-permission#com.htc.launcher.permission.READ_SETTINGS
ADDED from /Users/toni/Desktop/mobile-app-eperformance/app/src/main/AndroidManifest.xml:32:5-81
MERGED from [me.leolin:ShortcutBadger:1.1.21] /Users/toni/.gradle/caches/transforms-2/files-2.1/82af709f76ee4f922d798dbd4d5c207a/ShortcutBadger-1.1.21/AndroidManifest.xml:23:5-81
MERGED from [me.leolin:ShortcutBadger:1.1.21] /Users/toni/.gradle/caches/transforms-2/files-2.1/82af709f76ee4f922d798dbd4d5c207a/ShortcutBadger-1.1.21/AndroidManifest.xml:23:5-81
	android:name
		ADDED from /Users/toni/Desktop/mobile-app-eperformance/app/src/main/AndroidManifest.xml:32:22-78
uses-permission#com.htc.launcher.permission.UPDATE_SHORTCUT
ADDED from /Users/toni/Desktop/mobile-app-eperformance/app/src/main/AndroidManifest.xml:33:5-83
MERGED from [me.leolin:ShortcutBadger:1.1.21] /Users/toni/.gradle/caches/transforms-2/files-2.1/82af709f76ee4f922d798dbd4d5c207a/ShortcutBadger-1.1.21/AndroidManifest.xml:24:5-83
MERGED from [me.leolin:ShortcutBadger:1.1.21] /Users/toni/.gradle/caches/transforms-2/files-2.1/82af709f76ee4f922d798dbd4d5c207a/ShortcutBadger-1.1.21/AndroidManifest.xml:24:5-83
	android:name
		ADDED from /Users/toni/Desktop/mobile-app-eperformance/app/src/main/AndroidManifest.xml:33:22-80
application
ADDED from /Users/toni/Desktop/mobile-app-eperformance/app/src/main/AndroidManifest.xml:35:5-134:19
MERGED from [com.google.firebase:firebase-core:11.0.4] /Users/toni/.gradle/caches/transforms-2/files-2.1/c04b2a4a2b54ddd628d96d651ac90379/firebase-core-11.0.4/AndroidManifest.xml:5:5-20
MERGED from [com.google.firebase:firebase-core:11.0.4] /Users/toni/.gradle/caches/transforms-2/files-2.1/c04b2a4a2b54ddd628d96d651ac90379/firebase-core-11.0.4/AndroidManifest.xml:5:5-20
MERGED from [com.android.support.constraint:constraint-layout:1.0.2] /Users/toni/.gradle/caches/transforms-2/files-2.1/a820c02b64b1d0ef710388d46f9b7aa6/constraint-layout-1.0.2/AndroidManifest.xml:9:5-20
MERGED from [com.android.support.constraint:constraint-layout:1.0.2] /Users/toni/.gradle/caches/transforms-2/files-2.1/a820c02b64b1d0ef710388d46f9b7aa6/constraint-layout-1.0.2/AndroidManifest.xml:9:5-20
MERGED from [com.android.support:design:22.2.0] /Users/toni/.gradle/caches/transforms-2/files-2.1/7a605ed841c05abab4a688613094f768/design-22.2.0/AndroidManifest.xml:22:5-20
MERGED from [com.android.support:design:22.2.0] /Users/toni/.gradle/caches/transforms-2/files-2.1/7a605ed841c05abab4a688613094f768/design-22.2.0/AndroidManifest.xml:22:5-20
MERGED from [com.android.support:appcompat-v7:22.2.0] /Users/toni/.gradle/caches/transforms-2/files-2.1/dc044531f6dbd908e4ad63c1707bf147/appcompat-v7-22.2.0/AndroidManifest.xml:22:5-20
MERGED from [com.android.support:appcompat-v7:22.2.0] /Users/toni/.gradle/caches/transforms-2/files-2.1/dc044531f6dbd908e4ad63c1707bf147/appcompat-v7-22.2.0/AndroidManifest.xml:22:5-20
MERGED from [com.google.firebase:firebase-messaging:11.0.4] /Users/toni/.gradle/caches/transforms-2/files-2.1/afd02a6774fd2a273cc89f6dc44f635c/firebase-messaging-11.0.4/AndroidManifest.xml:19:5-29:19
MERGED from [com.google.firebase:firebase-messaging:11.0.4] /Users/toni/.gradle/caches/transforms-2/files-2.1/afd02a6774fd2a273cc89f6dc44f635c/firebase-messaging-11.0.4/AndroidManifest.xml:19:5-29:19
MERGED from [com.google.android.gms:play-services-location:11.0.4] /Users/toni/.gradle/caches/transforms-2/files-2.1/ddc2d76bba015527c3786df731c4e999/play-services-location-11.0.4/AndroidManifest.xml:4:5-19
MERGED from [com.google.android.gms:play-services-location:11.0.4] /Users/toni/.gradle/caches/transforms-2/files-2.1/ddc2d76bba015527c3786df731c4e999/play-services-location-11.0.4/AndroidManifest.xml:4:5-19
MERGED from [com.google.firebase:firebase-analytics:11.0.4] /Users/toni/.gradle/caches/transforms-2/files-2.1/21f41f56f291300a47d6c956a40c205d/firebase-analytics-11.0.4/AndroidManifest.xml:24:5-34:19
MERGED from [com.google.firebase:firebase-analytics:11.0.4] /Users/toni/.gradle/caches/transforms-2/files-2.1/21f41f56f291300a47d6c956a40c205d/firebase-analytics-11.0.4/AndroidManifest.xml:24:5-34:19
MERGED from [com.google.firebase:firebase-analytics-impl:11.0.4] /Users/toni/.gradle/caches/transforms-2/files-2.1/3e6c1acfda79bc19536aa0bcf5e44bf0/firebase-analytics-impl-11.0.4/AndroidManifest.xml:24:5-28:19
MERGED from [com.google.firebase:firebase-analytics-impl:11.0.4] /Users/toni/.gradle/caches/transforms-2/files-2.1/3e6c1acfda79bc19536aa0bcf5e44bf0/firebase-analytics-impl-11.0.4/AndroidManifest.xml:24:5-28:19
MERGED from [com.google.firebase:firebase-iid:11.0.4] /Users/toni/.gradle/caches/transforms-2/files-2.1/b473bf03b92bdec01d0f65e4f3f3a1ad/firebase-iid-11.0.4/AndroidManifest.xml:28:5-49:19
MERGED from [com.google.firebase:firebase-iid:11.0.4] /Users/toni/.gradle/caches/transforms-2/files-2.1/b473bf03b92bdec01d0f65e4f3f3a1ad/firebase-iid-11.0.4/AndroidManifest.xml:28:5-49:19
MERGED from [com.google.firebase:firebase-common:11.0.4] /Users/toni/.gradle/caches/transforms-2/files-2.1/4b1eba66e4e552fed9e7b1205d4b065a/firebase-common-11.0.4/AndroidManifest.xml:4:5-7:19
MERGED from [com.google.firebase:firebase-common:11.0.4] /Users/toni/.gradle/caches/transforms-2/files-2.1/4b1eba66e4e552fed9e7b1205d4b065a/firebase-common-11.0.4/AndroidManifest.xml:4:5-7:19
MERGED from [com.google.android.gms:play-services-ads-lite:11.0.4] /Users/toni/.gradle/caches/transforms-2/files-2.1/df68d9873d2a6faa3088b073efa14849/play-services-ads-lite-11.0.4/AndroidManifest.xml:23:5-26:19
MERGED from [com.google.android.gms:play-services-ads-lite:11.0.4] /Users/toni/.gradle/caches/transforms-2/files-2.1/df68d9873d2a6faa3088b073efa14849/play-services-ads-lite-11.0.4/AndroidManifest.xml:23:5-26:19
MERGED from [com.google.android.gms:play-services-clearcut:11.0.4] /Users/toni/.gradle/caches/transforms-2/files-2.1/593882478e0d6b313177ff0e37e7c4cb/play-services-clearcut-11.0.4/AndroidManifest.xml:18:5-19
MERGED from [com.google.android.gms:play-services-clearcut:11.0.4] /Users/toni/.gradle/caches/transforms-2/files-2.1/593882478e0d6b313177ff0e37e7c4cb/play-services-clearcut-11.0.4/AndroidManifest.xml:18:5-19
MERGED from [com.google.android.gms:play-services-safetynet:11.0.4] /Users/toni/.gradle/caches/transforms-2/files-2.1/795dd1e28bdb1d374fddf0de5dc029aa/play-services-safetynet-11.0.4/AndroidManifest.xml:18:5-19
MERGED from [com.google.android.gms:play-services-safetynet:11.0.4] /Users/toni/.gradle/caches/transforms-2/files-2.1/795dd1e28bdb1d374fddf0de5dc029aa/play-services-safetynet-11.0.4/AndroidManifest.xml:18:5-19
MERGED from [com.google.android.gms:play-services-base:11.0.4] /Users/toni/.gradle/caches/transforms-2/files-2.1/ab68c9472975602043b76751eb765750/play-services-base-11.0.4/AndroidManifest.xml:18:5-20:19
MERGED from [com.google.android.gms:play-services-base:11.0.4] /Users/toni/.gradle/caches/transforms-2/files-2.1/ab68c9472975602043b76751eb765750/play-services-base-11.0.4/AndroidManifest.xml:18:5-20:19
MERGED from [com.google.android.gms:play-services-gass:11.0.4] /Users/toni/.gradle/caches/transforms-2/files-2.1/2c3f4a36668a2c11413fb59a4942f26f/play-services-gass-11.0.4/AndroidManifest.xml:4:5-19
MERGED from [com.google.android.gms:play-services-gass:11.0.4] /Users/toni/.gradle/caches/transforms-2/files-2.1/2c3f4a36668a2c11413fb59a4942f26f/play-services-gass-11.0.4/AndroidManifest.xml:4:5-19
MERGED from [com.google.android.gms:play-services-tasks:11.0.4] /Users/toni/.gradle/caches/transforms-2/files-2.1/8e15687da029c205dc220d2371471690/play-services-tasks-11.0.4/AndroidManifest.xml:4:5-19
MERGED from [com.google.android.gms:play-services-tasks:11.0.4] /Users/toni/.gradle/caches/transforms-2/files-2.1/8e15687da029c205dc220d2371471690/play-services-tasks-11.0.4/AndroidManifest.xml:4:5-19
MERGED from [com.google.android.gms:play-services-basement:11.0.4] /Users/toni/.gradle/caches/transforms-2/files-2.1/a5c25c91643413c4847de03d398c4a2f/play-services-basement-11.0.4/AndroidManifest.xml:19:5-21:19
MERGED from [com.google.android.gms:play-services-basement:11.0.4] /Users/toni/.gradle/caches/transforms-2/files-2.1/a5c25c91643413c4847de03d398c4a2f/play-services-basement-11.0.4/AndroidManifest.xml:19:5-21:19
MERGED from [com.android.support:support-v4:26.1.0] /Users/toni/.gradle/caches/transforms-2/files-2.1/396d4851f8828002631185ff549de862/support-v4-26.1.0/AndroidManifest.xml:25:5-29:19
MERGED from [com.android.support:support-v4:26.1.0] /Users/toni/.gradle/caches/transforms-2/files-2.1/396d4851f8828002631185ff549de862/support-v4-26.1.0/AndroidManifest.xml:25:5-29:19
MERGED from [com.android.support:cardview-v7:22.2.0] /Users/toni/.gradle/caches/transforms-2/files-2.1/690b5fe214121ecbbc7f0cfcda118fbc/cardview-v7-22.2.0/AndroidManifest.xml:22:5-20
MERGED from [com.android.support:cardview-v7:22.2.0] /Users/toni/.gradle/caches/transforms-2/files-2.1/690b5fe214121ecbbc7f0cfcda118fbc/cardview-v7-22.2.0/AndroidManifest.xml:22:5-20
MERGED from [com.squareup.picasso:picasso:2.71828] /Users/toni/.gradle/caches/transforms-2/files-2.1/f4135b0f0f67409568f966ae3835f8a9/picasso-2.71828/AndroidManifest.xml:7:5-12:19
MERGED from [com.squareup.picasso:picasso:2.71828] /Users/toni/.gradle/caches/transforms-2/files-2.1/f4135b0f0f67409568f966ae3835f8a9/picasso-2.71828/AndroidManifest.xml:7:5-12:19
MERGED from [com.ablanco.zoomy:zoomy:1.0.0] /Users/toni/.gradle/caches/transforms-2/files-2.1/0d8730a132e12bc66444dbabc5b64b40/zoomy-1.0.0/AndroidManifest.xml:11:5-15:19
MERGED from [com.ablanco.zoomy:zoomy:1.0.0] /Users/toni/.gradle/caches/transforms-2/files-2.1/0d8730a132e12bc66444dbabc5b64b40/zoomy-1.0.0/AndroidManifest.xml:11:5-15:19
MERGED from [com.google.android.play:core:1.6.3] /Users/toni/.gradle/caches/transforms-2/files-2.1/4c37b9e4c9d478bb88b14169995438da/core-1.6.3/AndroidManifest.xml:6:3-10:17
MERGED from [com.google.android.play:core:1.6.3] /Users/toni/.gradle/caches/transforms-2/files-2.1/4c37b9e4c9d478bb88b14169995438da/core-1.6.3/AndroidManifest.xml:6:3-10:17
MERGED from [com.android.support:support-media-compat:26.1.0] /Users/toni/.gradle/caches/transforms-2/files-2.1/ae8863d4a545e526a667609d2bf4e482/support-media-compat-26.1.0/AndroidManifest.xml:25:5-29:19
MERGED from [com.android.support:support-media-compat:26.1.0] /Users/toni/.gradle/caches/transforms-2/files-2.1/ae8863d4a545e526a667609d2bf4e482/support-media-compat-26.1.0/AndroidManifest.xml:25:5-29:19
MERGED from [com.android.support:support-fragment:26.1.0] /Users/toni/.gradle/caches/transforms-2/files-2.1/ce437d9281bad04486162c3834ee1d75/support-fragment-26.1.0/AndroidManifest.xml:25:5-29:19
MERGED from [com.android.support:support-fragment:26.1.0] /Users/toni/.gradle/caches/transforms-2/files-2.1/ce437d9281bad04486162c3834ee1d75/support-fragment-26.1.0/AndroidManifest.xml:25:5-29:19
MERGED from [com.android.support:support-core-utils:26.1.0] /Users/toni/.gradle/caches/transforms-2/files-2.1/5555fef4487714d57d17e10d38a89759/support-core-utils-26.1.0/AndroidManifest.xml:25:5-29:19
MERGED from [com.android.support:support-core-utils:26.1.0] /Users/toni/.gradle/caches/transforms-2/files-2.1/5555fef4487714d57d17e10d38a89759/support-core-utils-26.1.0/AndroidManifest.xml:25:5-29:19
MERGED from [com.android.support:support-core-ui:26.1.0] /Users/toni/.gradle/caches/transforms-2/files-2.1/fa067c15d0c043b2d035b9a7a31c1afb/support-core-ui-26.1.0/AndroidManifest.xml:25:5-29:19
MERGED from [com.android.support:support-core-ui:26.1.0] /Users/toni/.gradle/caches/transforms-2/files-2.1/fa067c15d0c043b2d035b9a7a31c1afb/support-core-ui-26.1.0/AndroidManifest.xml:25:5-29:19
MERGED from [com.android.support:support-compat:26.1.0] /Users/toni/.gradle/caches/transforms-2/files-2.1/3fde149d1e63f728b4a05f29a68a4323/support-compat-26.1.0/AndroidManifest.xml:25:5-29:19
MERGED from [com.android.support:support-compat:26.1.0] /Users/toni/.gradle/caches/transforms-2/files-2.1/3fde149d1e63f728b4a05f29a68a4323/support-compat-26.1.0/AndroidManifest.xml:25:5-29:19
MERGED from [android.arch.lifecycle:runtime:1.0.0] /Users/toni/.gradle/caches/transforms-2/files-2.1/cb768713c927f18e66d3a77a377f0e67/runtime-1.0.0/AndroidManifest.xml:24:5-28:19
MERGED from [android.arch.lifecycle:runtime:1.0.0] /Users/toni/.gradle/caches/transforms-2/files-2.1/cb768713c927f18e66d3a77a377f0e67/runtime-1.0.0/AndroidManifest.xml:24:5-28:19
	android:supportsRtl
		ADDED from [com.ablanco.zoomy:zoomy:1.0.0] /Users/toni/.gradle/caches/transforms-2/files-2.1/0d8730a132e12bc66444dbabc5b64b40/zoomy-1.0.0/AndroidManifest.xml:14:9-35
	android:label
		ADDED from /Users/toni/Desktop/mobile-app-eperformance/app/src/main/AndroidManifest.xml:38:9-41
	android:hardwareAccelerated
		ADDED from /Users/toni/Desktop/mobile-app-eperformance/app/src/main/AndroidManifest.xml:40:9-44
	android:largeHeap
		ADDED from /Users/toni/Desktop/mobile-app-eperformance/app/src/main/AndroidManifest.xml:39:9-33
	android:icon
		ADDED from /Users/toni/Desktop/mobile-app-eperformance/app/src/main/AndroidManifest.xml:37:9-43
	android:allowBackup
		ADDED from /Users/toni/Desktop/mobile-app-eperformance/app/src/main/AndroidManifest.xml:36:9-35
	android:theme
		ADDED from /Users/toni/Desktop/mobile-app-eperformance/app/src/main/AndroidManifest.xml:41:9-40
service#id.go.kotasurabaya.eperformance.notificationService.MyFirebaseInstanceService
ADDED from /Users/toni/Desktop/mobile-app-eperformance/app/src/main/AndroidManifest.xml:42:9-47:19
	android:name
		ADDED from /Users/toni/Desktop/mobile-app-eperformance/app/src/main/AndroidManifest.xml:43:13-105
intent-filter#action:name:com.google.firebase.INSTANCE_ID_EVENT
ADDED from /Users/toni/Desktop/mobile-app-eperformance/app/src/main/AndroidManifest.xml:44:13-46:29
action#com.google.firebase.INSTANCE_ID_EVENT
ADDED from /Users/toni/Desktop/mobile-app-eperformance/app/src/main/AndroidManifest.xml:45:17-79
	android:name
		ADDED from /Users/toni/Desktop/mobile-app-eperformance/app/src/main/AndroidManifest.xml:45:25-77
service#id.go.kotasurabaya.eperformance.notificationService.MyFirebaseMessagingService
ADDED from /Users/toni/Desktop/mobile-app-eperformance/app/src/main/AndroidManifest.xml:48:9-53:19
	android:name
		ADDED from /Users/toni/Desktop/mobile-app-eperformance/app/src/main/AndroidManifest.xml:49:13-106
intent-filter#action:name:com.google.firebase.MESSAGING_EVENT
ADDED from /Users/toni/Desktop/mobile-app-eperformance/app/src/main/AndroidManifest.xml:50:13-52:29
action#com.google.firebase.MESSAGING_EVENT
ADDED from /Users/toni/Desktop/mobile-app-eperformance/app/src/main/AndroidManifest.xml:51:17-77
	android:name
		ADDED from /Users/toni/Desktop/mobile-app-eperformance/app/src/main/AndroidManifest.xml:51:25-75
activity#id.go.kotasurabaya.eperformance.activities.LoginActivity
ADDED from /Users/toni/Desktop/mobile-app-eperformance/app/src/main/AndroidManifest.xml:55:9-58:52
	android:screenOrientation
		ADDED from /Users/toni/Desktop/mobile-app-eperformance/app/src/main/AndroidManifest.xml:58:13-49
	android:noHistory
		ADDED from /Users/toni/Desktop/mobile-app-eperformance/app/src/main/AndroidManifest.xml:57:13-37
	android:name
		ADDED from /Users/toni/Desktop/mobile-app-eperformance/app/src/main/AndroidManifest.xml:56:13-84
activity#id.go.kotasurabaya.eperformance.activities.SplashScreen
ADDED from /Users/toni/Desktop/mobile-app-eperformance/app/src/main/AndroidManifest.xml:59:9-69:20
	android:label
		ADDED from /Users/toni/Desktop/mobile-app-eperformance/app/src/main/AndroidManifest.xml:62:13-45
	android:configChanges
		ADDED from /Users/toni/Desktop/mobile-app-eperformance/app/src/main/AndroidManifest.xml:61:13-74
	android:theme
		ADDED from /Users/toni/Desktop/mobile-app-eperformance/app/src/main/AndroidManifest.xml:63:13-66
	android:name
		ADDED from /Users/toni/Desktop/mobile-app-eperformance/app/src/main/AndroidManifest.xml:60:13-83
intent-filter#action:name:android.intent.action.MAIN+category:name:android.intent.category.LAUNCHER
ADDED from /Users/toni/Desktop/mobile-app-eperformance/app/src/main/AndroidManifest.xml:64:13-68:29
action#android.intent.action.MAIN
ADDED from /Users/toni/Desktop/mobile-app-eperformance/app/src/main/AndroidManifest.xml:65:17-69
	android:name
		ADDED from /Users/toni/Desktop/mobile-app-eperformance/app/src/main/AndroidManifest.xml:65:25-66
category#android.intent.category.LAUNCHER
ADDED from /Users/toni/Desktop/mobile-app-eperformance/app/src/main/AndroidManifest.xml:67:17-77
	android:name
		ADDED from /Users/toni/Desktop/mobile-app-eperformance/app/src/main/AndroidManifest.xml:67:27-74
activity#id.go.kotasurabaya.eperformance.activities.MainActivity
ADDED from /Users/toni/Desktop/mobile-app-eperformance/app/src/main/AndroidManifest.xml:70:9-74:70
	android:screenOrientation
		ADDED from /Users/toni/Desktop/mobile-app-eperformance/app/src/main/AndroidManifest.xml:73:13-49
	android:label
		ADDED from /Users/toni/Desktop/mobile-app-eperformance/app/src/main/AndroidManifest.xml:72:13-47
	android:windowSoftInputMode
		ADDED from /Users/toni/Desktop/mobile-app-eperformance/app/src/main/AndroidManifest.xml:74:13-67
	android:name
		ADDED from /Users/toni/Desktop/mobile-app-eperformance/app/src/main/AndroidManifest.xml:71:13-83
activity#id.go.kotasurabaya.eperformance.activities.MainActivity2
ADDED from /Users/toni/Desktop/mobile-app-eperformance/app/src/main/AndroidManifest.xml:75:9-79:70
	android:screenOrientation
		ADDED from /Users/toni/Desktop/mobile-app-eperformance/app/src/main/AndroidManifest.xml:78:13-49
	android:label
		ADDED from /Users/toni/Desktop/mobile-app-eperformance/app/src/main/AndroidManifest.xml:77:13-47
	android:windowSoftInputMode
		ADDED from /Users/toni/Desktop/mobile-app-eperformance/app/src/main/AndroidManifest.xml:79:13-67
	android:name
		ADDED from /Users/toni/Desktop/mobile-app-eperformance/app/src/main/AndroidManifest.xml:76:13-84
meta-data#com.google.android.gms.version
ADDED from /Users/toni/Desktop/mobile-app-eperformance/app/src/main/AndroidManifest.xml:81:9-83:69
MERGED from [com.google.android.gms:play-services-basement:11.0.4] /Users/toni/.gradle/caches/transforms-2/files-2.1/a5c25c91643413c4847de03d398c4a2f/play-services-basement-11.0.4/AndroidManifest.xml:20:9-121
MERGED from [com.google.android.gms:play-services-basement:11.0.4] /Users/toni/.gradle/caches/transforms-2/files-2.1/a5c25c91643413c4847de03d398c4a2f/play-services-basement-11.0.4/AndroidManifest.xml:20:9-121
	android:value
		ADDED from /Users/toni/Desktop/mobile-app-eperformance/app/src/main/AndroidManifest.xml:83:13-66
	android:name
		ADDED from /Users/toni/Desktop/mobile-app-eperformance/app/src/main/AndroidManifest.xml:82:13-58
activity#com.google.android.gms.ads.AdActivity
ADDED from /Users/toni/Desktop/mobile-app-eperformance/app/src/main/AndroidManifest.xml:85:9-87:125
MERGED from [com.google.android.gms:play-services-ads-lite:11.0.4] /Users/toni/.gradle/caches/transforms-2/files-2.1/df68d9873d2a6faa3088b073efa14849/play-services-ads-lite-11.0.4/AndroidManifest.xml:25:9-232
MERGED from [com.google.android.gms:play-services-ads-lite:11.0.4] /Users/toni/.gradle/caches/transforms-2/files-2.1/df68d9873d2a6faa3088b073efa14849/play-services-ads-lite-11.0.4/AndroidManifest.xml:25:9-232
	android:configChanges
		ADDED from /Users/toni/Desktop/mobile-app-eperformance/app/src/main/AndroidManifest.xml:87:13-122
	android:theme
		ADDED from [com.google.android.gms:play-services-ads-lite:11.0.4] /Users/toni/.gradle/caches/transforms-2/files-2.1/df68d9873d2a6faa3088b073efa14849/play-services-ads-lite-11.0.4/AndroidManifest.xml:25:182-230
	android:name
		ADDED from /Users/toni/Desktop/mobile-app-eperformance/app/src/main/AndroidManifest.xml:86:13-65
activity#id.go.kotasurabaya.eperformance.activities.ProfilePreview
ADDED from /Users/toni/Desktop/mobile-app-eperformance/app/src/main/AndroidManifest.xml:88:9-91:47
	android:windowActionBar
		ADDED from /Users/toni/Desktop/mobile-app-eperformance/app/src/main/AndroidManifest.xml:91:13-44
	android:theme
		ADDED from /Users/toni/Desktop/mobile-app-eperformance/app/src/main/AndroidManifest.xml:90:13-42
	android:name
		ADDED from /Users/toni/Desktop/mobile-app-eperformance/app/src/main/AndroidManifest.xml:89:13-85
activity#id.go.kotasurabaya.eperformance.activities.FullScreenImageViewActivity
ADDED from /Users/toni/Desktop/mobile-app-eperformance/app/src/main/AndroidManifest.xml:92:9-94:46
	android:windowActionBar
		ADDED from /Users/toni/Desktop/mobile-app-eperformance/app/src/main/AndroidManifest.xml:94:13-43
	android:name
		ADDED from /Users/toni/Desktop/mobile-app-eperformance/app/src/main/AndroidManifest.xml:93:13-98
activity#id.go.kotasurabaya.eperformance.activities.BahawanAktivitas
ADDED from /Users/toni/Desktop/mobile-app-eperformance/app/src/main/AndroidManifest.xml:95:9-98:47
	android:windowActionBar
		ADDED from /Users/toni/Desktop/mobile-app-eperformance/app/src/main/AndroidManifest.xml:98:13-44
	android:theme
		ADDED from /Users/toni/Desktop/mobile-app-eperformance/app/src/main/AndroidManifest.xml:97:13-56
	android:name
		ADDED from /Users/toni/Desktop/mobile-app-eperformance/app/src/main/AndroidManifest.xml:96:13-87
activity#id.go.kotasurabaya.eperformance.activities.BawahanOsAktivitas
ADDED from /Users/toni/Desktop/mobile-app-eperformance/app/src/main/AndroidManifest.xml:99:9-102:47
	android:windowActionBar
		ADDED from /Users/toni/Desktop/mobile-app-eperformance/app/src/main/AndroidManifest.xml:102:13-44
	android:theme
		ADDED from /Users/toni/Desktop/mobile-app-eperformance/app/src/main/AndroidManifest.xml:101:13-56
	android:name
		ADDED from /Users/toni/Desktop/mobile-app-eperformance/app/src/main/AndroidManifest.xml:100:13-89
activity#id.go.kotasurabaya.eperformance.activities.EditAktivitasStruktural
ADDED from /Users/toni/Desktop/mobile-app-eperformance/app/src/main/AndroidManifest.xml:103:9-106:46
	android:windowActionBar
		ADDED from /Users/toni/Desktop/mobile-app-eperformance/app/src/main/AndroidManifest.xml:106:13-44
	android:theme
		ADDED from /Users/toni/Desktop/mobile-app-eperformance/app/src/main/AndroidManifest.xml:105:13-42
	android:name
		ADDED from /Users/toni/Desktop/mobile-app-eperformance/app/src/main/AndroidManifest.xml:104:13-94
activity#id.go.kotasurabaya.eperformance.activities.EditAktivitas
ADDED from /Users/toni/Desktop/mobile-app-eperformance/app/src/main/AndroidManifest.xml:107:9-110:46
	android:windowActionBar
		ADDED from /Users/toni/Desktop/mobile-app-eperformance/app/src/main/AndroidManifest.xml:110:13-44
	android:theme
		ADDED from /Users/toni/Desktop/mobile-app-eperformance/app/src/main/AndroidManifest.xml:109:13-42
	android:name
		ADDED from /Users/toni/Desktop/mobile-app-eperformance/app/src/main/AndroidManifest.xml:108:13-84
activity#id.go.kotasurabaya.eperformance.activities.EditAktivitasOs
ADDED from /Users/toni/Desktop/mobile-app-eperformance/app/src/main/AndroidManifest.xml:111:9-114:46
	android:windowActionBar
		ADDED from /Users/toni/Desktop/mobile-app-eperformance/app/src/main/AndroidManifest.xml:114:13-44
	android:theme
		ADDED from /Users/toni/Desktop/mobile-app-eperformance/app/src/main/AndroidManifest.xml:113:13-42
	android:name
		ADDED from /Users/toni/Desktop/mobile-app-eperformance/app/src/main/AndroidManifest.xml:112:13-86
activity#id.go.kotasurabaya.eperformance.activities.ZoomImage
ADDED from /Users/toni/Desktop/mobile-app-eperformance/app/src/main/AndroidManifest.xml:115:9-118:46
	android:windowActionBar
		ADDED from /Users/toni/Desktop/mobile-app-eperformance/app/src/main/AndroidManifest.xml:118:13-44
	android:theme
		ADDED from /Users/toni/Desktop/mobile-app-eperformance/app/src/main/AndroidManifest.xml:117:13-42
	android:name
		ADDED from /Users/toni/Desktop/mobile-app-eperformance/app/src/main/AndroidManifest.xml:116:13-80
service#id.go.kotasurabaya.eperformance.BadgeIntentService
ADDED from /Users/toni/Desktop/mobile-app-eperformance/app/src/main/AndroidManifest.xml:120:9-122:40
	android:exported
		ADDED from /Users/toni/Desktop/mobile-app-eperformance/app/src/main/AndroidManifest.xml:122:13-37
	android:name
		ADDED from /Users/toni/Desktop/mobile-app-eperformance/app/src/main/AndroidManifest.xml:121:13-78
uses-sdk
INJECTED from /Users/toni/Desktop/mobile-app-eperformance/app/src/main/AndroidManifest.xml reason: use-sdk injection requested
INJECTED from /Users/toni/Desktop/mobile-app-eperformance/app/src/main/AndroidManifest.xml
INJECTED from /Users/toni/Desktop/mobile-app-eperformance/app/src/main/AndroidManifest.xml
MERGED from [com.google.firebase:firebase-core:11.0.4] /Users/toni/.gradle/caches/transforms-2/files-2.1/c04b2a4a2b54ddd628d96d651ac90379/firebase-core-11.0.4/AndroidManifest.xml:4:5-43
MERGED from [com.google.firebase:firebase-core:11.0.4] /Users/toni/.gradle/caches/transforms-2/files-2.1/c04b2a4a2b54ddd628d96d651ac90379/firebase-core-11.0.4/AndroidManifest.xml:4:5-43
MERGED from [com.android.support.constraint:constraint-layout:1.0.2] /Users/toni/.gradle/caches/transforms-2/files-2.1/a820c02b64b1d0ef710388d46f9b7aa6/constraint-layout-1.0.2/AndroidManifest.xml:5:5-7:41
MERGED from [com.android.support.constraint:constraint-layout:1.0.2] /Users/toni/.gradle/caches/transforms-2/files-2.1/a820c02b64b1d0ef710388d46f9b7aa6/constraint-layout-1.0.2/AndroidManifest.xml:5:5-7:41
MERGED from [com.android.support:design:22.2.0] /Users/toni/.gradle/caches/transforms-2/files-2.1/7a605ed841c05abab4a688613094f768/design-22.2.0/AndroidManifest.xml:20:5-43
MERGED from [com.android.support:design:22.2.0] /Users/toni/.gradle/caches/transforms-2/files-2.1/7a605ed841c05abab4a688613094f768/design-22.2.0/AndroidManifest.xml:20:5-43
MERGED from [com.android.support:appcompat-v7:22.2.0] /Users/toni/.gradle/caches/transforms-2/files-2.1/dc044531f6dbd908e4ad63c1707bf147/appcompat-v7-22.2.0/AndroidManifest.xml:20:5-43
MERGED from [com.android.support:appcompat-v7:22.2.0] /Users/toni/.gradle/caches/transforms-2/files-2.1/dc044531f6dbd908e4ad63c1707bf147/appcompat-v7-22.2.0/AndroidManifest.xml:20:5-43
MERGED from [com.android.support:recyclerview-v7:22.2.0] /Users/toni/.gradle/caches/transforms-2/files-2.1/040597d2010986458b30033e13b2bf84/recyclerview-v7-22.2.0/AndroidManifest.xml:20:5-43
MERGED from [com.android.support:recyclerview-v7:22.2.0] /Users/toni/.gradle/caches/transforms-2/files-2.1/040597d2010986458b30033e13b2bf84/recyclerview-v7-22.2.0/AndroidManifest.xml:20:5-43
MERGED from [com.google.firebase:firebase-messaging:11.0.4] /Users/toni/.gradle/caches/transforms-2/files-2.1/afd02a6774fd2a273cc89f6dc44f635c/firebase-messaging-11.0.4/AndroidManifest.xml:17:5-43
MERGED from [com.google.firebase:firebase-messaging:11.0.4] /Users/toni/.gradle/caches/transforms-2/files-2.1/afd02a6774fd2a273cc89f6dc44f635c/firebase-messaging-11.0.4/AndroidManifest.xml:17:5-43
MERGED from [com.google.android.gms:play-services-ads:11.0.4] /Users/toni/.gradle/caches/transforms-2/files-2.1/a1c5c559252dad87aa75d4c887b558d1/play-services-ads-11.0.4/AndroidManifest.xml:17:5-43
MERGED from [com.google.android.gms:play-services-ads:11.0.4] /Users/toni/.gradle/caches/transforms-2/files-2.1/a1c5c559252dad87aa75d4c887b558d1/play-services-ads-11.0.4/AndroidManifest.xml:17:5-43
MERGED from [com.google.android.gms:play-services-location:11.0.4] /Users/toni/.gradle/caches/transforms-2/files-2.1/ddc2d76bba015527c3786df731c4e999/play-services-location-11.0.4/AndroidManifest.xml:3:5-43
MERGED from [com.google.android.gms:play-services-location:11.0.4] /Users/toni/.gradle/caches/transforms-2/files-2.1/ddc2d76bba015527c3786df731c4e999/play-services-location-11.0.4/AndroidManifest.xml:3:5-43
MERGED from [com.google.firebase:firebase-analytics:11.0.4] /Users/toni/.gradle/caches/transforms-2/files-2.1/21f41f56f291300a47d6c956a40c205d/firebase-analytics-11.0.4/AndroidManifest.xml:17:5-43
MERGED from [com.google.firebase:firebase-analytics:11.0.4] /Users/toni/.gradle/caches/transforms-2/files-2.1/21f41f56f291300a47d6c956a40c205d/firebase-analytics-11.0.4/AndroidManifest.xml:17:5-43
MERGED from [com.google.firebase:firebase-analytics-impl:11.0.4] /Users/toni/.gradle/caches/transforms-2/files-2.1/3e6c1acfda79bc19536aa0bcf5e44bf0/firebase-analytics-impl-11.0.4/AndroidManifest.xml:17:5-43
MERGED from [com.google.firebase:firebase-analytics-impl:11.0.4] /Users/toni/.gradle/caches/transforms-2/files-2.1/3e6c1acfda79bc19536aa0bcf5e44bf0/firebase-analytics-impl-11.0.4/AndroidManifest.xml:17:5-43
MERGED from [com.google.firebase:firebase-iid:11.0.4] /Users/toni/.gradle/caches/transforms-2/files-2.1/b473bf03b92bdec01d0f65e4f3f3a1ad/firebase-iid-11.0.4/AndroidManifest.xml:17:5-43
MERGED from [com.google.firebase:firebase-iid:11.0.4] /Users/toni/.gradle/caches/transforms-2/files-2.1/b473bf03b92bdec01d0f65e4f3f3a1ad/firebase-iid-11.0.4/AndroidManifest.xml:17:5-43
MERGED from [com.google.firebase:firebase-common:11.0.4] /Users/toni/.gradle/caches/transforms-2/files-2.1/4b1eba66e4e552fed9e7b1205d4b065a/firebase-common-11.0.4/AndroidManifest.xml:3:5-43
MERGED from [com.google.firebase:firebase-common:11.0.4] /Users/toni/.gradle/caches/transforms-2/files-2.1/4b1eba66e4e552fed9e7b1205d4b065a/firebase-common-11.0.4/AndroidManifest.xml:3:5-43
MERGED from [com.google.android.gms:play-services-ads-lite:11.0.4] /Users/toni/.gradle/caches/transforms-2/files-2.1/df68d9873d2a6faa3088b073efa14849/play-services-ads-lite-11.0.4/AndroidManifest.xml:22:5-43
MERGED from [com.google.android.gms:play-services-ads-lite:11.0.4] /Users/toni/.gradle/caches/transforms-2/files-2.1/df68d9873d2a6faa3088b073efa14849/play-services-ads-lite-11.0.4/AndroidManifest.xml:22:5-43
MERGED from [com.google.android.gms:play-services-clearcut:11.0.4] /Users/toni/.gradle/caches/transforms-2/files-2.1/593882478e0d6b313177ff0e37e7c4cb/play-services-clearcut-11.0.4/AndroidManifest.xml:17:5-43
MERGED from [com.google.android.gms:play-services-clearcut:11.0.4] /Users/toni/.gradle/caches/transforms-2/files-2.1/593882478e0d6b313177ff0e37e7c4cb/play-services-clearcut-11.0.4/AndroidManifest.xml:17:5-43
MERGED from [com.google.android.gms:play-services-safetynet:11.0.4] /Users/toni/.gradle/caches/transforms-2/files-2.1/795dd1e28bdb1d374fddf0de5dc029aa/play-services-safetynet-11.0.4/AndroidManifest.xml:17:5-43
MERGED from [com.google.android.gms:play-services-safetynet:11.0.4] /Users/toni/.gradle/caches/transforms-2/files-2.1/795dd1e28bdb1d374fddf0de5dc029aa/play-services-safetynet-11.0.4/AndroidManifest.xml:17:5-43
MERGED from [com.google.android.gms:play-services-base:11.0.4] /Users/toni/.gradle/caches/transforms-2/files-2.1/ab68c9472975602043b76751eb765750/play-services-base-11.0.4/AndroidManifest.xml:17:5-43
MERGED from [com.google.android.gms:play-services-base:11.0.4] /Users/toni/.gradle/caches/transforms-2/files-2.1/ab68c9472975602043b76751eb765750/play-services-base-11.0.4/AndroidManifest.xml:17:5-43
MERGED from [com.google.android.gms:play-services-gass:11.0.4] /Users/toni/.gradle/caches/transforms-2/files-2.1/2c3f4a36668a2c11413fb59a4942f26f/play-services-gass-11.0.4/AndroidManifest.xml:3:5-43
MERGED from [com.google.android.gms:play-services-gass:11.0.4] /Users/toni/.gradle/caches/transforms-2/files-2.1/2c3f4a36668a2c11413fb59a4942f26f/play-services-gass-11.0.4/AndroidManifest.xml:3:5-43
MERGED from [com.google.android.gms:play-services-tasks:11.0.4] /Users/toni/.gradle/caches/transforms-2/files-2.1/8e15687da029c205dc220d2371471690/play-services-tasks-11.0.4/AndroidManifest.xml:3:5-43
MERGED from [com.google.android.gms:play-services-tasks:11.0.4] /Users/toni/.gradle/caches/transforms-2/files-2.1/8e15687da029c205dc220d2371471690/play-services-tasks-11.0.4/AndroidManifest.xml:3:5-43
MERGED from [com.google.android.gms:play-services-basement:11.0.4] /Users/toni/.gradle/caches/transforms-2/files-2.1/a5c25c91643413c4847de03d398c4a2f/play-services-basement-11.0.4/AndroidManifest.xml:17:5-43
MERGED from [com.google.android.gms:play-services-basement:11.0.4] /Users/toni/.gradle/caches/transforms-2/files-2.1/a5c25c91643413c4847de03d398c4a2f/play-services-basement-11.0.4/AndroidManifest.xml:17:5-43
MERGED from [com.android.support:support-v4:26.1.0] /Users/toni/.gradle/caches/transforms-2/files-2.1/396d4851f8828002631185ff549de862/support-v4-26.1.0/AndroidManifest.xml:21:5-23:54
MERGED from [com.android.support:support-v4:26.1.0] /Users/toni/.gradle/caches/transforms-2/files-2.1/396d4851f8828002631185ff549de862/support-v4-26.1.0/AndroidManifest.xml:21:5-23:54
MERGED from [com.android.support:cardview-v7:22.2.0] /Users/toni/.gradle/caches/transforms-2/files-2.1/690b5fe214121ecbbc7f0cfcda118fbc/cardview-v7-22.2.0/AndroidManifest.xml:20:5-43
MERGED from [com.android.support:cardview-v7:22.2.0] /Users/toni/.gradle/caches/transforms-2/files-2.1/690b5fe214121ecbbc7f0cfcda118fbc/cardview-v7-22.2.0/AndroidManifest.xml:20:5-43
MERGED from [com.squareup.picasso:picasso:2.71828] /Users/toni/.gradle/caches/transforms-2/files-2.1/f4135b0f0f67409568f966ae3835f8a9/picasso-2.71828/AndroidManifest.xml:5:5-44
MERGED from [com.squareup.picasso:picasso:2.71828] /Users/toni/.gradle/caches/transforms-2/files-2.1/f4135b0f0f67409568f966ae3835f8a9/picasso-2.71828/AndroidManifest.xml:5:5-44
MERGED from [me.leolin:ShortcutBadger:1.1.21] /Users/toni/.gradle/caches/transforms-2/files-2.1/82af709f76ee4f922d798dbd4d5c207a/ShortcutBadger-1.1.21/AndroidManifest.xml:7:5-9:41
MERGED from [me.leolin:ShortcutBadger:1.1.21] /Users/toni/.gradle/caches/transforms-2/files-2.1/82af709f76ee4f922d798dbd4d5c207a/ShortcutBadger-1.1.21/AndroidManifest.xml:7:5-9:41
MERGED from [com.ablanco.zoomy:zoomy:1.0.0] /Users/toni/.gradle/caches/transforms-2/files-2.1/0d8730a132e12bc66444dbabc5b64b40/zoomy-1.0.0/AndroidManifest.xml:7:5-9:41
MERGED from [com.ablanco.zoomy:zoomy:1.0.0] /Users/toni/.gradle/caches/transforms-2/files-2.1/0d8730a132e12bc66444dbabc5b64b40/zoomy-1.0.0/AndroidManifest.xml:7:5-9:41
MERGED from [com.google.android.play:core:1.6.3] /Users/toni/.gradle/caches/transforms-2/files-2.1/4c37b9e4c9d478bb88b14169995438da/core-1.6.3/AndroidManifest.xml:4:3-70
MERGED from [com.google.android.play:core:1.6.3] /Users/toni/.gradle/caches/transforms-2/files-2.1/4c37b9e4c9d478bb88b14169995438da/core-1.6.3/AndroidManifest.xml:4:3-70
MERGED from [com.android.support:support-media-compat:26.1.0] /Users/toni/.gradle/caches/transforms-2/files-2.1/ae8863d4a545e526a667609d2bf4e482/support-media-compat-26.1.0/AndroidManifest.xml:21:5-23:63
MERGED from [com.android.support:support-media-compat:26.1.0] /Users/toni/.gradle/caches/transforms-2/files-2.1/ae8863d4a545e526a667609d2bf4e482/support-media-compat-26.1.0/AndroidManifest.xml:21:5-23:63
MERGED from [com.android.support:support-fragment:26.1.0] /Users/toni/.gradle/caches/transforms-2/files-2.1/ce437d9281bad04486162c3834ee1d75/support-fragment-26.1.0/AndroidManifest.xml:21:5-23:60
MERGED from [com.android.support:support-fragment:26.1.0] /Users/toni/.gradle/caches/transforms-2/files-2.1/ce437d9281bad04486162c3834ee1d75/support-fragment-26.1.0/AndroidManifest.xml:21:5-23:60
MERGED from [com.android.support:support-core-utils:26.1.0] /Users/toni/.gradle/caches/transforms-2/files-2.1/5555fef4487714d57d17e10d38a89759/support-core-utils-26.1.0/AndroidManifest.xml:21:5-23:61
MERGED from [com.android.support:support-core-utils:26.1.0] /Users/toni/.gradle/caches/transforms-2/files-2.1/5555fef4487714d57d17e10d38a89759/support-core-utils-26.1.0/AndroidManifest.xml:21:5-23:61
MERGED from [com.android.support:support-core-ui:26.1.0] /Users/toni/.gradle/caches/transforms-2/files-2.1/fa067c15d0c043b2d035b9a7a31c1afb/support-core-ui-26.1.0/AndroidManifest.xml:21:5-23:58
MERGED from [com.android.support:support-core-ui:26.1.0] /Users/toni/.gradle/caches/transforms-2/files-2.1/fa067c15d0c043b2d035b9a7a31c1afb/support-core-ui-26.1.0/AndroidManifest.xml:21:5-23:58
MERGED from [com.android.support:support-compat:26.1.0] /Users/toni/.gradle/caches/transforms-2/files-2.1/3fde149d1e63f728b4a05f29a68a4323/support-compat-26.1.0/AndroidManifest.xml:21:5-23:58
MERGED from [com.android.support:support-compat:26.1.0] /Users/toni/.gradle/caches/transforms-2/files-2.1/3fde149d1e63f728b4a05f29a68a4323/support-compat-26.1.0/AndroidManifest.xml:21:5-23:58
MERGED from [com.android.support:exifinterface:27.1.0] /Users/toni/.gradle/caches/transforms-2/files-2.1/ed1dd9becd7b28e222446a6a00b47569/exifinterface-27.1.0/AndroidManifest.xml:20:5-44
MERGED from [com.android.support:exifinterface:27.1.0] /Users/toni/.gradle/caches/transforms-2/files-2.1/ed1dd9becd7b28e222446a6a00b47569/exifinterface-27.1.0/AndroidManifest.xml:20:5-44
MERGED from [android.arch.lifecycle:runtime:1.0.0] /Users/toni/.gradle/caches/transforms-2/files-2.1/cb768713c927f18e66d3a77a377f0e67/runtime-1.0.0/AndroidManifest.xml:20:5-22:41
MERGED from [android.arch.lifecycle:runtime:1.0.0] /Users/toni/.gradle/caches/transforms-2/files-2.1/cb768713c927f18e66d3a77a377f0e67/runtime-1.0.0/AndroidManifest.xml:20:5-22:41
INJECTED from /Users/toni/Desktop/mobile-app-eperformance/app/src/main/AndroidManifest.xml
INJECTED from /Users/toni/Desktop/mobile-app-eperformance/app/src/main/AndroidManifest.xml
	tools:overrideLibrary
		ADDED from [com.android.support:support-v4:26.1.0] /Users/toni/.gradle/caches/transforms-2/files-2.1/396d4851f8828002631185ff549de862/support-v4-26.1.0/AndroidManifest.xml:23:9-51
	android:targetSdkVersion
		INJECTED from /Users/toni/Desktop/mobile-app-eperformance/app/src/main/AndroidManifest.xml
		ADDED from /Users/toni/Desktop/mobile-app-eperformance/app/src/main/AndroidManifest.xml
		INJECTED from /Users/toni/Desktop/mobile-app-eperformance/app/src/main/AndroidManifest.xml
	android:minSdkVersion
		INJECTED from /Users/toni/Desktop/mobile-app-eperformance/app/src/main/AndroidManifest.xml
		ADDED from /Users/toni/Desktop/mobile-app-eperformance/app/src/main/AndroidManifest.xml
		INJECTED from /Users/toni/Desktop/mobile-app-eperformance/app/src/main/AndroidManifest.xml
meta-data#android.support.FILE_PROVIDER_PATHS
ADDED from /Users/toni/Desktop/mobile-app-eperformance/app/src/main/AndroidManifest.xml:129:13-131:58
	android:resource
		ADDED from /Users/toni/Desktop/mobile-app-eperformance/app/src/main/AndroidManifest.xml:131:17-55
	android:name
		ADDED from /Users/toni/Desktop/mobile-app-eperformance/app/src/main/AndroidManifest.xml:130:17-67
service#com.google.firebase.messaging.FirebaseMessagingService
ADDED from [com.google.firebase:firebase-messaging:11.0.4] /Users/toni/.gradle/caches/transforms-2/files-2.1/afd02a6774fd2a273cc89f6dc44f635c/firebase-messaging-11.0.4/AndroidManifest.xml:23:9-27:19
	android:exported
		ADDED from [com.google.firebase:firebase-messaging:11.0.4] /Users/toni/.gradle/caches/transforms-2/files-2.1/afd02a6774fd2a273cc89f6dc44f635c/firebase-messaging-11.0.4/AndroidManifest.xml:23:88-111
	android:name
		ADDED from [com.google.firebase:firebase-messaging:11.0.4] /Users/toni/.gradle/caches/transforms-2/files-2.1/afd02a6774fd2a273cc89f6dc44f635c/firebase-messaging-11.0.4/AndroidManifest.xml:23:18-87
uses-permission#android.permission.WAKE_LOCK
ADDED from [com.google.firebase:firebase-analytics:11.0.4] /Users/toni/.gradle/caches/transforms-2/files-2.1/21f41f56f291300a47d6c956a40c205d/firebase-analytics-11.0.4/AndroidManifest.xml:22:5-67
MERGED from [com.google.firebase:firebase-analytics-impl:11.0.4] /Users/toni/.gradle/caches/transforms-2/files-2.1/3e6c1acfda79bc19536aa0bcf5e44bf0/firebase-analytics-impl-11.0.4/AndroidManifest.xml:22:5-67
MERGED from [com.google.firebase:firebase-analytics-impl:11.0.4] /Users/toni/.gradle/caches/transforms-2/files-2.1/3e6c1acfda79bc19536aa0bcf5e44bf0/firebase-analytics-impl-11.0.4/AndroidManifest.xml:22:5-67
MERGED from [com.google.firebase:firebase-iid:11.0.4] /Users/toni/.gradle/caches/transforms-2/files-2.1/b473bf03b92bdec01d0f65e4f3f3a1ad/firebase-iid-11.0.4/AndroidManifest.xml:21:5-67
MERGED from [com.google.firebase:firebase-iid:11.0.4] /Users/toni/.gradle/caches/transforms-2/files-2.1/b473bf03b92bdec01d0f65e4f3f3a1ad/firebase-iid-11.0.4/AndroidManifest.xml:21:5-67
	android:name
		ADDED from [com.google.firebase:firebase-analytics:11.0.4] /Users/toni/.gradle/caches/transforms-2/files-2.1/21f41f56f291300a47d6c956a40c205d/firebase-analytics-11.0.4/AndroidManifest.xml:22:22-65
receiver#com.google.android.gms.measurement.AppMeasurementReceiver
ADDED from [com.google.firebase:firebase-analytics:11.0.4] /Users/toni/.gradle/caches/transforms-2/files-2.1/21f41f56f291300a47d6c956a40c205d/firebase-analytics-11.0.4/AndroidManifest.xml:25:7-26:18
MERGED from [com.google.firebase:firebase-analytics-impl:11.0.4] /Users/toni/.gradle/caches/transforms-2/files-2.1/3e6c1acfda79bc19536aa0bcf5e44bf0/firebase-analytics-impl-11.0.4/AndroidManifest.xml:25:7-26:18
MERGED from [com.google.firebase:firebase-analytics-impl:11.0.4] /Users/toni/.gradle/caches/transforms-2/files-2.1/3e6c1acfda79bc19536aa0bcf5e44bf0/firebase-analytics-impl-11.0.4/AndroidManifest.xml:25:7-26:18
	android:enabled
		ADDED from [com.google.firebase:firebase-analytics:11.0.4] /Users/toni/.gradle/caches/transforms-2/files-2.1/21f41f56f291300a47d6c956a40c205d/firebase-analytics-11.0.4/AndroidManifest.xml:25:90-112
	android:exported
		ADDED from [com.google.firebase:firebase-analytics:11.0.4] /Users/toni/.gradle/caches/transforms-2/files-2.1/21f41f56f291300a47d6c956a40c205d/firebase-analytics-11.0.4/AndroidManifest.xml:25:113-137
	android:name
		ADDED from [com.google.firebase:firebase-analytics:11.0.4] /Users/toni/.gradle/caches/transforms-2/files-2.1/21f41f56f291300a47d6c956a40c205d/firebase-analytics-11.0.4/AndroidManifest.xml:25:17-89
receiver#com.google.android.gms.measurement.AppMeasurementInstallReferrerReceiver
ADDED from [com.google.firebase:firebase-analytics:11.0.4] /Users/toni/.gradle/caches/transforms-2/files-2.1/21f41f56f291300a47d6c956a40c205d/firebase-analytics-11.0.4/AndroidManifest.xml:27:7-31:18
	android:enabled
		ADDED from [com.google.firebase:firebase-analytics:11.0.4] /Users/toni/.gradle/caches/transforms-2/files-2.1/21f41f56f291300a47d6c956a40c205d/firebase-analytics-11.0.4/AndroidManifest.xml:27:162-184
	android:exported
		ADDED from [com.google.firebase:firebase-analytics:11.0.4] /Users/toni/.gradle/caches/transforms-2/files-2.1/21f41f56f291300a47d6c956a40c205d/firebase-analytics-11.0.4/AndroidManifest.xml:27:185-208
	android:permission
		ADDED from [com.google.firebase:firebase-analytics:11.0.4] /Users/toni/.gradle/caches/transforms-2/files-2.1/21f41f56f291300a47d6c956a40c205d/firebase-analytics-11.0.4/AndroidManifest.xml:27:105-161
	android:name
		ADDED from [com.google.firebase:firebase-analytics:11.0.4] /Users/toni/.gradle/caches/transforms-2/files-2.1/21f41f56f291300a47d6c956a40c205d/firebase-analytics-11.0.4/AndroidManifest.xml:27:17-104
intent-filter#action:name:com.android.vending.INSTALL_REFERRER
ADDED from [com.google.firebase:firebase-analytics:11.0.4] /Users/toni/.gradle/caches/transforms-2/files-2.1/21f41f56f291300a47d6c956a40c205d/firebase-analytics-11.0.4/AndroidManifest.xml:28:11-30:27
action#com.android.vending.INSTALL_REFERRER
ADDED from [com.google.firebase:firebase-analytics:11.0.4] /Users/toni/.gradle/caches/transforms-2/files-2.1/21f41f56f291300a47d6c956a40c205d/firebase-analytics-11.0.4/AndroidManifest.xml:29:15-76
	android:name
		ADDED from [com.google.firebase:firebase-analytics:11.0.4] /Users/toni/.gradle/caches/transforms-2/files-2.1/21f41f56f291300a47d6c956a40c205d/firebase-analytics-11.0.4/AndroidManifest.xml:29:23-74
service#com.google.android.gms.measurement.AppMeasurementService
ADDED from [com.google.firebase:firebase-analytics:11.0.4] /Users/toni/.gradle/caches/transforms-2/files-2.1/21f41f56f291300a47d6c956a40c205d/firebase-analytics-11.0.4/AndroidManifest.xml:32:7-137
MERGED from [com.google.firebase:firebase-analytics-impl:11.0.4] /Users/toni/.gradle/caches/transforms-2/files-2.1/3e6c1acfda79bc19536aa0bcf5e44bf0/firebase-analytics-impl-11.0.4/AndroidManifest.xml:27:7-137
MERGED from [com.google.firebase:firebase-analytics-impl:11.0.4] /Users/toni/.gradle/caches/transforms-2/files-2.1/3e6c1acfda79bc19536aa0bcf5e44bf0/firebase-analytics-impl-11.0.4/AndroidManifest.xml:27:7-137
	android:enabled
		ADDED from [com.google.firebase:firebase-analytics:11.0.4] /Users/toni/.gradle/caches/transforms-2/files-2.1/21f41f56f291300a47d6c956a40c205d/firebase-analytics-11.0.4/AndroidManifest.xml:32:88-110
	android:exported
		ADDED from [com.google.firebase:firebase-analytics:11.0.4] /Users/toni/.gradle/caches/transforms-2/files-2.1/21f41f56f291300a47d6c956a40c205d/firebase-analytics-11.0.4/AndroidManifest.xml:32:111-135
	android:name
		ADDED from [com.google.firebase:firebase-analytics:11.0.4] /Users/toni/.gradle/caches/transforms-2/files-2.1/21f41f56f291300a47d6c956a40c205d/firebase-analytics-11.0.4/AndroidManifest.xml:32:16-87
service#com.google.android.gms.measurement.AppMeasurementJobService
ADDED from [com.google.firebase:firebase-analytics:11.0.4] /Users/toni/.gradle/caches/transforms-2/files-2.1/21f41f56f291300a47d6c956a40c205d/firebase-analytics-11.0.4/AndroidManifest.xml:33:7-197
	android:enabled
		ADDED from [com.google.firebase:firebase-analytics:11.0.4] /Users/toni/.gradle/caches/transforms-2/files-2.1/21f41f56f291300a47d6c956a40c205d/firebase-analytics-11.0.4/AndroidManifest.xml:33:148-170
	android:exported
		ADDED from [com.google.firebase:firebase-analytics:11.0.4] /Users/toni/.gradle/caches/transforms-2/files-2.1/21f41f56f291300a47d6c956a40c205d/firebase-analytics-11.0.4/AndroidManifest.xml:33:171-195
	android:permission
		ADDED from [com.google.firebase:firebase-analytics:11.0.4] /Users/toni/.gradle/caches/transforms-2/files-2.1/21f41f56f291300a47d6c956a40c205d/firebase-analytics-11.0.4/AndroidManifest.xml:33:91-147
	android:name
		ADDED from [com.google.firebase:firebase-analytics:11.0.4] /Users/toni/.gradle/caches/transforms-2/files-2.1/21f41f56f291300a47d6c956a40c205d/firebase-analytics-11.0.4/AndroidManifest.xml:33:16-90
permission#${applicationId}.permission.C2D_MESSAGE
ADDED from [com.google.firebase:firebase-iid:11.0.4] /Users/toni/.gradle/caches/transforms-2/files-2.1/b473bf03b92bdec01d0f65e4f3f3a1ad/firebase-iid-11.0.4/AndroidManifest.xml:24:5-109
	android:protectionLevel
		ADDED from [com.google.firebase:firebase-iid:11.0.4] /Users/toni/.gradle/caches/transforms-2/files-2.1/b473bf03b92bdec01d0f65e4f3f3a1ad/firebase-iid-11.0.4/AndroidManifest.xml:24:72-107
	android:name
		ADDED from [com.google.firebase:firebase-iid:11.0.4] /Users/toni/.gradle/caches/transforms-2/files-2.1/b473bf03b92bdec01d0f65e4f3f3a1ad/firebase-iid-11.0.4/AndroidManifest.xml:24:17-71
permission#id.go.kotasurabaya.eperformance.permission.C2D_MESSAGE
ADDED from [com.google.firebase:firebase-iid:11.0.4] /Users/toni/.gradle/caches/transforms-2/files-2.1/b473bf03b92bdec01d0f65e4f3f3a1ad/firebase-iid-11.0.4/AndroidManifest.xml:24:5-109
	android:protectionLevel
		ADDED from [com.google.firebase:firebase-iid:11.0.4] /Users/toni/.gradle/caches/transforms-2/files-2.1/b473bf03b92bdec01d0f65e4f3f3a1ad/firebase-iid-11.0.4/AndroidManifest.xml:24:72-107
	android:name
		ADDED from [com.google.firebase:firebase-iid:11.0.4] /Users/toni/.gradle/caches/transforms-2/files-2.1/b473bf03b92bdec01d0f65e4f3f3a1ad/firebase-iid-11.0.4/AndroidManifest.xml:24:17-71
uses-permission#${applicationId}.permission.C2D_MESSAGE
ADDED from [com.google.firebase:firebase-iid:11.0.4] /Users/toni/.gradle/caches/transforms-2/files-2.1/b473bf03b92bdec01d0f65e4f3f3a1ad/firebase-iid-11.0.4/AndroidManifest.xml:26:5-78
	android:name
		ADDED from [com.google.firebase:firebase-iid:11.0.4] /Users/toni/.gradle/caches/transforms-2/files-2.1/b473bf03b92bdec01d0f65e4f3f3a1ad/firebase-iid-11.0.4/AndroidManifest.xml:26:22-76
uses-permission#id.go.kotasurabaya.eperformance.permission.C2D_MESSAGE
ADDED from [com.google.firebase:firebase-iid:11.0.4] /Users/toni/.gradle/caches/transforms-2/files-2.1/b473bf03b92bdec01d0f65e4f3f3a1ad/firebase-iid-11.0.4/AndroidManifest.xml:26:5-78
	android:name
		ADDED from [com.google.firebase:firebase-iid:11.0.4] /Users/toni/.gradle/caches/transforms-2/files-2.1/b473bf03b92bdec01d0f65e4f3f3a1ad/firebase-iid-11.0.4/AndroidManifest.xml:26:22-76
receiver#com.google.firebase.iid.FirebaseInstanceIdReceiver
ADDED from [com.google.firebase:firebase-iid:11.0.4] /Users/toni/.gradle/caches/transforms-2/files-2.1/b473bf03b92bdec01d0f65e4f3f3a1ad/firebase-iid-11.0.4/AndroidManifest.xml:30:9-35:20
	android:exported
		ADDED from [com.google.firebase:firebase-iid:11.0.4] /Users/toni/.gradle/caches/transforms-2/files-2.1/b473bf03b92bdec01d0f65e4f3f3a1ad/firebase-iid-11.0.4/AndroidManifest.xml:30:85-108
	android:permission
		ADDED from [com.google.firebase:firebase-iid:11.0.4] /Users/toni/.gradle/caches/transforms-2/files-2.1/b473bf03b92bdec01d0f65e4f3f3a1ad/firebase-iid-11.0.4/AndroidManifest.xml:30:109-169
	android:name
		ADDED from [com.google.firebase:firebase-iid:11.0.4] /Users/toni/.gradle/caches/transforms-2/files-2.1/b473bf03b92bdec01d0f65e4f3f3a1ad/firebase-iid-11.0.4/AndroidManifest.xml:30:19-84
intent-filter#action:name:com.google.android.c2dm.intent.RECEIVE+category:name:${applicationId}
ADDED from [com.google.firebase:firebase-iid:11.0.4] /Users/toni/.gradle/caches/transforms-2/files-2.1/b473bf03b92bdec01d0f65e4f3f3a1ad/firebase-iid-11.0.4/AndroidManifest.xml:31:13-34:29
intent-filter#action:name:com.google.android.c2dm.intent.RECEIVE+category:name:id.go.kotasurabaya.eperformance
ADDED from [com.google.firebase:firebase-iid:11.0.4] /Users/toni/.gradle/caches/transforms-2/files-2.1/b473bf03b92bdec01d0f65e4f3f3a1ad/firebase-iid-11.0.4/AndroidManifest.xml:31:13-34:29
action#com.google.android.c2dm.intent.RECEIVE
ADDED from [com.google.firebase:firebase-iid:11.0.4] /Users/toni/.gradle/caches/transforms-2/files-2.1/b473bf03b92bdec01d0f65e4f3f3a1ad/firebase-iid-11.0.4/AndroidManifest.xml:32:17-80
	android:name
		ADDED from [com.google.firebase:firebase-iid:11.0.4] /Users/toni/.gradle/caches/transforms-2/files-2.1/b473bf03b92bdec01d0f65e4f3f3a1ad/firebase-iid-11.0.4/AndroidManifest.xml:32:25-78
category#${applicationId}
ADDED from [com.google.firebase:firebase-iid:11.0.4] /Users/toni/.gradle/caches/transforms-2/files-2.1/b473bf03b92bdec01d0f65e4f3f3a1ad/firebase-iid-11.0.4/AndroidManifest.xml:33:17-60
	android:name
		ADDED from [com.google.firebase:firebase-iid:11.0.4] /Users/toni/.gradle/caches/transforms-2/files-2.1/b473bf03b92bdec01d0f65e4f3f3a1ad/firebase-iid-11.0.4/AndroidManifest.xml:33:27-58
category#id.go.kotasurabaya.eperformance
ADDED from [com.google.firebase:firebase-iid:11.0.4] /Users/toni/.gradle/caches/transforms-2/files-2.1/b473bf03b92bdec01d0f65e4f3f3a1ad/firebase-iid-11.0.4/AndroidManifest.xml:33:17-60
	android:name
		ADDED from [com.google.firebase:firebase-iid:11.0.4] /Users/toni/.gradle/caches/transforms-2/files-2.1/b473bf03b92bdec01d0f65e4f3f3a1ad/firebase-iid-11.0.4/AndroidManifest.xml:33:27-58
receiver#com.google.firebase.iid.FirebaseInstanceIdInternalReceiver
ADDED from [com.google.firebase:firebase-iid:11.0.4] /Users/toni/.gradle/caches/transforms-2/files-2.1/b473bf03b92bdec01d0f65e4f3f3a1ad/firebase-iid-11.0.4/AndroidManifest.xml:39:9-119
	android:exported
		ADDED from [com.google.firebase:firebase-iid:11.0.4] /Users/toni/.gradle/caches/transforms-2/files-2.1/b473bf03b92bdec01d0f65e4f3f3a1ad/firebase-iid-11.0.4/AndroidManifest.xml:39:93-117
	android:name
		ADDED from [com.google.firebase:firebase-iid:11.0.4] /Users/toni/.gradle/caches/transforms-2/files-2.1/b473bf03b92bdec01d0f65e4f3f3a1ad/firebase-iid-11.0.4/AndroidManifest.xml:39:19-92
service#com.google.firebase.iid.FirebaseInstanceIdService
ADDED from [com.google.firebase:firebase-iid:11.0.4] /Users/toni/.gradle/caches/transforms-2/files-2.1/b473bf03b92bdec01d0f65e4f3f3a1ad/firebase-iid-11.0.4/AndroidManifest.xml:43:9-47:19
	android:exported
		ADDED from [com.google.firebase:firebase-iid:11.0.4] /Users/toni/.gradle/caches/transforms-2/files-2.1/b473bf03b92bdec01d0f65e4f3f3a1ad/firebase-iid-11.0.4/AndroidManifest.xml:43:83-106
	android:name
		ADDED from [com.google.firebase:firebase-iid:11.0.4] /Users/toni/.gradle/caches/transforms-2/files-2.1/b473bf03b92bdec01d0f65e4f3f3a1ad/firebase-iid-11.0.4/AndroidManifest.xml:43:18-82
provider#com.google.firebase.provider.FirebaseInitProvider
ADDED from [com.google.firebase:firebase-common:11.0.4] /Users/toni/.gradle/caches/transforms-2/files-2.1/4b1eba66e4e552fed9e7b1205d4b065a/firebase-common-11.0.4/AndroidManifest.xml:6:9-194
	android:authorities
		ADDED from [com.google.firebase:firebase-common:11.0.4] /Users/toni/.gradle/caches/transforms-2/files-2.1/4b1eba66e4e552fed9e7b1205d4b065a/firebase-common-11.0.4/AndroidManifest.xml:6:19-78
	android:exported
		ADDED from [com.google.firebase:firebase-common:11.0.4] /Users/toni/.gradle/caches/transforms-2/files-2.1/4b1eba66e4e552fed9e7b1205d4b065a/firebase-common-11.0.4/AndroidManifest.xml:6:144-168
	android:initOrder
		ADDED from [com.google.firebase:firebase-common:11.0.4] /Users/toni/.gradle/caches/transforms-2/files-2.1/4b1eba66e4e552fed9e7b1205d4b065a/firebase-common-11.0.4/AndroidManifest.xml:6:169-192
	android:name
		ADDED from [com.google.firebase:firebase-common:11.0.4] /Users/toni/.gradle/caches/transforms-2/files-2.1/4b1eba66e4e552fed9e7b1205d4b065a/firebase-common-11.0.4/AndroidManifest.xml:6:79-143
activity#com.google.android.gms.common.api.GoogleApiActivity
ADDED from [com.google.android.gms:play-services-base:11.0.4] /Users/toni/.gradle/caches/transforms-2/files-2.1/ab68c9472975602043b76751eb765750/play-services-base-11.0.4/AndroidManifest.xml:19:9-172
	android:exported
		ADDED from [com.google.android.gms:play-services-base:11.0.4] /Users/toni/.gradle/caches/transforms-2/files-2.1/ab68c9472975602043b76751eb765750/play-services-base-11.0.4/AndroidManifest.xml:19:146-170
	android:theme
		ADDED from [com.google.android.gms:play-services-base:11.0.4] /Users/toni/.gradle/caches/transforms-2/files-2.1/ab68c9472975602043b76751eb765750/play-services-base-11.0.4/AndroidManifest.xml:19:86-145
	android:name
		ADDED from [com.google.android.gms:play-services-base:11.0.4] /Users/toni/.gradle/caches/transforms-2/files-2.1/ab68c9472975602043b76751eb765750/play-services-base-11.0.4/AndroidManifest.xml:19:19-85
meta-data#android.support.VERSION
ADDED from [com.android.support:support-v4:26.1.0] /Users/toni/.gradle/caches/transforms-2/files-2.1/396d4851f8828002631185ff549de862/support-v4-26.1.0/AndroidManifest.xml:26:9-28:38
MERGED from [com.android.support:support-media-compat:26.1.0] /Users/toni/.gradle/caches/transforms-2/files-2.1/ae8863d4a545e526a667609d2bf4e482/support-media-compat-26.1.0/AndroidManifest.xml:26:9-28:38
MERGED from [com.android.support:support-media-compat:26.1.0] /Users/toni/.gradle/caches/transforms-2/files-2.1/ae8863d4a545e526a667609d2bf4e482/support-media-compat-26.1.0/AndroidManifest.xml:26:9-28:38
MERGED from [com.android.support:support-fragment:26.1.0] /Users/toni/.gradle/caches/transforms-2/files-2.1/ce437d9281bad04486162c3834ee1d75/support-fragment-26.1.0/AndroidManifest.xml:26:9-28:38
MERGED from [com.android.support:support-fragment:26.1.0] /Users/toni/.gradle/caches/transforms-2/files-2.1/ce437d9281bad04486162c3834ee1d75/support-fragment-26.1.0/AndroidManifest.xml:26:9-28:38
MERGED from [com.android.support:support-core-utils:26.1.0] /Users/toni/.gradle/caches/transforms-2/files-2.1/5555fef4487714d57d17e10d38a89759/support-core-utils-26.1.0/AndroidManifest.xml:26:9-28:38
MERGED from [com.android.support:support-core-utils:26.1.0] /Users/toni/.gradle/caches/transforms-2/files-2.1/5555fef4487714d57d17e10d38a89759/support-core-utils-26.1.0/AndroidManifest.xml:26:9-28:38
MERGED from [com.android.support:support-core-ui:26.1.0] /Users/toni/.gradle/caches/transforms-2/files-2.1/fa067c15d0c043b2d035b9a7a31c1afb/support-core-ui-26.1.0/AndroidManifest.xml:26:9-28:38
MERGED from [com.android.support:support-core-ui:26.1.0] /Users/toni/.gradle/caches/transforms-2/files-2.1/fa067c15d0c043b2d035b9a7a31c1afb/support-core-ui-26.1.0/AndroidManifest.xml:26:9-28:38
MERGED from [com.android.support:support-compat:26.1.0] /Users/toni/.gradle/caches/transforms-2/files-2.1/3fde149d1e63f728b4a05f29a68a4323/support-compat-26.1.0/AndroidManifest.xml:26:9-28:38
MERGED from [com.android.support:support-compat:26.1.0] /Users/toni/.gradle/caches/transforms-2/files-2.1/3fde149d1e63f728b4a05f29a68a4323/support-compat-26.1.0/AndroidManifest.xml:26:9-28:38
	android:value
		ADDED from [com.android.support:support-v4:26.1.0] /Users/toni/.gradle/caches/transforms-2/files-2.1/396d4851f8828002631185ff549de862/support-v4-26.1.0/AndroidManifest.xml:28:13-35
	android:name
		ADDED from [com.android.support:support-v4:26.1.0] /Users/toni/.gradle/caches/transforms-2/files-2.1/396d4851f8828002631185ff549de862/support-v4-26.1.0/AndroidManifest.xml:27:13-51
provider#com.squareup.picasso.PicassoProvider
ADDED from [com.squareup.picasso:picasso:2.71828] /Users/toni/.gradle/caches/transforms-2/files-2.1/f4135b0f0f67409568f966ae3835f8a9/picasso-2.71828/AndroidManifest.xml:8:9-11:40
	android:authorities
		ADDED from [com.squareup.picasso:picasso:2.71828] /Users/toni/.gradle/caches/transforms-2/files-2.1/f4135b0f0f67409568f966ae3835f8a9/picasso-2.71828/AndroidManifest.xml:10:13-72
	android:exported
		ADDED from [com.squareup.picasso:picasso:2.71828] /Users/toni/.gradle/caches/transforms-2/files-2.1/f4135b0f0f67409568f966ae3835f8a9/picasso-2.71828/AndroidManifest.xml:11:13-37
	android:name
		ADDED from [com.squareup.picasso:picasso:2.71828] /Users/toni/.gradle/caches/transforms-2/files-2.1/f4135b0f0f67409568f966ae3835f8a9/picasso-2.71828/AndroidManifest.xml:9:13-64
uses-permission#com.sonymobile.home.permission.PROVIDER_INSERT_BADGE
ADDED from [me.leolin:ShortcutBadger:1.1.21] /Users/toni/.gradle/caches/transforms-2/files-2.1/82af709f76ee4f922d798dbd4d5c207a/ShortcutBadger-1.1.21/AndroidManifest.xml:28:5-92
	android:name
		ADDED from [me.leolin:ShortcutBadger:1.1.21] /Users/toni/.gradle/caches/transforms-2/files-2.1/82af709f76ee4f922d798dbd4d5c207a/ShortcutBadger-1.1.21/AndroidManifest.xml:28:22-89
uses-permission#com.anddoes.launcher.permission.UPDATE_COUNT
ADDED from [me.leolin:ShortcutBadger:1.1.21] /Users/toni/.gradle/caches/transforms-2/files-2.1/82af709f76ee4f922d798dbd4d5c207a/ShortcutBadger-1.1.21/AndroidManifest.xml:31:5-84
	android:name
		ADDED from [me.leolin:ShortcutBadger:1.1.21] /Users/toni/.gradle/caches/transforms-2/files-2.1/82af709f76ee4f922d798dbd4d5c207a/ShortcutBadger-1.1.21/AndroidManifest.xml:31:22-81
uses-permission#com.majeur.launcher.permission.UPDATE_BADGE
ADDED from [me.leolin:ShortcutBadger:1.1.21] /Users/toni/.gradle/caches/transforms-2/files-2.1/82af709f76ee4f922d798dbd4d5c207a/ShortcutBadger-1.1.21/AndroidManifest.xml:34:5-83
	android:name
		ADDED from [me.leolin:ShortcutBadger:1.1.21] /Users/toni/.gradle/caches/transforms-2/files-2.1/82af709f76ee4f922d798dbd4d5c207a/ShortcutBadger-1.1.21/AndroidManifest.xml:34:22-80
uses-permission#com.huawei.android.launcher.permission.CHANGE_BADGE
ADDED from [me.leolin:ShortcutBadger:1.1.21] /Users/toni/.gradle/caches/transforms-2/files-2.1/82af709f76ee4f922d798dbd4d5c207a/ShortcutBadger-1.1.21/AndroidManifest.xml:37:5-91
	android:name
		ADDED from [me.leolin:ShortcutBadger:1.1.21] /Users/toni/.gradle/caches/transforms-2/files-2.1/82af709f76ee4f922d798dbd4d5c207a/ShortcutBadger-1.1.21/AndroidManifest.xml:37:22-88
uses-permission#com.huawei.android.launcher.permission.READ_SETTINGS
ADDED from [me.leolin:ShortcutBadger:1.1.21] /Users/toni/.gradle/caches/transforms-2/files-2.1/82af709f76ee4f922d798dbd4d5c207a/ShortcutBadger-1.1.21/AndroidManifest.xml:38:5-92
	android:name
		ADDED from [me.leolin:ShortcutBadger:1.1.21] /Users/toni/.gradle/caches/transforms-2/files-2.1/82af709f76ee4f922d798dbd4d5c207a/ShortcutBadger-1.1.21/AndroidManifest.xml:38:22-89
uses-permission#com.huawei.android.launcher.permission.WRITE_SETTINGS
ADDED from [me.leolin:ShortcutBadger:1.1.21] /Users/toni/.gradle/caches/transforms-2/files-2.1/82af709f76ee4f922d798dbd4d5c207a/ShortcutBadger-1.1.21/AndroidManifest.xml:39:5-93
	android:name
		ADDED from [me.leolin:ShortcutBadger:1.1.21] /Users/toni/.gradle/caches/transforms-2/files-2.1/82af709f76ee4f922d798dbd4d5c207a/ShortcutBadger-1.1.21/AndroidManifest.xml:39:22-90
uses-permission#android.permission.READ_APP_BADGE
ADDED from [me.leolin:ShortcutBadger:1.1.21] /Users/toni/.gradle/caches/transforms-2/files-2.1/82af709f76ee4f922d798dbd4d5c207a/ShortcutBadger-1.1.21/AndroidManifest.xml:42:5-73
	android:name
		ADDED from [me.leolin:ShortcutBadger:1.1.21] /Users/toni/.gradle/caches/transforms-2/files-2.1/82af709f76ee4f922d798dbd4d5c207a/ShortcutBadger-1.1.21/AndroidManifest.xml:42:22-70
uses-permission#com.oppo.launcher.permission.READ_SETTINGS
ADDED from [me.leolin:ShortcutBadger:1.1.21] /Users/toni/.gradle/caches/transforms-2/files-2.1/82af709f76ee4f922d798dbd4d5c207a/ShortcutBadger-1.1.21/AndroidManifest.xml:45:5-82
	android:name
		ADDED from [me.leolin:ShortcutBadger:1.1.21] /Users/toni/.gradle/caches/transforms-2/files-2.1/82af709f76ee4f922d798dbd4d5c207a/ShortcutBadger-1.1.21/AndroidManifest.xml:45:22-79
uses-permission#com.oppo.launcher.permission.WRITE_SETTINGS
ADDED from [me.leolin:ShortcutBadger:1.1.21] /Users/toni/.gradle/caches/transforms-2/files-2.1/82af709f76ee4f922d798dbd4d5c207a/ShortcutBadger-1.1.21/AndroidManifest.xml:46:5-83
	android:name
		ADDED from [me.leolin:ShortcutBadger:1.1.21] /Users/toni/.gradle/caches/transforms-2/files-2.1/82af709f76ee4f922d798dbd4d5c207a/ShortcutBadger-1.1.21/AndroidManifest.xml:46:22-80
uses-permission#me.everything.badger.permission.BADGE_COUNT_READ
ADDED from [me.leolin:ShortcutBadger:1.1.21] /Users/toni/.gradle/caches/transforms-2/files-2.1/82af709f76ee4f922d798dbd4d5c207a/ShortcutBadger-1.1.21/AndroidManifest.xml:49:5-88
	android:name
		ADDED from [me.leolin:ShortcutBadger:1.1.21] /Users/toni/.gradle/caches/transforms-2/files-2.1/82af709f76ee4f922d798dbd4d5c207a/ShortcutBadger-1.1.21/AndroidManifest.xml:49:22-85
uses-permission#me.everything.badger.permission.BADGE_COUNT_WRITE
ADDED from [me.leolin:ShortcutBadger:1.1.21] /Users/toni/.gradle/caches/transforms-2/files-2.1/82af709f76ee4f922d798dbd4d5c207a/ShortcutBadger-1.1.21/AndroidManifest.xml:50:5-89
	android:name
		ADDED from [me.leolin:ShortcutBadger:1.1.21] /Users/toni/.gradle/caches/transforms-2/files-2.1/82af709f76ee4f922d798dbd4d5c207a/ShortcutBadger-1.1.21/AndroidManifest.xml:50:22-86
activity#com.google.android.play.core.missingsplits.PlayCoreMissingSplitsActivity
ADDED from [com.google.android.play:core:1.6.3] /Users/toni/.gradle/caches/transforms-2/files-2.1/4c37b9e4c9d478bb88b14169995438da/core-1.6.3/AndroidManifest.xml:8:5-271
	android:process
		ADDED from [com.google.android.play:core:1.6.3] /Users/toni/.gradle/caches/transforms-2/files-2.1/4c37b9e4c9d478bb88b14169995438da/core-1.6.3/AndroidManifest.xml:8:152-203
	android:enabled
		ADDED from [com.google.android.play:core:1.6.3] /Users/toni/.gradle/caches/transforms-2/files-2.1/4c37b9e4c9d478bb88b14169995438da/core-1.6.3/AndroidManifest.xml:8:103-126
	android:stateNotNeeded
		ADDED from [com.google.android.play:core:1.6.3] /Users/toni/.gradle/caches/transforms-2/files-2.1/4c37b9e4c9d478bb88b14169995438da/core-1.6.3/AndroidManifest.xml:8:240-269
	android:launchMode
		ADDED from [com.google.android.play:core:1.6.3] /Users/toni/.gradle/caches/transforms-2/files-2.1/4c37b9e4c9d478bb88b14169995438da/core-1.6.3/AndroidManifest.xml:8:204-239
	android:exported
		ADDED from [com.google.android.play:core:1.6.3] /Users/toni/.gradle/caches/transforms-2/files-2.1/4c37b9e4c9d478bb88b14169995438da/core-1.6.3/AndroidManifest.xml:8:127-151
	android:name
		ADDED from [com.google.android.play:core:1.6.3] /Users/toni/.gradle/caches/transforms-2/files-2.1/4c37b9e4c9d478bb88b14169995438da/core-1.6.3/AndroidManifest.xml:8:15-102
activity#com.google.android.play.core.common.PlayCoreDialogWrapperActivity
ADDED from [com.google.android.play:core:1.6.3] /Users/toni/.gradle/caches/transforms-2/files-2.1/4c37b9e4c9d478bb88b14169995438da/core-1.6.3/AndroidManifest.xml:9:5-278
	android:process
		ADDED from [com.google.android.play:core:1.6.3] /Users/toni/.gradle/caches/transforms-2/files-2.1/4c37b9e4c9d478bb88b14169995438da/core-1.6.3/AndroidManifest.xml:9:175-226
	android:enabled
		ADDED from [com.google.android.play:core:1.6.3] /Users/toni/.gradle/caches/transforms-2/files-2.1/4c37b9e4c9d478bb88b14169995438da/core-1.6.3/AndroidManifest.xml:9:96-119
	android:stateNotNeeded
		ADDED from [com.google.android.play:core:1.6.3] /Users/toni/.gradle/caches/transforms-2/files-2.1/4c37b9e4c9d478bb88b14169995438da/core-1.6.3/AndroidManifest.xml:9:145-174
	android:exported
		ADDED from [com.google.android.play:core:1.6.3] /Users/toni/.gradle/caches/transforms-2/files-2.1/4c37b9e4c9d478bb88b14169995438da/core-1.6.3/AndroidManifest.xml:9:120-144
	android:theme
		ADDED from [com.google.android.play:core:1.6.3] /Users/toni/.gradle/caches/transforms-2/files-2.1/4c37b9e4c9d478bb88b14169995438da/core-1.6.3/AndroidManifest.xml:9:227-276
	android:name
		ADDED from [com.google.android.play:core:1.6.3] /Users/toni/.gradle/caches/transforms-2/files-2.1/4c37b9e4c9d478bb88b14169995438da/core-1.6.3/AndroidManifest.xml:9:15-95
meta-data#android.arch.lifecycle.VERSION
ADDED from [android.arch.lifecycle:runtime:1.0.0] /Users/toni/.gradle/caches/transforms-2/files-2.1/cb768713c927f18e66d3a77a377f0e67/runtime-1.0.0/AndroidManifest.xml:25:9-27:47
	android:value
		ADDED from [android.arch.lifecycle:runtime:1.0.0] /Users/toni/.gradle/caches/transforms-2/files-2.1/cb768713c927f18e66d3a77a377f0e67/runtime-1.0.0/AndroidManifest.xml:27:13-44
	android:name
		ADDED from [android.arch.lifecycle:runtime:1.0.0] /Users/toni/.gradle/caches/transforms-2/files-2.1/cb768713c927f18e66d3a77a377f0e67/runtime-1.0.0/AndroidManifest.xml:26:13-58
