{
  "Ademe": {
    "link": "https://www.ademe.fr/",
    "alt": "Logo Ademe",
    "arialabel": "Se rendre sur le site de l'Ademe'",
    "name": "Logo_ADEME.svg",
    "height": "80",
    "width": "191"
  },
  "Megalis": {
    "link": "https://www.megalis.bretagne.bzh/",
    "alt": "Logo Megalis",
    "arialabel": "Se rendre sur le site de Megalis",
    "name": "MegalisBretagne(Sm)_HD.png",
    "height": "80",
    "width": "191"
  },
  "FranceNationVerte": {
    "link": "https://www.ecologie.gouv.fr/gouvernement-lance-nouveau-plan-covoiturage-du-quotidien-150-millions-deuros",
    "alt": "Logo France Nation Verte",
    "arialabel": "",
    "name": "FranceNationVerte_Logo_RVB.png",
    "height": "80",
    "width": "191"
  },
  "Bretagne_Region": {
    "link": "https://www.bretagne.bzh",
    "alt": "Logo région Bretagne",
    "arialabel": "Se rendre sur le site de la région Bretagne",
    "name": "RB_NB.png",
    "height": "80",
    "width": "191"
  }
}
