<?xml version="1.0" encoding="utf-8"?>
<!-- Generator: Adobe Illustrator 24.1.2, SVG Export Plug-In . SVG Version: 6.00 Build 0)  -->
<svg version="1.1" xmlns="http://www.w3.org/2000/svg" xmlns:xlink="http://www.w3.org/1999/xlink" x="0px" y="0px" width="1920px"
	 height="1080px" viewBox="0 0 1920 1080" style="enable-background:new 0 0 1920 1080;" xml:space="preserve">
<style type="text/css">
	.st0{fill:#304A9A;}
	.st1{fill:#ACB7D7;}
	.st2{opacity:0.4;}
	.st3{fill:#E1E1E1;}
	.st4{fill:#ECECEC;}
	.st5{fill:#F5F5F5;}
	.st6{fill:#FFFFFF;}
</style>
<g id="Calque_2">
	<rect class="st0" width="1920" height="1080"/>
	<g>
		<path class="st1" d="M901.8,234.2c-15,0-27.2,12.2-27.2,27.2c0,15,12.2,27.2,27.2,27.2s27.2-12.2,27.2-27.2
			C929,246.4,916.8,234.2,901.8,234.2z"/>
		<path class="st1" d="M1012.1,234.2c-15,0-27.2,12.2-27.2,27.2c0,15,12.2,27.2,27.2,27.2s27.2-12.2,27.2-27.2
			C1039.3,246.4,1027.1,234.2,1012.1,234.2z"/>
		<path class="st1" d="M960,135.3c-82.8,0-150,67.2-150,150c0,82.8,67.2,150,150,150c82.8,0,150-67.2,150-150
			C1110,202.4,1042.8,135.3,960,135.3z M901.8,307.7c-25.6,0-46.4-20.8-46.4-46.4c0-25.6,20.8-46.4,46.4-46.4
			c25.6,0,46.4,20.8,46.4,46.4C948.1,286.9,927.3,307.7,901.8,307.7z M1012.1,370.8c-25.6,0-46.4-20.8-46.4-46.4h19.2
			c0,15,12.2,27.2,27.2,27.2s27.2-12.2,27.2-27.2h19.2C1058.5,350,1037.7,370.8,1012.1,370.8z M1012.1,307.7
			c-25.6,0-46.4-20.8-46.4-46.4c0-25.6,20.8-46.4,46.4-46.4c25.6,0,46.4,20.8,46.4,46.4C1058.5,286.9,1037.7,307.7,1012.1,307.7z"/>
	</g>
</g>
<g id="Calque_1">
	<g class="st2">
		<g>
			<path class="st3" d="M927.6,773.8l-5.2-9.1l-8.2,1.2l-6.8-8.5l3.5-8.5l-9.1-6.1l-6.8,6.9l-9-1.6l-3.6-10.6l-10.9,1.2l-0.6,9.2
				l-8.1,4.1l-8.6-6.1l-8.7,6.4l4.5,9.8l-5.2,7.8l-9.4-0.5l-2.5,11.6l9,3.5l0.8,9.8l-9.3,5.3l4.4,10.1l9.6-1.5l6.4,7.4l-3.3,9.2
				l8.8,6.2l6.9-7.4l9.6,2.6l3,9.9l10.6-0.7l1.4-8.9l9.1-5.2l7.4,5.9l9.4-7l-4.8-8.3l4.6-8.3l9.5,0.7l2.9-10.8l-8.2-4.4l-1.1-9.9
				L927.6,773.8z M890.6,805.7c-10.3,5.9-23.4,2.4-29.3-7.9s-2.4-23.4,7.9-29.3c10.3-5.9,23.4-2.4,29.3,7.9
				C904.4,786.6,900.9,799.8,890.6,805.7z"/>
			<g>
				<path class="st3" d="M889.4,780.8c-0.1,0-0.5-0.9-1.7-2.2c-1.2-1.3-3.5-2.9-6.7-3.3c-1.6-0.2-3.4-0.1-5.1,0.5
					c-1.7,0.6-3.5,1.7-4.8,3.4c-0.7,0.8-1.3,1.7-1.7,2.7c-0.4,1-0.7,2.1-0.9,3.2c-0.3,2.3,0.2,4.7,1.4,6.8c1.2,2.1,3.1,3.7,5.2,4.6
					c1,0.5,2.1,0.8,3.2,0.9c1.1,0.1,2.2,0.1,3.2-0.1c2.1-0.3,3.9-1.3,5.3-2.5c1.4-1.2,2.4-2.7,3.1-4.1c1.3-3,1-5.7,0.5-7.4
					C889.9,781.7,889.3,780.8,889.4,780.8c0,0,0,0,0.1,0.2c0.1,0.1,0.2,0.3,0.3,0.5c0.1,0.2,0.3,0.5,0.4,0.8
					c0.1,0.3,0.3,0.7,0.4,1.1c0.3,0.9,0.5,2,0.5,3.3c0,1.3-0.2,2.8-0.9,4.3c-0.6,1.5-1.6,3-3.1,4.3c-1.5,1.2-3.3,2.3-5.5,2.6
					c-1.1,0.2-2.2,0.2-3.3,0.1c-1.1-0.1-2.3-0.4-3.3-0.9c-2.2-0.9-4.1-2.6-5.4-4.8c-1.2-2.2-1.7-4.7-1.4-7c0.1-1.2,0.4-2.3,0.9-3.3
					c0.5-1,1-2,1.8-2.8c1.4-1.7,3.2-2.8,5-3.4c1.8-0.6,3.7-0.7,5.3-0.5c1.6,0.2,3,0.8,4.1,1.4c1.1,0.7,2,1.4,2.6,2
					c0.3,0.3,0.6,0.6,0.8,0.9c0.2,0.3,0.4,0.5,0.5,0.7c0.1,0.2,0.2,0.3,0.3,0.5C889.4,780.7,889.4,780.8,889.4,780.8z"/>
			</g>
			<g>
				<path class="st3" d="M899.6,756.9c0.1,0.1-2.8,4.7-6.6,10.3c-3.7,5.6-6.8,10.2-6.9,10.1c-0.1-0.1,2.8-4.7,6.6-10.3
					C896.4,761.4,899.5,756.8,899.6,756.9z"/>
			</g>
			<g>
				<path class="st3" d="M910.1,794.5c0,0.1-1.1-0.3-2.9-0.8c-1.8-0.5-4.2-1.3-7-1.9c-2.7-0.7-5.2-1.2-7.1-1.5
					c-1.8-0.3-3-0.5-2.9-0.6c0,0,0.3,0,0.8,0c0.5,0,1.3,0.1,2.2,0.3c1.8,0.3,4.4,0.7,7.1,1.4c2.8,0.7,5.2,1.4,7,2.1
					c0.9,0.3,1.6,0.6,2.1,0.8C909.9,794.3,910.2,794.4,910.1,794.5z"/>
			</g>
			<g>
				<path class="st3" d="M884.4,796.9c0.1,0,0.4,0.9,0.9,2.5c0.5,1.6,1.1,3.8,1.7,6.2c0.6,2.5,1,4.7,1.3,6.3
					c0.3,1.6,0.4,2.6,0.3,2.7c-0.1,0-0.3-1-0.6-2.6c-0.3-1.6-0.8-3.8-1.4-6.3c-0.6-2.4-1.1-4.6-1.5-6.2
					C884.5,798,884.3,797,884.4,796.9z"/>
			</g>
			<g>
				<path class="st3" d="M872.8,795.6c0.1,0.1-1.8,3.4-4.3,7.5c-2.5,4.1-4.6,7.4-4.7,7.3c-0.1-0.1,1.8-3.4,4.3-7.5
					C870.6,798.9,872.7,795.6,872.8,795.6z"/>
			</g>
			<g>
				<path class="st3" d="M871.1,759.1c0.1,0,1.3,3.5,2.7,8c1.4,4.4,2.4,8.1,2.3,8.1c-0.1,0-1.3-3.5-2.7-8
					C872,762.7,871,759.1,871.1,759.1z"/>
			</g>
			<g>
				<path class="st3" d="M868.7,784.3c0,0.1-3-0.1-6.7-0.4c-3.7-0.4-6.7-0.7-6.7-0.8c0-0.1,3,0.1,6.7,0.4
					C865.7,783.8,868.7,784.2,868.7,784.3z"/>
			</g>
			<g>
				
					<ellipse transform="matrix(0.1644 -0.9864 0.9864 0.1644 -40.7588 1524.8031)" class="st3" cx="879.6" cy="786.5" rx="8.9" ry="8.9"/>
				<g>
					<path class="st4" d="M883.8,786.5c0,0-0.5-0.3-1.2-0.7c-0.7-0.4-1.9-0.9-3.2-1c-1.3-0.1-2.5,0.1-3.3,0.3
						c-0.8,0.2-1.3,0.5-1.3,0.4c0,0,0.4-0.4,1.2-0.7c0.8-0.3,2.1-0.6,3.5-0.5c1.4,0.1,2.5,0.7,3.3,1.2
						C883.5,786.1,883.9,786.5,883.8,786.5z"/>
				</g>
				<g>
					<path class="st4" d="M880.3,781.3c0.1,0.1-1,1.7-1.4,4.1c-0.4,2.4,0,4.3-0.1,4.3c-0.1,0-0.7-1.9-0.3-4.4
						C878.9,782.9,880.2,781.3,880.3,781.3z"/>
				</g>
			</g>
		</g>
		<g>
			<path class="st5" d="M898.7,689.4l-2.6-4.6l-4.1,0.6l-3.4-4.3l1.8-4.3l-4.6-3l-3.4,3.5l-4.5-0.8l-1.8-5.3l-5.5,0.6l-0.3,4.6
				l-4.1,2.1l-4.3-3.1l-4.4,3.2l2.3,4.9l-2.6,3.9l-4.7-0.3l-1.2,5.9l4.5,1.7l0.4,4.9l-4.7,2.7l2.2,5.1l4.8-0.8l3.2,3.7l-1.7,4.6
				l4.4,3.1l3.5-3.7l4.8,1.3l1.5,5l5.3-0.4l0.7-4.5l4.6-2.6l3.7,3l4.7-3.5l-2.4-4.2l2.3-4.2l4.8,0.4l1.5-5.4l-4.1-2.2l-0.5-5
				L898.7,689.4z M880.1,705.4c-5.2,3-11.8,1.2-14.7-4c-3-5.2-1.2-11.8,4-14.7s11.8-1.2,14.7,4C887,695.8,885.2,702.4,880.1,705.4z"
				/>
			<g>
				<path class="st5" d="M879.5,692.9c0,0-0.3-0.4-0.9-1.1c-0.6-0.6-1.7-1.4-3.3-1.6c-0.8-0.1-1.7,0-2.6,0.3
					c-0.9,0.3-1.8,0.9-2.4,1.7c-0.3,0.4-0.6,0.9-0.8,1.4c-0.2,0.5-0.4,1.1-0.4,1.6c-0.1,1.1,0.1,2.4,0.7,3.4c0.6,1,1.5,1.9,2.6,2.3
					c0.5,0.2,1.1,0.4,1.6,0.4c0.5,0.1,1.1,0.1,1.6,0c1-0.2,2-0.7,2.7-1.3c0.7-0.6,1.2-1.4,1.5-2.1c0.6-1.5,0.5-2.9,0.3-3.7
					C879.7,693.3,879.4,692.9,879.5,692.9C879.5,692.9,879.5,692.9,879.5,692.9c0.1,0.1,0.1,0.2,0.2,0.3c0.1,0.1,0.1,0.2,0.2,0.4
					c0.1,0.2,0.1,0.3,0.2,0.6c0.1,0.4,0.2,1,0.2,1.6c0,0.6-0.1,1.4-0.4,2.2c-0.3,0.8-0.8,1.5-1.6,2.2c-0.7,0.6-1.7,1.1-2.8,1.3
					c-0.5,0.1-1.1,0.1-1.7,0.1c-0.6-0.1-1.1-0.2-1.7-0.5c-1.1-0.5-2.1-1.3-2.7-2.4c-0.6-1.1-0.9-2.4-0.7-3.5
					c0.1-0.6,0.2-1.2,0.5-1.7c0.2-0.5,0.5-1,0.9-1.4c0.7-0.8,1.6-1.4,2.5-1.7c0.9-0.3,1.8-0.4,2.7-0.3c0.8,0.1,1.5,0.4,2.1,0.7
					c0.6,0.3,1,0.7,1.3,1c0.2,0.2,0.3,0.3,0.4,0.5c0.1,0.1,0.2,0.3,0.3,0.4C879.3,692.7,879.4,692.7,879.5,692.9
					C879.4,692.9,879.5,692.9,879.5,692.9z"/>
			</g>
			<g>
				<path class="st5" d="M884.6,680.9c0,0-1.4,2.4-3.3,5.2c-1.9,2.8-3.4,5.1-3.5,5.1c0,0,1.4-2.4,3.3-5.2
					C883,683.1,884.5,680.8,884.6,680.9z"/>
			</g>
			<g>
				<path class="st5" d="M889.9,699.8c0,0-0.6-0.2-1.4-0.4c-0.9-0.3-2.1-0.6-3.5-1c-1.4-0.3-2.6-0.6-3.6-0.7
					c-0.9-0.2-1.5-0.3-1.5-0.3c0,0,0.1,0,0.4,0c0.3,0,0.6,0.1,1.1,0.1c0.9,0.1,2.2,0.4,3.6,0.7c1.4,0.3,2.6,0.7,3.5,1
					c0.4,0.2,0.8,0.3,1,0.4C889.8,699.7,889.9,699.8,889.9,699.8z"/>
			</g>
			<g>
				<path class="st5" d="M876.9,701c0,0,0.2,0.5,0.4,1.3c0.2,0.8,0.5,1.9,0.8,3.1c0.3,1.2,0.5,2.4,0.6,3.2c0.1,0.8,0.2,1.3,0.2,1.3
					c0,0-0.1-0.5-0.3-1.3c-0.2-0.8-0.4-1.9-0.7-3.2c-0.3-1.2-0.6-2.3-0.8-3.1C877,701.5,876.9,701,876.9,701z"/>
			</g>
			<g>
				<path class="st5" d="M871.1,700.4c0,0-0.9,1.7-2.2,3.8c-1.2,2.1-2.3,3.7-2.3,3.7c0,0,0.9-1.7,2.2-3.8
					C870,702,871,700.3,871.1,700.4z"/>
			</g>
			<g>
				<path class="st5" d="M870.3,681.9c0.1,0,0.7,1.8,1.3,4c0.7,2.2,1.2,4.1,1.1,4.1s-0.7-1.8-1.3-4
					C870.7,683.8,870.2,682,870.3,681.9z"/>
			</g>
			<g>
				<path class="st5" d="M869,694.7c0,0.1-1.5,0-3.4-0.2c-1.9-0.2-3.4-0.4-3.4-0.4c0-0.1,1.5,0,3.4,0.2
					C867.5,694.4,869,694.6,869,694.7z"/>
			</g>
			<g>
				<path class="st5" d="M878.4,693.5c1.2,2.1,0.5,4.9-1.6,6.1c-2.1,1.2-4.9,0.5-6.1-1.6s-0.5-4.9,1.6-6.1
					C874.4,690.7,877.1,691.4,878.4,693.5z"/>
				<g>
					<path class="st4" d="M876.7,695.8c0,0-0.2-0.2-0.6-0.4c-0.4-0.2-0.9-0.4-1.6-0.5c-0.7-0.1-1.3,0-1.7,0.2
						c-0.4,0.1-0.7,0.3-0.7,0.2c0,0,0.2-0.2,0.6-0.4c0.4-0.2,1-0.3,1.7-0.2c0.7,0.1,1.3,0.3,1.6,0.6
						C876.5,695.5,876.7,695.8,876.7,695.8z"/>
				</g>
				<g>
					<path class="st4" d="M874.9,693.2c0.1,0-0.5,0.9-0.7,2.1c-0.2,1.2,0,2.2-0.1,2.2c0,0-0.4-1-0.1-2.2
						C874.2,693.9,874.8,693.1,874.9,693.2z"/>
				</g>
			</g>
		</g>
		<g>
			<path class="st5" d="M1093.8,795.2l-6.6-11.5l-10.4,1.5l-8.6-10.8l4.4-10.7l-11.6-7.7l-8.6,8.7l-11.4-2l-4.6-13.4l-13.8,1.5
				l-0.8,11.7l-10.3,5.2l-10.9-7.7l-11.1,8.1l5.7,12.4l-6.6,9.9l-12-0.6l-3.1,14.7l11.4,4.4l1,12.4l-11.8,6.8l5.6,12.8l12.2-1.9
				l8.1,9.3l-4.2,11.6l11.2,7.9l8.7-9.4l12.1,3.3l3.8,12.5l13.5-0.9l1.7-11.2l11.5-6.6l9.4,7.5l11.9-8.9l-6-10.5l5.9-10.5l12.1,0.9
				l3.7-13.7l-10.4-5.6l-1.4-12.5L1093.8,795.2z M1046.9,835.6c-13,7.5-29.6,3-37.1-10c-7.5-13-3-29.6,10-37.1
				c13-7.5,29.6-3,37.1,10C1064.4,811.5,1059.9,828.1,1046.9,835.6z"/>
			<g>
				<path class="st5" d="M1045.4,804.1c-0.1,0-0.6-1.1-2.2-2.7c-1.6-1.6-4.4-3.6-8.4-4.1c-2-0.2-4.3-0.1-6.5,0.7
					c-2.2,0.8-4.4,2.2-6.1,4.2c-0.9,1-1.6,2.2-2.1,3.5c-0.6,1.3-0.9,2.7-1.1,4.1c-0.4,2.9,0.3,5.9,1.8,8.6c1.5,2.6,3.9,4.7,6.5,5.9
					c1.3,0.6,2.7,1,4.1,1.1c1.4,0.2,2.8,0.1,4.1-0.1c2.6-0.4,4.9-1.7,6.8-3.2c1.8-1.5,3.1-3.4,3.9-5.3c1.6-3.7,1.3-7.2,0.7-9.4
					C1046.1,805.2,1045.3,804.1,1045.4,804.1c0,0,0.1,0.1,0.1,0.2c0.1,0.2,0.2,0.4,0.3,0.6c0.2,0.3,0.3,0.6,0.5,1
					c0.2,0.4,0.4,0.9,0.5,1.4c0.4,1.1,0.6,2.5,0.6,4.1c0,1.6-0.3,3.5-1.1,5.4c-0.8,1.9-2.1,3.9-3.9,5.4c-1.9,1.6-4.2,2.9-7,3.3
					c-1.3,0.3-2.8,0.3-4.2,0.1c-1.4-0.1-2.9-0.5-4.2-1.1c-2.8-1.2-5.2-3.3-6.8-6.1c-1.6-2.8-2.2-6-1.8-8.9c0.2-1.5,0.6-2.9,1.1-4.2
					c0.6-1.3,1.3-2.5,2.2-3.6c1.8-2.1,4.1-3.5,6.4-4.3c2.3-0.8,4.6-0.9,6.7-0.7c2.1,0.3,3.8,1,5.2,1.8c1.4,0.8,2.5,1.7,3.3,2.6
					c0.4,0.4,0.7,0.8,1,1.2c0.3,0.3,0.5,0.7,0.6,0.9c0.1,0.2,0.3,0.4,0.3,0.6C1045.4,804,1045.4,804.1,1045.4,804.1z"/>
			</g>
			<g>
				<path class="st5" d="M1058.4,773.8c0.1,0.1-3.6,5.9-8.3,13.1c-4.7,7.2-8.6,12.9-8.7,12.8c-0.1-0.1,3.6-5.9,8.3-13.1
					C1054.3,779.5,1058.2,773.7,1058.4,773.8z"/>
			</g>
			<g>
				<path class="st5" d="M1071.7,821.4c0,0.1-1.4-0.4-3.6-1.1c-2.2-0.7-5.3-1.6-8.8-2.5c-3.5-0.8-6.7-1.5-9-1.9
					c-2.3-0.4-3.7-0.6-3.7-0.7c0,0,0.4,0,1,0c0.7,0.1,1.6,0.2,2.8,0.3c2.3,0.3,5.5,0.9,9,1.7c3.5,0.9,6.6,1.8,8.8,2.6
					c1.1,0.4,2,0.7,2.6,1C1071.4,821.2,1071.7,821.4,1071.7,821.4z"/>
			</g>
			<g>
				<path class="st5" d="M1039,824.5c0.1,0,0.5,1.2,1.1,3.2c0.6,2,1.4,4.8,2.1,7.9c0.7,3.1,1.3,5.9,1.6,8c0.3,2.1,0.5,3.3,0.4,3.4
					c-0.1,0-0.3-1.3-0.8-3.3c-0.4-2-1-4.9-1.7-8c-0.7-3.1-1.4-5.9-1.9-7.9C1039.3,825.8,1039,824.6,1039,824.5z"/>
			</g>
			<g>
				<path class="st5" d="M1024.3,822.9c0.1,0.1-2.3,4.4-5.5,9.6c-3.1,5.2-5.8,9.4-5.9,9.3c-0.1-0.1,2.3-4.4,5.5-9.6
					C1021.6,827,1024.2,822.8,1024.3,822.9z"/>
			</g>
			<g>
				<path class="st5" d="M1022.3,776.5c0.1,0,1.7,4.5,3.4,10.1c1.7,5.6,3,10.2,2.9,10.3c-0.1,0-1.7-4.5-3.4-10.1
					C1023.4,781.2,1022.1,776.6,1022.3,776.5z"/>
			</g>
			<g>
				<path class="st5" d="M1019.2,808.5c0,0.1-3.8-0.1-8.5-0.5c-4.7-0.4-8.5-0.9-8.4-1.1c0-0.1,3.8,0.1,8.5,0.5
					C1015.4,807.9,1019.2,808.4,1019.2,808.5z"/>
			</g>
			<g>
				
					<ellipse transform="matrix(0.2645 -0.9644 0.9644 0.2645 -22.6385 1592.8113)" class="st5" cx="1033" cy="811.2" rx="11.2" ry="11.2"/>
				<g>
					<path class="st4" d="M1038.4,811.3c-0.1,0.1-0.6-0.4-1.5-0.9c-0.9-0.5-2.4-1.1-4-1.3c-1.6-0.2-3.2,0.1-4.2,0.4
						c-1,0.3-1.7,0.6-1.7,0.6c0-0.1,0.5-0.5,1.6-0.9c1-0.4,2.6-0.8,4.4-0.6c1.7,0.2,3.2,0.9,4.1,1.5
						C1038,810.7,1038.4,811.3,1038.4,811.3z"/>
				</g>
				<g>
					<path class="st4" d="M1033.9,804.8c0.1,0.1-1.2,2.2-1.8,5.2c-0.6,3,0,5.5-0.2,5.5c-0.1,0.1-0.9-2.5-0.4-5.6
						C1032.1,806.7,1033.8,804.7,1033.9,804.8z"/>
				</g>
			</g>
		</g>
		<g>
			<path class="st5" d="M969.1,848.9l-3.3-5.7l-5.1,0.7l-4.2-5.3l2.2-5.3l-5.7-3.8l-4.2,4.3l-5.6-1l-2.3-6.6l-6.8,0.7l-0.4,5.8
				l-5.1,2.6l-5.4-3.8l-5.4,4l2.8,6.1l-3.2,4.9l-5.9-0.3l-1.5,7.2l5.6,2.2l0.5,6.1l-5.8,3.3l2.8,6.3l6-0.9l4,4.6l-2.1,5.7l5.5,3.9
				l4.3-4.6l6,1.6l1.9,6.1l6.6-0.4l0.9-5.5l5.7-3.3l4.6,3.7l5.9-4.4l-3-5.2l2.9-5.2l5.9,0.4l1.8-6.7l-5.1-2.8l-0.7-6.1L969.1,848.9z
				 M946.1,868.8c-6.4,3.7-14.6,1.5-18.3-4.9c-3.7-6.4-1.5-14.6,4.9-18.3c6.4-3.7,14.6-1.5,18.3,4.9
				C954.7,856.9,952.5,865.1,946.1,868.8z"/>
			<g>
				<path class="st5" d="M945.3,853.3c0,0-0.3-0.5-1.1-1.4c-0.8-0.8-2.2-1.8-4.1-2c-1-0.1-2.1-0.1-3.2,0.3c-1.1,0.4-2.2,1.1-3,2.1
					c-0.4,0.5-0.8,1.1-1.1,1.7c-0.3,0.6-0.5,1.3-0.5,2c-0.2,1.4,0.1,2.9,0.9,4.2c0.8,1.3,1.9,2.3,3.2,2.9c0.6,0.3,1.3,0.5,2,0.5
					c0.7,0.1,1.4,0.1,2-0.1c1.3-0.2,2.4-0.8,3.3-1.5c0.9-0.7,1.5-1.7,1.9-2.6c0.8-1.8,0.6-3.6,0.3-4.6
					C945.6,853.9,945.3,853.3,945.3,853.3C945.3,853.3,945.4,853.3,945.3,853.3c0.1,0.2,0.2,0.3,0.2,0.4c0.1,0.1,0.2,0.3,0.2,0.5
					c0.1,0.2,0.2,0.4,0.3,0.7c0.2,0.5,0.3,1.2,0.3,2c0,0.8-0.2,1.7-0.5,2.7c-0.4,0.9-1,1.9-1.9,2.7c-0.9,0.8-2.1,1.4-3.4,1.6
					c-0.7,0.1-1.4,0.1-2.1,0.1c-0.7-0.1-1.4-0.3-2.1-0.6c-1.4-0.6-2.5-1.6-3.3-3c-0.8-1.4-1.1-2.9-0.9-4.4c0.1-0.7,0.3-1.4,0.6-2.1
					c0.3-0.6,0.7-1.2,1.1-1.8c0.9-1,2-1.7,3.1-2.1c1.1-0.4,2.3-0.5,3.3-0.3c1,0.1,1.9,0.5,2.6,0.9c0.7,0.4,1.2,0.9,1.6,1.3
					c0.2,0.2,0.4,0.4,0.5,0.6c0.1,0.2,0.2,0.3,0.3,0.5c0.1,0.1,0.1,0.2,0.2,0.3C945.3,853.3,945.3,853.3,945.3,853.3z"/>
			</g>
			<g>
				<path class="st5" d="M951.7,838.4c0.1,0-1.8,2.9-4.1,6.4c-2.3,3.5-4.2,6.3-4.3,6.3c-0.1,0,1.8-2.9,4.1-6.4
					C949.7,841.2,951.6,838.4,951.7,838.4z"/>
			</g>
			<g>
				<path class="st5" d="M958.3,861.8c0,0-0.7-0.2-1.8-0.5c-1.1-0.3-2.6-0.8-4.3-1.2c-1.7-0.4-3.3-0.7-4.4-0.9
					c-1.1-0.2-1.8-0.3-1.8-0.4c0,0,0.2,0,0.5,0c0.3,0,0.8,0.1,1.4,0.2c1.1,0.2,2.7,0.4,4.4,0.9c1.7,0.4,3.2,0.9,4.3,1.3
					c0.5,0.2,1,0.4,1.3,0.5C958.1,861.7,958.3,861.8,958.3,861.8z"/>
			</g>
			<g>
				<path class="st5" d="M942.2,863.4c0,0,0.3,0.6,0.6,1.6c0.3,1,0.7,2.4,1,3.9c0.4,1.5,0.6,2.9,0.8,3.9c0.2,1,0.2,1.6,0.2,1.7
					c0,0-0.2-0.6-0.4-1.6c-0.2-1-0.5-2.4-0.9-3.9c-0.4-1.5-0.7-2.9-1-3.9C942.3,864,942.1,863.4,942.2,863.4z"/>
			</g>
			<g>
				<path class="st5" d="M935,862.5c0.1,0-1.1,2.1-2.7,4.7c-1.5,2.6-2.8,4.6-2.9,4.6c-0.1,0,1.1-2.1,2.7-4.7
					C933.6,864.6,934.9,862.5,935,862.5z"/>
			</g>
			<g>
				<path class="st5" d="M933.9,839.8c0.1,0,0.8,2.2,1.7,5c0.9,2.8,1.5,5,1.4,5.1c-0.1,0-0.8-2.2-1.7-5
					C934.5,842,933.9,839.8,933.9,839.8z"/>
			</g>
			<g>
				<path class="st5" d="M932.4,855.5c0,0.1-1.9,0-4.2-0.3c-2.3-0.2-4.2-0.5-4.1-0.5c0-0.1,1.9,0,4.2,0.3
					C930.6,855.2,932.4,855.4,932.4,855.5z"/>
			</g>
			<g>
				
					<ellipse transform="matrix(0.306 -0.952 0.952 0.306 -163.924 1488.7887)" class="st5" cx="939.2" cy="856.8" rx="5.5" ry="5.5"/>
				<g>
					<path class="st4" d="M941.9,856.9c0,0-0.3-0.2-0.8-0.4c-0.5-0.3-1.2-0.5-2-0.6c-0.8-0.1-1.6,0-2.1,0.2
						c-0.5,0.2-0.8,0.3-0.8,0.3c0,0,0.3-0.2,0.8-0.4c0.5-0.2,1.3-0.4,2.2-0.3c0.9,0.1,1.6,0.4,2,0.7
						C941.7,856.6,941.9,856.9,941.9,856.9z"/>
				</g>
				<g>
					<path class="st4" d="M939.7,853.6c0.1,0-0.6,1.1-0.9,2.6c-0.3,1.5,0,2.7-0.1,2.7c-0.1,0-0.5-1.2-0.2-2.7
						C938.8,854.6,939.6,853.6,939.7,853.6z"/>
				</g>
			</g>
		</g>
		<g>
			<path class="st3" d="M1010.3,706.9l-5.2-9.1l-8.2,1.2l-6.8-8.5l3.5-8.5l-9.1-6.1l-6.8,6.9l-9-1.6l-3.6-10.6l-10.9,1.2l-0.6,9.2
				l-8.1,4.1l-8.6-6.1l-8.7,6.4l4.5,9.8l-5.2,7.8l-9.4-0.5l-2.5,11.6l9,3.5l0.8,9.8l-9.3,5.3l4.4,10.1l9.6-1.5l6.4,7.4l-3.3,9.2
				l8.8,6.2l6.9-7.4l9.6,2.6l3,9.9l10.6-0.7l1.4-8.9l9.1-5.2l7.4,5.9l9.4-7l-4.8-8.3l4.6-8.3l9.5,0.7l2.9-10.8l-8.2-4.4l-1.1-9.9
				L1010.3,706.9z M973.4,738.7c-10.3,5.9-23.4,2.4-29.3-7.9c-5.9-10.3-2.4-23.4,7.9-29.3c10.3-5.9,23.4-2.4,29.3,7.9
				C987.2,719.7,983.6,732.8,973.4,738.7z"/>
			<g>
				<path class="st3" d="M972.2,713.9c-0.1,0-0.5-0.9-1.7-2.2c-1.2-1.3-3.5-2.9-6.7-3.3c-1.6-0.2-3.4-0.1-5.1,0.5
					c-1.7,0.6-3.5,1.7-4.8,3.4c-0.7,0.8-1.3,1.7-1.7,2.7c-0.4,1-0.7,2.1-0.9,3.2c-0.3,2.3,0.2,4.7,1.4,6.8c1.2,2.1,3.1,3.7,5.2,4.6
					c1,0.5,2.1,0.8,3.2,0.9c1.1,0.1,2.2,0.1,3.2-0.1c2.1-0.3,3.9-1.3,5.3-2.5c1.4-1.2,2.4-2.7,3.1-4.1c1.3-3,1-5.7,0.5-7.4
					C972.7,714.7,972.1,713.9,972.2,713.9c0,0,0,0,0.1,0.2c0.1,0.1,0.2,0.3,0.3,0.5c0.1,0.2,0.3,0.5,0.4,0.8
					c0.1,0.3,0.3,0.7,0.4,1.1c0.3,0.9,0.5,2,0.5,3.3c0,1.3-0.2,2.8-0.9,4.3c-0.6,1.5-1.6,3-3.1,4.3c-1.5,1.2-3.3,2.3-5.5,2.6
					c-1.1,0.2-2.2,0.2-3.3,0.1c-1.1-0.1-2.3-0.4-3.3-0.9c-2.2-0.9-4.1-2.6-5.4-4.8c-1.2-2.2-1.7-4.7-1.4-7c0.1-1.2,0.4-2.3,0.9-3.3
					c0.5-1,1-2,1.8-2.8c1.4-1.7,3.2-2.8,5-3.4c1.8-0.6,3.7-0.7,5.3-0.5c1.6,0.2,3,0.8,4.1,1.4c1.1,0.7,2,1.4,2.6,2
					c0.3,0.3,0.6,0.6,0.8,0.9c0.2,0.3,0.4,0.5,0.5,0.7c0.1,0.2,0.2,0.3,0.3,0.5C972.1,713.8,972.2,713.9,972.2,713.9z"/>
			</g>
			<g>
				<path class="st3" d="M982.4,690c0.1,0.1-2.8,4.7-6.6,10.3c-3.7,5.6-6.8,10.2-6.9,10.1c-0.1-0.1,2.8-4.7,6.6-10.3
					C979.2,694.4,982.3,689.9,982.4,690z"/>
			</g>
			<g>
				<path class="st3" d="M992.9,727.5c0,0.1-1.1-0.3-2.9-0.8c-1.8-0.5-4.2-1.3-7-1.9c-2.7-0.7-5.2-1.2-7.1-1.5
					c-1.8-0.3-3-0.5-2.9-0.6c0,0,0.3,0,0.8,0c0.5,0,1.3,0.1,2.2,0.3c1.8,0.3,4.4,0.7,7.1,1.4c2.8,0.7,5.2,1.4,7,2.1
					c0.9,0.3,1.6,0.6,2.1,0.8C992.7,727.4,992.9,727.5,992.9,727.5z"/>
			</g>
			<g>
				<path class="st3" d="M967.1,730c0.1,0,0.4,0.9,0.9,2.5c0.5,1.6,1.1,3.8,1.7,6.2c0.6,2.5,1,4.7,1.3,6.3c0.3,1.6,0.4,2.6,0.3,2.7
					c-0.1,0-0.3-1-0.6-2.6c-0.3-1.6-0.8-3.8-1.4-6.3c-0.6-2.4-1.1-4.6-1.5-6.2C967.3,731,967.1,730,967.1,730z"/>
			</g>
			<g>
				<path class="st3" d="M955.5,728.7c0.1,0.1-1.8,3.4-4.3,7.5c-2.5,4.1-4.6,7.4-4.7,7.3c-0.1-0.1,1.8-3.4,4.3-7.5
					C953.3,731.9,955.4,728.6,955.5,728.7z"/>
			</g>
			<g>
				<path class="st3" d="M953.9,692.1c0.1,0,1.3,3.5,2.7,8c1.4,4.4,2.4,8.1,2.3,8.1c-0.1,0-1.3-3.5-2.7-8
					C954.8,695.8,953.8,692.2,953.9,692.1z"/>
			</g>
			<g>
				<path class="st3" d="M951.5,717.4c0,0.1-3-0.1-6.7-0.4c-3.7-0.4-6.7-0.7-6.7-0.8c0-0.1,3,0.1,6.7,0.4
					C948.5,716.9,951.5,717.3,951.5,717.4z"/>
			</g>
			<g>
				
					<ellipse transform="matrix(0.9629 -0.2697 0.2697 0.9629 -158.3931 286.1948)" class="st3" cx="962.3" cy="719.5" rx="8.9" ry="8.9"/>
				<g>
					<path class="st4" d="M966.6,719.6c0,0-0.5-0.3-1.2-0.7c-0.7-0.4-1.9-0.9-3.2-1c-1.3-0.1-2.5,0.1-3.3,0.3
						c-0.8,0.2-1.3,0.5-1.3,0.4c0,0,0.4-0.4,1.2-0.7c0.8-0.3,2.1-0.6,3.5-0.5c1.4,0.1,2.5,0.7,3.3,1.2
						C966.3,719.1,966.6,719.6,966.6,719.6z"/>
				</g>
				<g>
					<path class="st4" d="M963.1,714.4c0.1,0.1-1,1.7-1.4,4.1c-0.4,2.4,0,4.3-0.1,4.3c-0.1,0-0.7-1.9-0.3-4.4
						C961.7,716,963,714.3,963.1,714.4z"/>
				</g>
			</g>
		</g>
		<g>
			<g>
				<path class="st4" d="M849.1,724.3l-1.4-2.4l-2.1,0.3l-1.8-2.2l0.9-2.2l-2.4-1.6l-1.8,1.8l-2.3-0.4l-0.9-2.7l-2.8,0.3l-0.2,2.4
					l-2.1,1.1l-2.2-1.6l-2.3,1.6l1.2,2.5l-1.3,2l-2.4-0.1l-0.6,3l2.3,0.9l0.2,2.5l-2.4,1.4l1.2,2.6l2.5-0.4l1.7,1.9l-0.9,2.4
					l2.3,1.6l1.8-1.9l2.5,0.7l0.8,2.6l2.8-0.2l0.4-2.3l2.4-1.4l1.9,1.5l2.4-1.8l-1.2-2.1l1.2-2.2l2.5,0.2l0.8-2.8l-2.1-1.2l-0.3-2.6
					L849.1,724.3z M839.5,732.5c-2.7,1.5-6.1,0.6-7.6-2.1c-1.5-2.7-0.6-6.1,2.1-7.6c2.7-1.5,6.1-0.6,7.6,2.1
					C843.1,727.6,842.2,731,839.5,732.5z"/>
			</g>
			<g>
				<g>
					<path class="st4" d="M839.2,726.1c0,0-0.2-0.2-0.5-0.5c-0.3-0.3-0.9-0.7-1.7-0.8c-0.8-0.1-1.8,0.2-2.5,1
						c-0.7,0.8-0.9,2.1-0.3,3.1c0.6,1.1,1.8,1.5,2.8,1.3c1-0.2,1.8-0.9,2.1-1.6c0.3-0.7,0.3-1.4,0.2-1.9
						C839.3,726.4,839.2,726.1,839.2,726.1c0,0,0.2,0.2,0.4,0.6c0.2,0.4,0.3,1.2-0.1,2c-0.3,0.8-1.1,1.7-2.3,1.9
						c-1.1,0.2-2.6-0.3-3.3-1.5c-0.7-1.2-0.4-2.7,0.3-3.6c0.8-0.9,1.9-1.2,2.8-1c0.9,0.1,1.5,0.6,1.8,1
						C839.1,725.8,839.2,726.1,839.2,726.1z"/>
				</g>
			</g>
			<g>
				<g>
					<path class="st4" d="M841.8,719.9c0.1,0.1-0.6,1.3-1.6,2.8c-1,1.5-1.8,2.6-1.9,2.5c-0.1-0.1,0.6-1.3,1.6-2.8
						C840.9,721,841.7,719.9,841.8,719.9z"/>
				</g>
			</g>
			<g>
				<g>
					<path class="st4" d="M844.6,729.6c0,0.1-1.2-0.2-2.6-0.6c-1.4-0.3-2.6-0.6-2.6-0.7c0-0.1,1.2-0.1,2.7,0.3
						C843.5,729,844.6,729.5,844.6,729.6z"/>
				</g>
			</g>
			<g>
				<g>
					<path class="st4" d="M837.9,730.3c0.1,0,0.5,1,0.8,2.2c0.3,1.3,0.4,2.3,0.3,2.4c-0.1,0-0.4-1-0.7-2.3
						C838,731.4,837.8,730.3,837.9,730.3z"/>
				</g>
			</g>
			<g>
				<g>
					<path class="st4" d="M834.9,730c0.1,0.1-0.3,1-1,2c-0.6,1.1-1.2,1.9-1.3,1.8c-0.1-0.1,0.3-1,1-2
						C834.2,730.7,834.8,729.9,834.9,730z"/>
				</g>
			</g>
			<g>
				<g>
					<path class="st4" d="M834.5,720.5c0.1,0,0.5,0.9,0.8,2c0.4,1.2,0.6,2.1,0.4,2.1c-0.1,0-0.5-0.9-0.8-2
						C834.5,721.5,834.3,720.5,834.5,720.5z"/>
				</g>
			</g>
			<g>
				<g>
					<path class="st4" d="M833.8,727c0,0.1-0.8,0.1-1.8,0c-1-0.1-1.7-0.3-1.7-0.4c0-0.1,0.8-0.1,1.8,0
						C833.1,726.7,833.8,726.9,833.8,727z"/>
				</g>
			</g>
			<g>
				<g>
					<path class="st4" d="M838.6,726.4c0.6,1.1,0.3,2.5-0.8,3.1c-1.1,0.6-2.5,0.3-3.1-0.8c-0.6-1.1-0.3-2.5,0.8-3.1
						C836.6,725,838,725.3,838.6,726.4z"/>
				</g>
				<g>
					<g>
						<path class="st3" d="M837.7,727.6c-0.1,0.1-0.5-0.2-1.2-0.3c-0.6-0.1-1.1,0.1-1.2,0c-0.1-0.1,0.4-0.5,1.2-0.5
							C837.4,727,837.8,727.5,837.7,727.6z"/>
					</g>
				</g>
				<g>
					<g>
						<path class="st3" d="M836.8,726.2c0.1,0.1-0.1,0.5-0.2,1.1c-0.1,0.6-0.1,1.1-0.2,1.1c-0.1,0-0.4-0.5-0.2-1.2
							C836.3,726.6,836.7,726.2,836.8,726.2z"/>
					</g>
				</g>
			</g>
		</g>
	</g>
	<text transform="matrix(1 0 0 1 632.81 -271.356)" class="st6" style="font-family:'Ubuntu-Bold'; font-size:45px;">ouestgo.fr est en maintenance</text>
	<text transform="matrix(1 0 0 1 808.4785 -217.356)" class="st6" style="font-family:'Ubuntu-Regular'; font-size:36px;">On revient bientôt</text>
	<g>
		<path class="st6" d="M660.2,518.3c0,1.9-0.3,3.6-0.8,5.1c-0.5,1.5-1.3,2.9-2.3,4c-1,1.1-2.2,1.9-3.7,2.5c-1.4,0.6-3,0.9-4.8,0.9
			c-1.7,0-3.3-0.3-4.7-0.9c-1.4-0.6-2.6-1.4-3.7-2.5c-1-1.1-1.8-2.4-2.4-4c-0.6-1.5-0.9-3.2-0.9-5.1c0-1.9,0.3-3.6,0.9-5.1
			c0.6-1.5,1.4-2.8,2.4-3.9s2.3-1.9,3.7-2.5c1.4-0.6,3-0.9,4.7-0.9c1.7,0,3.3,0.3,4.7,0.9c1.4,0.6,2.6,1.4,3.7,2.5
			c1,1.1,1.8,2.4,2.4,3.9C660,514.8,660.2,516.5,660.2,518.3z M653.4,518.3c0-2.1-0.4-3.7-1.2-4.9c-0.8-1.2-2-1.8-3.5-1.8
			c-1.5,0-2.7,0.6-3.6,1.8c-0.8,1.2-1.3,2.8-1.3,4.9c0,2.1,0.4,3.7,1.3,4.9c0.8,1.2,2,1.8,3.6,1.8c1.5,0,2.7-0.6,3.5-1.8
			C653,522,653.4,520.4,653.4,518.3z"/>
		<path class="st6" d="M685.6,529.4c-1.1,0.3-2.6,0.6-4.4,0.9c-1.8,0.3-3.7,0.4-5.7,0.4c-2,0-3.7-0.3-5-0.8
			c-1.3-0.5-2.4-1.3-3.2-2.3c-0.8-1-1.3-2.1-1.7-3.5c-0.3-1.4-0.5-2.8-0.5-4.5v-13.2h6.7v12.4c0,2.2,0.3,3.7,0.9,4.7
			c0.6,1,1.6,1.4,3.2,1.4c0.5,0,1,0,1.5-0.1c0.5,0,1-0.1,1.4-0.2v-18.3h6.7V529.4z"/>
		<path class="st6" d="M690.8,518.5c0-2.1,0.3-3.9,1-5.5c0.6-1.6,1.5-2.9,2.5-3.9c1-1,2.3-1.8,3.6-2.4c1.4-0.5,2.8-0.8,4.2-0.8
			c3.4,0,6,1,8,3.1c1.9,2.1,2.9,5.1,2.9,9.1c0,0.4,0,0.8,0,1.3c0,0.5-0.1,0.9-0.1,1.2h-15.2c0.1,1.4,0.8,2.5,1.9,3.3
			c1.1,0.8,2.7,1.2,4.6,1.2c1.2,0,2.4-0.1,3.6-0.3c1.2-0.2,2.2-0.5,2.9-0.8l0.9,5.4c-0.4,0.2-0.8,0.4-1.4,0.5
			c-0.6,0.2-1.3,0.3-2,0.5c-0.7,0.1-1.5,0.2-2.4,0.3c-0.8,0.1-1.7,0.1-2.5,0.1c-2.1,0-4-0.3-5.6-0.9s-2.9-1.5-3.9-2.6
			c-1-1.1-1.8-2.4-2.3-3.9C691,521.9,690.8,520.3,690.8,518.5z M706.5,516c0-0.6-0.1-1.1-0.3-1.7c-0.2-0.5-0.4-1-0.8-1.4
			c-0.3-0.4-0.8-0.8-1.3-1c-0.5-0.3-1.2-0.4-2-0.4c-0.8,0-1.4,0.1-1.9,0.4s-1,0.6-1.4,1c-0.4,0.4-0.6,0.9-0.8,1.5
			c-0.2,0.6-0.3,1.1-0.4,1.7H706.5z"/>
		<path class="st6" d="M725,525.4c1.2,0,2.1-0.1,2.6-0.4c0.5-0.2,0.8-0.7,0.8-1.4c0-0.5-0.3-1-1-1.4c-0.7-0.4-1.7-0.9-3-1.4
			c-1.1-0.4-2-0.8-2.9-1.2c-0.9-0.4-1.6-0.9-2.2-1.5c-0.6-0.6-1.1-1.3-1.4-2.1c-0.3-0.8-0.5-1.8-0.5-2.9c0-2.2,0.8-4,2.5-5.3
			c1.6-1.3,3.9-1.9,6.8-1.9c1.4,0,2.8,0.1,4.1,0.4c1.3,0.3,2.4,0.5,3.1,0.8l-1.2,5.2c-0.8-0.3-1.6-0.5-2.5-0.7
			c-0.9-0.2-1.9-0.3-3.1-0.3c-2.1,0-3.1,0.6-3.1,1.8c0,0.3,0,0.5,0.1,0.7c0.1,0.2,0.3,0.4,0.5,0.6c0.3,0.2,0.6,0.4,1.1,0.6
			c0.5,0.2,1.1,0.5,1.8,0.7c1.5,0.5,2.7,1.1,3.6,1.6c1,0.5,1.7,1.1,2.3,1.7c0.6,0.6,0.9,1.3,1.2,2s0.3,1.6,0.3,2.6
			c0,2.3-0.9,4.1-2.6,5.3c-1.8,1.2-4.2,1.8-7.4,1.8c-2.1,0-3.8-0.2-5.2-0.5c-1.4-0.4-2.4-0.7-2.9-0.9l1.1-5.4
			c1.1,0.4,2.3,0.8,3.5,1.1C722.6,525.2,723.8,525.4,725,525.4z"/>
		<path class="st6" d="M739.8,500.6l6.7-1.1v7h8.1v5.6h-8.1v8.3c0,1.4,0.2,2.5,0.7,3.4c0.5,0.8,1.5,1.3,3,1.3c0.7,0,1.5-0.1,2.2-0.2
			c0.8-0.1,1.5-0.3,2.1-0.6l0.9,5.2c-0.8,0.3-1.7,0.6-2.7,0.9c-1,0.2-2.2,0.4-3.6,0.4c-1.8,0-3.3-0.2-4.5-0.7
			c-1.2-0.5-2.2-1.2-2.9-2.1c-0.7-0.9-1.2-2-1.5-3.2c-0.3-1.3-0.4-2.7-0.4-4.2V500.6z"/>
		<path class="st6" d="M779.5,527.2c0,3.9-1,6.7-2.9,8.6c-2,1.9-5,2.8-9.1,2.8c-1.4,0-2.9-0.1-4.3-0.4c-1.4-0.3-2.8-0.6-4-1l1.2-5.6
			c1,0.4,2.2,0.7,3.3,1c1.2,0.2,2.5,0.4,3.9,0.4c1.9,0,3.3-0.4,4.1-1.3c0.8-0.8,1.2-1.9,1.2-3.2v-0.9c-0.7,0.3-1.5,0.6-2.2,0.7
			c-0.8,0.2-1.6,0.2-2.5,0.2c-3.3,0-5.8-1-7.5-2.9c-1.7-1.9-2.6-4.6-2.6-8.1c0-1.7,0.3-3.3,0.8-4.7c0.5-1.4,1.3-2.6,2.4-3.7
			c1-1,2.3-1.8,3.8-2.4c1.5-0.6,3.2-0.8,5.1-0.8c0.8,0,1.6,0,2.5,0.1c0.9,0.1,1.7,0.2,2.5,0.3c0.8,0.1,1.6,0.3,2.4,0.4
			c0.8,0.2,1.4,0.3,2,0.5V527.2z M764.8,517.6c0,3.8,1.5,5.6,4.5,5.6c0.7,0,1.3-0.1,1.9-0.3c0.6-0.2,1.1-0.4,1.5-0.6v-10.7
			c-0.3-0.1-0.7-0.1-1.2-0.2c-0.5,0-1-0.1-1.6-0.1c-1.8,0-3.1,0.6-4,1.8C765.2,514.3,764.8,515.8,764.8,517.6z"/>
		<path class="st6" d="M808,518.3c0,1.9-0.3,3.6-0.8,5.1c-0.5,1.5-1.3,2.9-2.3,4c-1,1.1-2.2,1.9-3.7,2.5c-1.4,0.6-3,0.9-4.8,0.9
			c-1.7,0-3.3-0.3-4.7-0.9c-1.4-0.6-2.6-1.4-3.7-2.5c-1-1.1-1.8-2.4-2.4-4c-0.6-1.5-0.9-3.2-0.9-5.1c0-1.9,0.3-3.6,0.9-5.1
			c0.6-1.5,1.4-2.8,2.4-3.9s2.3-1.9,3.7-2.5c1.4-0.6,3-0.9,4.7-0.9c1.7,0,3.3,0.3,4.7,0.9c1.4,0.6,2.6,1.4,3.7,2.5
			c1,1.1,1.8,2.4,2.4,3.9C807.7,514.8,808,516.5,808,518.3z M801.1,518.3c0-2.1-0.4-3.7-1.2-4.9c-0.8-1.2-2-1.8-3.5-1.8
			c-1.5,0-2.7,0.6-3.6,1.8c-0.8,1.2-1.3,2.8-1.3,4.9c0,2.1,0.4,3.7,1.3,4.9c0.8,1.2,2,1.8,3.6,1.8c1.5,0,2.7-0.6,3.5-1.8
			C800.7,522,801.1,520.4,801.1,518.3z"/>
		<path class="st6" d="M818.4,526.6c0,1.4-0.4,2.4-1.3,3.1s-1.8,1.1-2.9,1.1s-2-0.4-2.9-1.1s-1.3-1.7-1.3-3.1c0-1.3,0.4-2.4,1.3-3.1
			c0.9-0.7,1.8-1.1,2.9-1.1s2,0.4,2.9,1.1C817.9,524.3,818.4,525.3,818.4,526.6z"/>
		<path class="st6" d="M833.1,495.3c1.3,0,2.4,0.1,3.5,0.4c1,0.3,1.9,0.5,2.4,0.7l-1.3,5.4c-0.6-0.3-1.3-0.5-2-0.6
			c-0.7-0.1-1.4-0.2-2-0.2c-0.8,0-1.5,0.1-2,0.3c-0.6,0.2-1,0.5-1.3,0.9c-0.3,0.4-0.5,0.9-0.7,1.4c-0.1,0.5-0.2,1.1-0.2,1.8v1.2h8.3
			v5.6h-8.3v18.1h-6.7v-24.9c0-3.1,0.9-5.5,2.6-7.3C827.2,496.2,829.7,495.3,833.1,495.3z"/>
		<path class="st6" d="M856.1,512.5c-0.6-0.1-1.3-0.3-2.1-0.5c-0.8-0.2-1.7-0.2-2.6-0.2c-0.4,0-0.9,0-1.5,0.1
			c-0.6,0.1-1,0.2-1.3,0.2v18.1h-6.7v-22.4c1.2-0.4,2.6-0.8,4.3-1.2c1.6-0.4,3.5-0.6,5.5-0.6c0.4,0,0.8,0,1.3,0.1
			c0.5,0,1,0.1,1.5,0.2c0.5,0.1,1,0.2,1.5,0.3c0.5,0.1,0.9,0.2,1.3,0.4L856.1,512.5z"/>
		<path class="st6" d="M870.5,518.5c0-2.1,0.3-3.9,1-5.5c0.6-1.6,1.5-2.9,2.5-3.9c1-1,2.3-1.8,3.6-2.4c1.4-0.5,2.8-0.8,4.2-0.8
			c3.4,0,6,1,8,3.1c1.9,2.1,2.9,5.1,2.9,9.1c0,0.4,0,0.8,0,1.3c0,0.5-0.1,0.9-0.1,1.2h-15.2c0.1,1.4,0.8,2.5,1.9,3.3
			c1.1,0.8,2.7,1.2,4.6,1.2c1.2,0,2.4-0.1,3.6-0.3c1.2-0.2,2.2-0.5,2.9-0.8l0.9,5.4c-0.4,0.2-0.8,0.4-1.4,0.5
			c-0.6,0.2-1.3,0.3-2,0.5c-0.7,0.1-1.5,0.2-2.4,0.3c-0.8,0.1-1.7,0.1-2.5,0.1c-2.1,0-4-0.3-5.6-0.9s-2.9-1.5-3.9-2.6
			c-1-1.1-1.8-2.4-2.3-3.9C870.8,521.9,870.5,520.3,870.5,518.5z M886.3,516c0-0.6-0.1-1.1-0.3-1.7c-0.2-0.5-0.4-1-0.8-1.4
			c-0.3-0.4-0.8-0.8-1.3-1c-0.5-0.3-1.2-0.4-2-0.4c-0.8,0-1.4,0.1-1.9,0.4s-1,0.6-1.4,1c-0.4,0.4-0.6,0.9-0.8,1.5
			c-0.2,0.6-0.3,1.1-0.4,1.7H886.3z"/>
		<path class="st6" d="M904.7,525.4c1.2,0,2.1-0.1,2.6-0.4c0.5-0.2,0.8-0.7,0.8-1.4c0-0.5-0.3-1-1-1.4c-0.7-0.4-1.7-0.9-3-1.4
			c-1.1-0.4-2-0.8-2.9-1.2c-0.9-0.4-1.6-0.9-2.2-1.5c-0.6-0.6-1.1-1.3-1.4-2.1c-0.3-0.8-0.5-1.8-0.5-2.9c0-2.2,0.8-4,2.5-5.3
			c1.6-1.3,3.9-1.9,6.8-1.9c1.4,0,2.8,0.1,4.1,0.4c1.3,0.3,2.4,0.5,3.1,0.8l-1.2,5.2c-0.8-0.3-1.6-0.5-2.5-0.7
			c-0.9-0.2-1.9-0.3-3.1-0.3c-2.1,0-3.1,0.6-3.1,1.8c0,0.3,0,0.5,0.1,0.7c0.1,0.2,0.3,0.4,0.5,0.6c0.3,0.2,0.6,0.4,1.1,0.6
			c0.5,0.2,1.1,0.5,1.8,0.7c1.5,0.5,2.7,1.1,3.6,1.6c1,0.5,1.7,1.1,2.3,1.7c0.6,0.6,0.9,1.3,1.2,2s0.3,1.6,0.3,2.6
			c0,2.3-0.9,4.1-2.6,5.3c-1.8,1.2-4.2,1.8-7.4,1.8c-2.1,0-3.8-0.2-5.2-0.5c-1.4-0.4-2.4-0.7-2.9-0.9l1.1-5.4
			c1.1,0.4,2.3,0.8,3.5,1.1C902.4,525.2,903.5,525.4,904.7,525.4z"/>
		<path class="st6" d="M919.5,500.6l6.7-1.1v7h8.1v5.6h-8.1v8.3c0,1.4,0.2,2.5,0.7,3.4c0.5,0.8,1.5,1.3,3,1.3c0.7,0,1.5-0.1,2.2-0.2
			c0.8-0.1,1.5-0.3,2.1-0.6l0.9,5.2c-0.8,0.3-1.7,0.6-2.7,0.9c-1,0.2-2.2,0.4-3.6,0.4c-1.8,0-3.3-0.2-4.5-0.7
			c-1.2-0.5-2.2-1.2-2.9-2.1c-0.7-0.9-1.2-2-1.5-3.2c-0.3-1.3-0.4-2.7-0.4-4.2V500.6z"/>
		<path class="st6" d="M949.4,518.5c0-2.1,0.3-3.9,1-5.5c0.6-1.6,1.5-2.9,2.5-3.9c1-1,2.3-1.8,3.6-2.4c1.4-0.5,2.8-0.8,4.2-0.8
			c3.4,0,6,1,8,3.1c1.9,2.1,2.9,5.1,2.9,9.1c0,0.4,0,0.8,0,1.3c0,0.5-0.1,0.9-0.1,1.2h-15.2c0.1,1.4,0.8,2.5,1.9,3.3
			c1.1,0.8,2.7,1.2,4.6,1.2c1.2,0,2.4-0.1,3.6-0.3c1.2-0.2,2.2-0.5,2.9-0.8l0.9,5.4c-0.4,0.2-0.8,0.4-1.4,0.5
			c-0.6,0.2-1.3,0.3-2,0.5c-0.7,0.1-1.5,0.2-2.4,0.3c-0.8,0.1-1.7,0.1-2.5,0.1c-2.1,0-4-0.3-5.6-0.9s-2.9-1.5-3.9-2.6
			c-1-1.1-1.8-2.4-2.3-3.9C949.6,521.9,949.4,520.3,949.4,518.5z M965.2,516c0-0.6-0.1-1.1-0.3-1.7c-0.2-0.5-0.4-1-0.8-1.4
			c-0.3-0.4-0.8-0.8-1.3-1c-0.5-0.3-1.2-0.4-2-0.4c-0.8,0-1.4,0.1-1.9,0.4s-1,0.6-1.4,1c-0.4,0.4-0.6,0.9-0.8,1.5
			c-0.2,0.6-0.3,1.1-0.4,1.7H965.2z"/>
		<path class="st6" d="M976.8,507.3c1.1-0.3,2.6-0.6,4.4-0.9c1.8-0.3,3.7-0.4,5.7-0.4c2,0,3.7,0.3,5,0.8c1.3,0.5,2.4,1.3,3.2,2.2
			c0.8,1,1.3,2.1,1.7,3.4c0.3,1.3,0.5,2.8,0.5,4.4v13.4h-6.7v-12.6c0-2.2-0.3-3.7-0.9-4.6c-0.6-0.9-1.6-1.4-3.2-1.4
			c-0.5,0-1,0-1.5,0.1c-0.5,0-1,0.1-1.4,0.2v18.3h-6.7V507.3z"/>
		<path class="st6" d="M1027.1,517.6c0-2.2-0.3-3.7-0.8-4.6s-1.5-1.4-2.9-1.4c-0.4,0-0.9,0-1.3,0.1c-0.5,0-0.9,0.1-1.3,0.2v18.3
			h-6.7v-22.9c0.6-0.1,1.2-0.3,2-0.5c0.8-0.2,1.6-0.3,2.4-0.5c0.9-0.1,1.7-0.2,2.6-0.3c0.9-0.1,1.8-0.1,2.7-0.1
			c1.7,0,3.1,0.2,4.2,0.7c1.1,0.4,1.9,1,2.6,1.6c1-0.7,2.1-1.2,3.3-1.6c1.2-0.4,2.4-0.6,3.4-0.6c1.9,0,3.4,0.3,4.7,0.8
			c1.2,0.5,2.2,1.3,2.9,2.2c0.7,1,1.2,2.1,1.5,3.4c0.3,1.3,0.4,2.8,0.4,4.4v13.4h-6.7v-12.6c0-2.2-0.3-3.7-0.8-4.6
			c-0.6-0.9-1.5-1.4-2.9-1.4c-0.4,0-0.9,0.1-1.5,0.3c-0.6,0.2-1.2,0.4-1.6,0.7c0.2,0.7,0.3,1.4,0.4,2.2c0.1,0.8,0.1,1.6,0.1,2.5
			v12.9h-6.7V517.6z"/>
		<path class="st6" d="M1061.4,505.9c2,0,3.6,0.2,5,0.7c1.3,0.5,2.4,1.1,3.2,1.9c0.8,0.8,1.4,1.9,1.7,3.1c0.3,1.2,0.5,2.5,0.5,4v14
			c-1,0.2-2.3,0.5-4,0.7s-3.8,0.4-6.2,0.4c-1.5,0-2.9-0.1-4.2-0.4c-1.2-0.3-2.3-0.7-3.2-1.3c-0.9-0.6-1.6-1.4-2.1-2.4
			c-0.5-1-0.7-2.2-0.7-3.6c0-1.4,0.3-2.5,0.8-3.5c0.6-1,1.3-1.7,2.2-2.3c0.9-0.6,2-1,3.2-1.2c1.2-0.3,2.4-0.4,3.7-0.4
			c0.9,0,1.6,0,2.3,0.1c0.7,0.1,1.2,0.2,1.6,0.3v-0.6c0-1.1-0.3-2.1-1-2.7c-0.7-0.7-1.9-1-3.6-1c-1.1,0-2.3,0.1-3.4,0.2
			c-1.1,0.2-2.1,0.4-2.9,0.7l-0.9-5.4c0.4-0.1,0.9-0.2,1.5-0.4c0.6-0.1,1.2-0.3,1.9-0.4c0.7-0.1,1.4-0.2,2.2-0.3
			C1059.9,505.9,1060.6,505.9,1061.4,505.9z M1061.9,525.5c0.7,0,1.3,0,1.9,0c0.6,0,1.1-0.1,1.4-0.1v-5.1c-0.3-0.1-0.7-0.1-1.2-0.2
			c-0.5-0.1-1-0.1-1.5-0.1c-0.6,0-1.2,0-1.8,0.1c-0.6,0.1-1,0.2-1.5,0.4c-0.4,0.2-0.8,0.5-1,0.9c-0.2,0.4-0.4,0.8-0.4,1.3
			c0,1.1,0.4,1.8,1.1,2.2C1059.7,525.3,1060.7,525.5,1061.9,525.5z"/>
		<path class="st6" d="M1085.1,499.7c0,1.2-0.4,2.2-1.2,2.9c-0.8,0.7-1.7,1.1-2.8,1.1s-2-0.4-2.8-1.1c-0.8-0.7-1.2-1.7-1.2-2.9
			c0-1.2,0.4-2.2,1.2-2.9c0.8-0.7,1.7-1.1,2.8-1.1s2,0.4,2.8,1.1C1084.7,497.5,1085.1,498.5,1085.1,499.7z M1084.5,530.2h-6.7v-23.7
			h6.7V530.2z"/>
		<path class="st6" d="M1090.8,507.3c1.1-0.3,2.6-0.6,4.4-0.9c1.8-0.3,3.7-0.4,5.7-0.4c2,0,3.7,0.3,5,0.8c1.3,0.5,2.4,1.3,3.2,2.2
			c0.8,1,1.3,2.1,1.7,3.4c0.3,1.3,0.5,2.8,0.5,4.4v13.4h-6.7v-12.6c0-2.2-0.3-3.7-0.9-4.6c-0.6-0.9-1.6-1.4-3.2-1.4
			c-0.5,0-1,0-1.5,0.1c-0.5,0-1,0.1-1.4,0.2v18.3h-6.7V507.3z"/>
		<path class="st6" d="M1117.1,500.6l6.7-1.1v7h8.1v5.6h-8.1v8.3c0,1.4,0.2,2.5,0.7,3.4c0.5,0.8,1.5,1.3,3,1.3
			c0.7,0,1.5-0.1,2.2-0.2c0.8-0.1,1.5-0.3,2.1-0.6l0.9,5.2c-0.8,0.3-1.7,0.6-2.7,0.9c-1,0.2-2.2,0.4-3.6,0.4c-1.8,0-3.3-0.2-4.5-0.7
			c-1.2-0.5-2.2-1.2-2.9-2.1c-0.7-0.9-1.2-2-1.5-3.2c-0.3-1.3-0.4-2.7-0.4-4.2V500.6z"/>
		<path class="st6" d="M1135.2,518.5c0-2.1,0.3-3.9,1-5.5c0.6-1.6,1.5-2.9,2.5-3.9c1-1,2.3-1.8,3.6-2.4c1.4-0.5,2.8-0.8,4.2-0.8
			c3.4,0,6,1,8,3.1c1.9,2.1,2.9,5.1,2.9,9.1c0,0.4,0,0.8,0,1.3c0,0.5-0.1,0.9-0.1,1.2h-15.2c0.1,1.4,0.8,2.5,1.9,3.3
			c1.1,0.8,2.7,1.2,4.6,1.2c1.2,0,2.4-0.1,3.6-0.3c1.2-0.2,2.2-0.5,2.9-0.8l0.9,5.4c-0.4,0.2-0.8,0.4-1.4,0.5
			c-0.6,0.2-1.3,0.3-2,0.5c-0.7,0.1-1.5,0.2-2.4,0.3c-0.8,0.1-1.7,0.1-2.5,0.1c-2.1,0-4-0.3-5.6-0.9s-2.9-1.5-3.9-2.6
			c-1-1.1-1.8-2.4-2.3-3.9C1135.5,521.9,1135.2,520.3,1135.2,518.5z M1151,516c0-0.6-0.1-1.1-0.3-1.7c-0.2-0.5-0.4-1-0.8-1.4
			c-0.3-0.4-0.8-0.8-1.3-1c-0.5-0.3-1.2-0.4-2-0.4c-0.8,0-1.4,0.1-1.9,0.4s-1,0.6-1.4,1c-0.4,0.4-0.6,0.9-0.8,1.5
			c-0.2,0.6-0.3,1.1-0.4,1.7H1151z"/>
		<path class="st6" d="M1162.7,507.3c1.1-0.3,2.6-0.6,4.4-0.9c1.8-0.3,3.7-0.4,5.7-0.4c2,0,3.7,0.3,5,0.8c1.3,0.5,2.4,1.3,3.2,2.2
			c0.8,1,1.3,2.1,1.7,3.4c0.3,1.3,0.5,2.8,0.5,4.4v13.4h-6.7v-12.6c0-2.2-0.3-3.7-0.9-4.6c-0.6-0.9-1.6-1.4-3.2-1.4
			c-0.5,0-1,0-1.5,0.1c-0.5,0-1,0.1-1.4,0.2v18.3h-6.7V507.3z"/>
		<path class="st6" d="M1197.7,505.9c2,0,3.6,0.2,5,0.7c1.3,0.5,2.4,1.1,3.2,1.9c0.8,0.8,1.4,1.9,1.7,3.1c0.3,1.2,0.5,2.5,0.5,4v14
			c-1,0.2-2.3,0.5-4,0.7s-3.8,0.4-6.2,0.4c-1.5,0-2.9-0.1-4.2-0.4c-1.2-0.3-2.3-0.7-3.2-1.3c-0.9-0.6-1.6-1.4-2.1-2.4
			c-0.5-1-0.7-2.2-0.7-3.6c0-1.4,0.3-2.5,0.8-3.5c0.6-1,1.3-1.7,2.2-2.3c0.9-0.6,2-1,3.2-1.2c1.2-0.3,2.4-0.4,3.7-0.4
			c0.9,0,1.6,0,2.3,0.1c0.7,0.1,1.2,0.2,1.6,0.3v-0.6c0-1.1-0.3-2.1-1-2.7c-0.7-0.7-1.9-1-3.6-1c-1.1,0-2.3,0.1-3.4,0.2
			c-1.1,0.2-2.1,0.4-2.9,0.7l-0.9-5.4c0.4-0.1,0.9-0.2,1.5-0.4c0.6-0.1,1.2-0.3,1.9-0.4c0.7-0.1,1.4-0.2,2.2-0.3
			C1196.1,505.9,1196.9,505.9,1197.7,505.9z M1198.2,525.5c0.7,0,1.3,0,1.9,0c0.6,0,1.1-0.1,1.4-0.1v-5.1c-0.3-0.1-0.7-0.1-1.2-0.2
			c-0.5-0.1-1-0.1-1.5-0.1c-0.6,0-1.2,0-1.8,0.1c-0.6,0.1-1,0.2-1.5,0.4c-0.4,0.2-0.8,0.5-1,0.9c-0.2,0.4-0.4,0.8-0.4,1.3
			c0,1.1,0.4,1.8,1.1,2.2C1196,525.3,1197,525.5,1198.2,525.5z"/>
		<path class="st6" d="M1214,507.3c1.1-0.3,2.6-0.6,4.4-0.9c1.8-0.3,3.7-0.4,5.7-0.4c2,0,3.7,0.3,5,0.8c1.3,0.5,2.4,1.3,3.2,2.2
			c0.8,1,1.3,2.1,1.7,3.4c0.3,1.3,0.5,2.8,0.5,4.4v13.4h-6.7v-12.6c0-2.2-0.3-3.7-0.9-4.6c-0.6-0.9-1.6-1.4-3.2-1.4
			c-0.5,0-1,0-1.5,0.1c-0.5,0-1,0.1-1.4,0.2v18.3h-6.7V507.3z"/>
		<path class="st6" d="M1239.4,518.4c0-1.7,0.3-3.3,0.8-4.8c0.6-1.5,1.4-2.8,2.4-4c1-1.1,2.3-2,3.8-2.7c1.5-0.7,3.2-1,5.1-1
			c1.3,0,2.4,0.1,3.5,0.3c1,0.2,2.1,0.5,3.1,1l-1.4,5.4c-0.6-0.2-1.3-0.4-2.1-0.6c-0.8-0.2-1.6-0.3-2.5-0.3c-2,0-3.5,0.6-4.4,1.8
			c-1,1.2-1.5,2.9-1.5,4.9c0,2.1,0.5,3.8,1.4,5c0.9,1.2,2.5,1.8,4.8,1.8c0.8,0,1.7-0.1,2.6-0.2c0.9-0.1,1.8-0.4,2.6-0.7l0.9,5.5
			c-0.8,0.3-1.8,0.6-2.9,0.9c-1.2,0.2-2.5,0.4-3.9,0.4c-2.2,0-4-0.3-5.6-1c-1.6-0.6-2.8-1.5-3.8-2.6c-1-1.1-1.7-2.4-2.2-3.9
			C1239.7,521.8,1239.4,520.1,1239.4,518.4z"/>
		<path class="st6" d="M1260.8,518.5c0-2.1,0.3-3.9,1-5.5c0.6-1.6,1.5-2.9,2.5-3.9c1-1,2.3-1.8,3.6-2.4c1.4-0.5,2.8-0.8,4.2-0.8
			c3.4,0,6,1,8,3.1c1.9,2.1,2.9,5.1,2.9,9.1c0,0.4,0,0.8,0,1.3c0,0.5-0.1,0.9-0.1,1.2h-15.2c0.1,1.4,0.8,2.5,1.9,3.3
			c1.1,0.8,2.7,1.2,4.6,1.2c1.2,0,2.4-0.1,3.6-0.3c1.2-0.2,2.2-0.5,2.9-0.8l0.9,5.4c-0.4,0.2-0.8,0.4-1.4,0.5
			c-0.6,0.2-1.3,0.3-2,0.5c-0.7,0.1-1.5,0.2-2.4,0.3c-0.8,0.1-1.7,0.1-2.5,0.1c-2.1,0-4-0.3-5.6-0.9s-2.9-1.5-3.9-2.6
			c-1-1.1-1.8-2.4-2.3-3.9C1261,521.9,1260.8,520.3,1260.8,518.5z M1276.5,516c0-0.6-0.1-1.1-0.3-1.7c-0.2-0.5-0.4-1-0.8-1.4
			c-0.3-0.4-0.8-0.8-1.3-1c-0.5-0.3-1.2-0.4-2-0.4c-0.8,0-1.4,0.1-1.9,0.4s-1,0.6-1.4,1c-0.4,0.4-0.6,0.9-0.8,1.5
			c-0.2,0.6-0.3,1.1-0.4,1.7H1276.5z"/>
	</g>
	<g>
		<path class="st6" d="M810.8,571.7c0-2.1,0.3-4,1-5.7c0.6-1.6,1.5-3,2.6-4.1c1.1-1.1,2.4-1.9,3.8-2.5c1.5-0.6,3-0.8,4.6-0.8
			c1.6,0,3.1,0.3,4.6,0.8c1.4,0.6,2.7,1.4,3.8,2.5c1.1,1.1,1.9,2.5,2.6,4.1c0.6,1.6,1,3.5,1,5.7c0,2.1-0.3,4-1,5.7
			c-0.6,1.6-1.5,3-2.6,4.1c-1.1,1.1-2.3,1.9-3.8,2.5c-1.4,0.6-2.9,0.8-4.6,0.8c-1.6,0-3.2-0.3-4.6-0.8c-1.5-0.6-2.7-1.4-3.8-2.5
			c-1.1-1.1-2-2.5-2.6-4.1C811.1,575.7,810.8,573.8,810.8,571.7z M814.5,571.7c0,1.5,0.2,2.9,0.6,4.1c0.4,1.2,0.9,2.3,1.6,3.1
			c0.7,0.9,1.6,1.5,2.6,2c1,0.5,2.2,0.7,3.4,0.7c1.3,0,2.4-0.2,3.4-0.7c1-0.5,1.9-1.1,2.6-2c0.7-0.9,1.3-1.9,1.6-3.1
			c0.4-1.2,0.6-2.6,0.6-4.1c0-1.5-0.2-2.9-0.6-4.1c-0.4-1.2-0.9-2.3-1.6-3.2c-0.7-0.9-1.6-1.5-2.6-2c-1-0.5-2.1-0.7-3.4-0.7
			c-1.3,0-2.4,0.2-3.4,0.7c-1,0.5-1.9,1.1-2.6,2c-0.7,0.9-1.3,1.9-1.6,3.2C814.7,568.8,814.5,570.2,814.5,571.7z"/>
		<path class="st6" d="M839.6,566c0.8-0.2,1.8-0.4,3.1-0.6c1.3-0.2,2.7-0.3,4.4-0.3c1.5,0,2.7,0.2,3.7,0.6c1,0.4,1.8,1,2.4,1.8
			c0.6,0.8,1,1.7,1.2,2.7c0.2,1.1,0.4,2.2,0.4,3.5v10.5h-3.3v-9.8c0-1.2-0.1-2.1-0.2-3c-0.2-0.8-0.4-1.5-0.8-2s-0.8-0.9-1.4-1.1
			c-0.6-0.2-1.3-0.3-2.2-0.3c-0.4,0-0.7,0-1.1,0c-0.4,0-0.8,0.1-1.1,0.1c-0.3,0-0.7,0.1-0.9,0.1c-0.3,0-0.5,0.1-0.6,0.1v15.8h-3.3
			V566z"/>
		<path class="st6" d="M875.5,565.1c0.3,0,0.6,0,1,0.1c0.4,0,0.7,0.1,1.1,0.1c0.4,0.1,0.7,0.1,1,0.2c0.3,0.1,0.5,0.1,0.7,0.2
			l-0.6,2.9c-0.3-0.1-0.7-0.2-1.3-0.3c-0.6-0.1-1.4-0.2-2.4-0.2c-0.6,0-1.2,0.1-1.9,0.2c-0.6,0.1-1,0.2-1.2,0.3v15.7h-3.3v-17.9
			c0.8-0.3,1.8-0.6,3-0.8C872.7,565.2,874,565.1,875.5,565.1z"/>
		<path class="st6" d="M881.4,574.9c0-1.7,0.2-3.1,0.7-4.3c0.5-1.2,1.1-2.3,1.9-3.1c0.8-0.8,1.7-1.4,2.7-1.8c1-0.4,2.1-0.6,3.2-0.6
			c2.5,0,4.5,0.8,5.8,2.4c1.3,1.6,2,4,2,7.2c0,0.1,0,0.3,0,0.6s0,0.4,0,0.6h-12.8c0.1,1.9,0.7,3.4,1.7,4.4c1,1,2.5,1.5,4.6,1.5
			c1.2,0,2.2-0.1,3-0.3c0.8-0.2,1.4-0.4,1.8-0.6l0.5,2.8c-0.4,0.2-1.1,0.4-2.1,0.7c-1,0.2-2.2,0.4-3.5,0.4c-1.6,0-3-0.2-4.2-0.7
			s-2.2-1.2-2.9-2c-0.8-0.9-1.3-1.9-1.7-3.1C881.6,577.6,881.4,576.3,881.4,574.9z M894.3,573c0-1.5-0.4-2.8-1.1-3.7
			c-0.8-1-1.9-1.5-3.2-1.5c-0.8,0-1.4,0.2-2,0.5c-0.6,0.3-1.1,0.7-1.5,1.2c-0.4,0.5-0.7,1-1,1.7c-0.2,0.6-0.4,1.3-0.5,1.9H894.3z"/>
		<path class="st6" d="M917.2,565.5c-0.9,3.5-2,6.9-3.3,10.1c-1.3,3.2-2.5,6.1-3.7,8.6h-3c-1.2-2.5-2.4-5.4-3.7-8.6
			c-1.3-3.2-2.4-6.6-3.3-10.1h3.6c0.3,1.2,0.6,2.4,1,3.8s0.8,2.7,1.3,4c0.4,1.3,0.9,2.6,1.4,3.8c0.5,1.2,0.9,2.3,1.3,3.3
			c0.4-1,0.8-2.1,1.3-3.3c0.5-1.2,0.9-2.5,1.4-3.8c0.4-1.3,0.9-2.6,1.3-4s0.7-2.6,1-3.8H917.2z"/>
		<path class="st6" d="M922.3,562.1c-0.6,0-1.1-0.2-1.5-0.6c-0.4-0.4-0.6-0.9-0.6-1.6s0.2-1.2,0.6-1.6s0.9-0.6,1.5-0.6
			c0.6,0,1.1,0.2,1.5,0.6s0.6,0.9,0.6,1.6s-0.2,1.2-0.6,1.6C923.5,561.9,922.9,562.1,922.3,562.1z M924,584.2h-3.3v-18.7h3.3V584.2z
			"/>
		<path class="st6" d="M928.8,574.9c0-1.7,0.2-3.1,0.7-4.3c0.5-1.2,1.1-2.3,1.9-3.1c0.8-0.8,1.7-1.4,2.7-1.8c1-0.4,2.1-0.6,3.2-0.6
			c2.5,0,4.5,0.8,5.8,2.4c1.3,1.6,2,4,2,7.2c0,0.1,0,0.3,0,0.6s0,0.4,0,0.6h-12.8c0.1,1.9,0.7,3.4,1.7,4.4c1,1,2.5,1.5,4.6,1.5
			c1.2,0,2.2-0.1,3-0.3c0.8-0.2,1.4-0.4,1.8-0.6l0.5,2.8c-0.4,0.2-1.1,0.4-2.1,0.7c-1,0.2-2.2,0.4-3.5,0.4c-1.6,0-3-0.2-4.2-0.7
			s-2.2-1.2-2.9-2c-0.8-0.9-1.3-1.9-1.7-3.1C928.9,577.6,928.8,576.3,928.8,574.9z M941.6,573c0-1.5-0.4-2.8-1.1-3.7
			c-0.8-1-1.9-1.5-3.2-1.5c-0.8,0-1.4,0.2-2,0.5c-0.6,0.3-1.1,0.7-1.5,1.2c-0.4,0.5-0.7,1-1,1.7c-0.2,0.6-0.4,1.3-0.5,1.9H941.6z"/>
		<path class="st6" d="M949.9,566c0.8-0.2,1.8-0.4,3.1-0.6c1.3-0.2,2.7-0.3,4.4-0.3c1.5,0,2.7,0.2,3.7,0.6c1,0.4,1.8,1,2.4,1.8
			c0.6,0.8,1,1.7,1.2,2.7c0.2,1.1,0.4,2.2,0.4,3.5v10.5h-3.3v-9.8c0-1.2-0.1-2.1-0.2-3c-0.2-0.8-0.4-1.5-0.8-2s-0.8-0.9-1.4-1.1
			c-0.6-0.2-1.3-0.3-2.2-0.3c-0.4,0-0.7,0-1.1,0c-0.4,0-0.8,0.1-1.1,0.1c-0.3,0-0.7,0.1-0.9,0.1c-0.3,0-0.5,0.1-0.6,0.1v15.8h-3.3
			V566z"/>
		<path class="st6" d="M973.7,565.5h7.1v2.8h-7.1v8.6c0,0.9,0.1,1.7,0.2,2.3c0.1,0.6,0.4,1.1,0.6,1.4c0.3,0.3,0.6,0.6,1.1,0.7
			s0.9,0.2,1.5,0.2c1,0,1.8-0.1,2.4-0.3c0.6-0.2,1-0.4,1.3-0.5l0.6,2.8c-0.3,0.2-0.9,0.4-1.8,0.6c-0.8,0.3-1.8,0.4-2.9,0.4
			c-1.3,0-2.3-0.2-3.2-0.5c-0.8-0.3-1.5-0.8-2-1.5c-0.5-0.6-0.9-1.4-1.1-2.4c-0.2-0.9-0.3-2-0.3-3.3v-16.7l3.3-0.6V565.5z"/>
		<path class="st6" d="M996.7,566.3c0.4-0.3,1-0.5,1.9-0.8c0.8-0.3,1.8-0.4,2.9-0.4c1.3,0,2.5,0.2,3.6,0.7c1,0.5,1.9,1.2,2.6,2
			c0.7,0.9,1.3,1.9,1.6,3.1c0.4,1.2,0.6,2.5,0.6,4c0,1.5-0.2,2.9-0.7,4.1c-0.4,1.2-1.1,2.2-1.9,3.1c-0.8,0.8-1.8,1.5-3,1.9
			c-1.2,0.5-2.4,0.7-3.9,0.7c-1.6,0-2.9-0.1-4.1-0.3c-1.2-0.2-2.2-0.4-3-0.6v-26.8l3.3-0.6V566.3z M996.7,581.3
			c0.3,0.1,0.8,0.2,1.4,0.3c0.6,0.1,1.4,0.1,2.3,0.1c1.8,0,3.2-0.6,4.3-1.8c1.1-1.2,1.6-2.9,1.6-5.1c0-1-0.1-1.9-0.3-2.7
			c-0.2-0.8-0.5-1.6-0.9-2.2c-0.4-0.6-1-1.1-1.7-1.4c-0.7-0.3-1.5-0.5-2.5-0.5c-0.9,0-1.8,0.2-2.5,0.5c-0.8,0.3-1.4,0.6-1.8,1V581.3
			z"/>
		<path class="st6" d="M1016.2,562.1c-0.6,0-1.1-0.2-1.5-0.6c-0.4-0.4-0.6-0.9-0.6-1.6s0.2-1.2,0.6-1.6s0.9-0.6,1.5-0.6
			c0.6,0,1.1,0.2,1.5,0.6s0.6,0.9,0.6,1.6s-0.2,1.2-0.6,1.6C1017.3,561.9,1016.8,562.1,1016.2,562.1z M1017.9,584.2h-3.3v-18.7h3.3
			V584.2z"/>
		<path class="st6" d="M1022.6,574.9c0-1.7,0.2-3.1,0.7-4.3c0.5-1.2,1.1-2.3,1.9-3.1c0.8-0.8,1.7-1.4,2.7-1.8c1-0.4,2.1-0.6,3.2-0.6
			c2.5,0,4.5,0.8,5.8,2.4c1.3,1.6,2,4,2,7.2c0,0.1,0,0.3,0,0.6s0,0.4,0,0.6h-12.8c0.1,1.9,0.7,3.4,1.7,4.4c1,1,2.5,1.5,4.6,1.5
			c1.2,0,2.2-0.1,3-0.3c0.8-0.2,1.4-0.4,1.8-0.6l0.5,2.8c-0.4,0.2-1.1,0.4-2.1,0.7c-1,0.2-2.2,0.4-3.5,0.4c-1.6,0-3-0.2-4.2-0.7
			s-2.2-1.2-2.9-2c-0.8-0.9-1.3-1.9-1.7-3.1C1022.8,577.6,1022.6,576.3,1022.6,574.9z M1035.5,573c0-1.5-0.4-2.8-1.1-3.7
			c-0.8-1-1.9-1.5-3.2-1.5c-0.8,0-1.4,0.2-2,0.5c-0.6,0.3-1.1,0.7-1.5,1.2c-0.4,0.5-0.7,1-1,1.7c-0.2,0.6-0.4,1.3-0.5,1.9H1035.5z"
			/>
		<path class="st6" d="M1043.8,566c0.8-0.2,1.8-0.4,3.1-0.6c1.3-0.2,2.7-0.3,4.4-0.3c1.5,0,2.7,0.2,3.7,0.6c1,0.4,1.8,1,2.4,1.8
			c0.6,0.8,1,1.7,1.2,2.7c0.2,1.1,0.4,2.2,0.4,3.5v10.5h-3.3v-9.8c0-1.2-0.1-2.1-0.2-3c-0.2-0.8-0.4-1.5-0.8-2s-0.8-0.9-1.4-1.1
			c-0.6-0.2-1.3-0.3-2.2-0.3c-0.4,0-0.7,0-1.1,0c-0.4,0-0.8,0.1-1.1,0.1c-0.3,0-0.7,0.1-0.9,0.1c-0.3,0-0.5,0.1-0.6,0.1v15.8h-3.3
			V566z"/>
		<path class="st6" d="M1067.6,565.5h7.1v2.8h-7.1v8.6c0,0.9,0.1,1.7,0.2,2.3c0.1,0.6,0.4,1.1,0.6,1.4c0.3,0.3,0.6,0.6,1.1,0.7
			s0.9,0.2,1.5,0.2c1,0,1.8-0.1,2.4-0.3c0.6-0.2,1-0.4,1.3-0.5l0.6,2.8c-0.3,0.2-0.9,0.4-1.8,0.6c-0.8,0.3-1.8,0.4-2.9,0.4
			c-1.3,0-2.3-0.2-3.2-0.5c-0.8-0.3-1.5-0.8-2-1.5c-0.5-0.6-0.9-1.4-1.1-2.4c-0.2-0.9-0.3-2-0.3-3.3v-16.7l3.3-0.6V565.5z"/>
		<path class="st6" d="M1095,574.8c0,1.5-0.2,2.8-0.6,4c-0.4,1.2-1,2.2-1.8,3.1c-0.8,0.9-1.7,1.5-2.8,2c-1.1,0.5-2.3,0.7-3.5,0.7
			c-1.3,0-2.4-0.2-3.5-0.7c-1.1-0.5-2-1.1-2.8-2c-0.8-0.9-1.4-1.9-1.8-3.1c-0.4-1.2-0.6-2.5-0.6-4c0-1.5,0.2-2.8,0.6-4
			c0.4-1.2,1-2.2,1.8-3.1c0.8-0.9,1.7-1.5,2.8-2c1.1-0.5,2.3-0.7,3.5-0.7c1.3,0,2.4,0.2,3.5,0.7c1.1,0.5,2,1.1,2.8,2
			c0.8,0.9,1.4,1.9,1.8,3.1C1094.7,572,1095,573.4,1095,574.8z M1091.5,574.8c0-2.1-0.5-3.8-1.4-5c-0.9-1.2-2.2-1.9-3.9-1.9
			c-1.6,0-2.9,0.6-3.9,1.9c-0.9,1.2-1.4,2.9-1.4,5s0.5,3.8,1.4,5c0.9,1.2,2.2,1.9,3.9,1.9c1.6,0,2.9-0.6,3.9-1.9
			C1091,578.6,1091.5,576.9,1091.5,574.8z M1086.2,556.5l4.9,5.1l-1.4,1.6l-3.5-3.2l-3.5,3.2l-1.4-1.6L1086.2,556.5z"/>
		<path class="st6" d="M1102.8,565.5h7.1v2.8h-7.1v8.6c0,0.9,0.1,1.7,0.2,2.3c0.1,0.6,0.4,1.1,0.6,1.4c0.3,0.3,0.6,0.6,1.1,0.7
			s0.9,0.2,1.5,0.2c1,0,1.8-0.1,2.4-0.3c0.6-0.2,1-0.4,1.3-0.5l0.6,2.8c-0.3,0.2-0.9,0.4-1.8,0.6c-0.8,0.3-1.8,0.4-2.9,0.4
			c-1.3,0-2.3-0.2-3.2-0.5c-0.8-0.3-1.5-0.8-2-1.5c-0.5-0.6-0.9-1.4-1.1-2.4c-0.2-0.9-0.3-2-0.3-3.3v-16.7l3.3-0.6V565.5z"/>
	</g>
</g>
</svg>
