<?xml version="1.0" encoding="utf-8"?>
<!-- Generator: Adobe Illustrator 22.1.0, SVG Export Plug-In . SVG Version: 6.00 Build 0)  -->
<svg version="1.1" id="Calque_1" xmlns="http://www.w3.org/2000/svg" xmlns:xlink="http://www.w3.org/1999/xlink" x="0px" y="0px"
	 width="125px" height="125px" viewBox="0 0 125 125" style="enable-background:new 0 0 125 125;" xml:space="preserve">
<style type="text/css">
	.st0{fill:#A4892A;}
</style>
<g>
	<path class="st0" d="M38.4,42c-6,0-10.9,4.9-10.9,10.9c0,6,4.9,10.9,10.9,10.9s10.9-4.9,10.9-10.9C49.3,46.9,44.4,42,38.4,42z"/>
	<path class="st0" d="M82.7,42c-6,0-10.9,4.9-10.9,10.9c0,6,4.9,10.9,10.9,10.9c6,0,10.9-4.9,10.9-10.9C93.6,46.9,88.7,42,82.7,42z"
		/>
	<path class="st0" d="M61.8,2.3c-33.3,0-60.2,27-60.2,60.2c0,33.3,27,60.2,60.2,60.2c33.3,0,60.2-27,60.2-60.2
		C122,29.2,95,2.3,61.8,2.3z M38.4,71.5c-10.3,0-18.6-8.4-18.6-18.6c0-10.3,8.4-18.6,18.6-18.6c10.3,0,18.6,8.4,18.6,18.6
		C57,63.2,48.6,71.5,38.4,71.5z M82.7,96.9c-10.3,0-18.6-8.4-18.6-18.6h7.7c0,6,4.9,10.9,10.9,10.9c6,0,10.9-4.9,10.9-10.9h7.7
		C101.3,88.5,93,96.9,82.7,96.9z M82.7,71.5c-10.3,0-18.6-8.4-18.6-18.6c0-10.3,8.4-18.6,18.6-18.6c10.3,0,18.6,8.4,18.6,18.6
		C101.3,63.2,93,71.5,82.7,71.5z"/>
</g>
</svg>
