<?xml version="1.0" encoding="UTF-8" standalone="no"?>
<svg
   xmlns:dc="http://purl.org/dc/elements/1.1/"
   xmlns:cc="http://creativecommons.org/ns#"
   xmlns:rdf="http://www.w3.org/1999/02/22-rdf-syntax-ns#"
   xmlns:svg="http://www.w3.org/2000/svg"
   xmlns="http://www.w3.org/2000/svg"
   xmlns:sodipodi="http://sodipodi.sourceforge.net/DTD/sodipodi-0.dtd"
   xmlns:inkscape="http://www.inkscape.org/namespaces/inkscape"
   inkscape:version="1.0 (4035a4f, 2020-05-01)"
   sodipodi:docname="cityAndSun.svg"
   id="svg871"
   version="1.1"
   viewBox="0 0 617.642 299.609"
   height="299.609"
   width="617.642">
  <metadata
     id="metadata875">
    <rdf:RDF>
      <cc:Work
         rdf:about="">
        <dc:format>image/svg+xml</dc:format>
        <dc:type
           rdf:resource="http://purl.org/dc/dcmitype/StillImage" />
        <dc:title></dc:title>
      </cc:Work>
    </rdf:RDF>
  </metadata>
  <sodipodi:namedview
     inkscape:current-layer="svg871"
     inkscape:window-maximized="0"
     inkscape:window-y="23"
     inkscape:window-x="0"
     inkscape:cy="149.8045"
     inkscape:cx="308.82101"
     inkscape:zoom="1.9995401"
     showgrid="false"
     id="namedview873"
     inkscape:window-height="785"
     inkscape:window-width="1648"
     inkscape:pageshadow="2"
     inkscape:pageopacity="0"
     guidetolerance="10"
     gridtolerance="10"
     objecttolerance="10"
     borderopacity="1"
     bordercolor="#666666"
     pagecolor="#ffffff" />
  <defs
     id="defs835">
    <style
       id="style833">.a,.c{fill:none;}.a,.b,.c{stroke:#353c4f;stroke-width:2px;}.a,.b{stroke-linecap:round;stroke-linejoin:round;}.b{fill:#fff;}.c{stroke-miterlimit:10;}</style>
  </defs>
  <g
     id="g869"
     transform="translate(3.398 -1736.891)">
    <g
       id="g863"
       transform="translate(169.973 1737.891)">
      <ellipse
         id="ellipse837"
         transform="translate(30.006 30.006)"
         ry="46.713"
         rx="46.713"
         cy="46.713"
         cx="46.713"
         class="a" />
      <g
         id="g843"
         transform="translate(76.719)">
        <line
           id="line839"
           y2="15.613"
           class="a" />
        <line
           id="line841"
           transform="translate(0 137.825)"
           y2="15.613"
           class="a" />
      </g>
      <g
         id="g849"
         transform="translate(22.47 22.47)">
        <line
           id="line845"
           transform="translate(0)"
           y2="11.04"
           x2="11.04"
           class="a" />
        <line
           id="line847"
           transform="translate(97.457 97.457)"
           y2="11.04"
           x2="11.04"
           class="a" />
      </g>
      <g
         id="g855"
         transform="translate(0 76.719)">
        <line
           id="line851"
           transform="translate(137.825)"
           x1="15.613"
           class="a" />
        <line
           id="line853"
           transform="translate(0)"
           x1="15.613"
           class="a" />
      </g>
      <g
         id="g861"
         transform="translate(22.47 22.47)">
        <line
           id="line857"
           transform="translate(97.457)"
           y2="11.04"
           x1="11.04"
           class="a" />
        <line
           id="line859"
           transform="translate(0 97.457)"
           y2="11.04"
           x1="11.04"
           class="a" />
      </g>
    </g>
    <path
       id="path865"
       transform="translate(19.059 1456.743)"
       d="M283.745,377.024H430.609a16.138,16.138,0,0,0,15.7-11.709c1.424-5.339.092-11.576-9.464-16.6-21.235-11.177-32.785,3.725-32.785,3.725s-4.471-16.393-20.49-17.137-21.982,13.784-21.982,13.784-16.871-34.474-49.655-21.806-20.757,32.609-20.757,32.609-12.668-9.314-21.609.373c-4.471,4.843-2.235,9.035,1.118,12.015A19.6,19.6,0,0,0,283.745,377.024Z"
       class="b" />
    <path
       id="path867"
       transform="translate(-938.5 1424.5)"
       d="M935.109,581.667l117.391-.833V564l11.5-10.833,13.167,10.5V533.333h7.333V513.5H1105v38.833h18v25.5h18.833V546H1146V522.333l25.5,19.167v40.167h3.5v-2.833h5.833V561.5h19.333v35.667h5.5v-70l18.635-.01.031,83.844h328.411"
       class="c" />
  </g>
</svg>
