<?xml version="1.0" encoding="utf-8"?>
<!-- Generator: Adobe Illustrator 24.0.0, SVG Export Plug-In . SVG Version: 6.00 Build 0)  -->
<svg version="1.1" id="Calque_1" xmlns="http://www.w3.org/2000/svg" xmlns:xlink="http://www.w3.org/1999/xlink" x="0px" y="0px"
	 viewBox="0 0 56.7 56.7" style="enable-background:new 0 0 56.7 56.7;" xml:space="preserve">
<style type="text/css">
	.st0{fill:#404755;}
	.st1{fill:#EC6500;}
</style>
<g>
	<g>
		<path class="st0" d="M31.8,56.5l-0.1-1c0.9-0.1,1.9-0.3,2.8-0.5l0.2,1C33.8,56.2,32.8,56.4,31.8,56.5z M36.6,55.5l-0.3-1
			c0.9-0.3,1.8-0.6,2.7-1l0.4,0.9C38.5,54.8,37.6,55.2,36.6,55.5z M41.2,53.6l-0.5-0.9c0.8-0.4,1.7-0.9,2.5-1.4l0.5,0.8
			C43,52.7,42.1,53.2,41.2,53.6z M45.4,51l-0.6-0.8c0.8-0.6,1.5-1.2,2.2-1.8l0.7,0.7C47,49.8,46.2,50.4,45.4,51z M49.1,47.7L48.4,47
			c0.6-0.7,1.3-1.4,1.8-2.2l0.8,0.6C50.4,46.2,49.8,47,49.1,47.7z M52.1,43.8l-0.8-0.5c0.5-0.8,1-1.6,1.4-2.5l0.9,0.5
			C53.2,42.1,52.7,43,52.1,43.8z M54.5,39.4L53.5,39c0.4-0.9,0.7-1.8,1-2.7l1,0.3C55.2,37.6,54.8,38.5,54.5,39.4z M56,34.7l-1-0.2
			c0.2-0.9,0.4-1.9,0.5-2.8l1,0.1C56.4,32.8,56.2,33.8,56,34.7z"/>
	</g>
	<g>
		<path class="st0" d="M55.5,25c-0.1-0.9-0.3-1.9-0.5-2.8l1-0.2c0.2,1,0.4,1.9,0.5,2.9L55.5,25z M54.5,20.4c-0.3-0.9-0.6-1.8-1-2.7
			l0.9-0.4c0.4,0.9,0.7,1.8,1,2.8L54.5,20.4z M52.7,15.9c-0.4-0.8-0.9-1.7-1.4-2.5l0.8-0.5c0.5,0.8,1,1.7,1.5,2.6L52.7,15.9z
			 M50.2,11.9c-0.6-0.8-1.2-1.5-1.8-2.2L49.1,9c0.7,0.7,1.3,1.5,1.9,2.3L50.2,11.9z M47,8.3c-0.7-0.6-1.4-1.3-2.2-1.8l0.6-0.8
			c0.8,0.6,1.6,1.2,2.3,1.9L47,8.3z M43.2,5.4c-0.8-0.5-1.6-1-2.5-1.4l0.5-0.9c0.9,0.5,1.7,1,2.6,1.5L43.2,5.4z M39,3.2
			c-0.9-0.4-1.8-0.7-2.7-1l0.3-1c0.9,0.3,1.9,0.6,2.8,1L39,3.2z M34.5,1.7c-0.9-0.2-1.9-0.4-2.8-0.5l0.1-1c1,0.1,2,0.3,2.9,0.5
			L34.5,1.7z"/>
	</g>
	<g>
		<path class="st0" d="M1.2,25l-1-0.1c0.1-1,0.3-2,0.5-2.9l1,0.2C1.5,23.1,1.3,24.1,1.2,25z M2.2,20.4l-1-0.3c0.3-0.9,0.6-1.9,1-2.8
			l0.9,0.4C2.8,18.5,2.5,19.4,2.2,20.4z M4,15.9l-0.9-0.5c0.4-0.9,1-1.7,1.5-2.6l0.8,0.5C4.9,14.2,4.4,15.1,4,15.9z M6.5,11.9
			l-0.8-0.6C6.3,10.5,6.9,9.7,7.6,9l0.7,0.7C7.7,10.4,7.1,11.1,6.5,11.9z M9.7,8.3L9,7.6c0.7-0.7,1.5-1.3,2.3-1.9l0.6,0.8
			C11.1,7.1,10.4,7.7,9.7,8.3z M13.4,5.4l-0.5-0.8c0.8-0.5,1.7-1,2.6-1.5L15.9,4C15.1,4.4,14.2,4.9,13.4,5.4z M17.7,3.2l-0.4-0.9
			c0.9-0.4,1.9-0.7,2.8-1l0.3,1C19.4,2.5,18.5,2.8,17.7,3.2z M22.2,1.7l-0.2-1c1-0.2,1.9-0.4,2.9-0.5l0.1,1
			C24.1,1.3,23.1,1.5,22.2,1.7z"/>
	</g>
	<g>
		<path class="st0" d="M24.9,56.5c-1-0.1-2-0.3-2.9-0.5l0.2-1c0.9,0.2,1.9,0.4,2.8,0.5L24.9,56.5z M20.1,55.5
			c-0.9-0.3-1.9-0.6-2.8-1l0.4-0.9c0.9,0.4,1.8,0.7,2.7,1L20.1,55.5z M15.5,53.6c-0.9-0.4-1.7-1-2.6-1.5l0.5-0.8
			c0.8,0.5,1.6,1,2.5,1.4L15.5,53.6z M11.3,51c-0.8-0.6-1.6-1.2-2.3-1.9l0.7-0.7c0.7,0.6,1.4,1.3,2.2,1.8L11.3,51z M7.6,47.7
			c-0.7-0.7-1.3-1.5-1.9-2.3l0.8-0.6c0.6,0.8,1.2,1.5,1.8,2.2L7.6,47.7z M4.6,43.8c-0.5-0.8-1-1.7-1.5-2.6L4,40.8
			c0.4,0.8,0.9,1.7,1.4,2.5L4.6,43.8z M2.2,39.4c-0.4-0.9-0.7-1.8-1-2.8l1-0.3c0.3,0.9,0.6,1.8,1,2.7L2.2,39.4z M0.7,34.7
			c-0.2-1-0.4-1.9-0.5-2.9l1-0.1c0.1,0.9,0.3,1.9,0.5,2.8L0.7,34.7z"/>
	</g>
	<g>
		<path class="st0" d="M28.3,56.7c-0.5,0-1,0-1.5,0l0.1-1c0.9,0,1.9,0,2.9,0l0.1,1C29.3,56.7,28.8,56.7,28.3,56.7z M56.7,29.8
			l-1-0.1c0-0.5,0-1,0-1.4c0-0.5,0-1,0-1.4l1,0c0,0.5,0,1,0,1.5C56.7,28.8,56.7,29.3,56.7,29.8z M0,29.8c0-0.5,0-1,0-1.5
			c0-0.5,0-1,0-1.5l1,0c0,0.5,0,1,0,1.4c0,0.5,0,1,0,1.4L0,29.8z M29.8,1c-1,0-1.9,0-2.9,0l-0.1-1c1,0,2,0,3,0L29.8,1z"/>
	</g>
	<g>
		<path class="st1" d="M29.7,42.1h-10c-1.7,0-3.1-1.4-3.1-3.1V14.7h1.7V39c0,0.8,0.6,1.4,1.4,1.4h10c0.8,0,1.4-0.6,1.4-1.4V17.8
			c0-0.8-0.6-1.4-1.4-1.4h-8.2v-1.7h8.2c1.7,0,3.1,1.4,3.1,3.1V39C32.8,40.7,31.4,42.1,29.7,42.1z"/>
	</g>
	<path class="st1" d="M24.7,39.3c-1,0-1.7-0.8-1.7-1.7s0.8-1.7,1.7-1.7c1,0,1.7,0.8,1.7,1.7S25.6,39.3,24.7,39.3"/>
</g>
<g>
	<rect x="17.4" y="18.1" class="st1" width="14.5" height="1.7"/>
</g>
<g>
	<g>
		<path class="st1" d="M38.8,35l-1.2-1.2c3.3-3.3,3.3-8.8,0-12.1l1.2-1.2C42.8,24.5,42.8,31,38.8,35z M36,32.9l-1.1-1.3
			c1.2-1,1.8-2.4,1.8-3.9s-0.6-2.8-1.8-3.9l1.1-1.3c1.5,1.3,2.4,3.2,2.4,5.1C38.3,29.7,37.5,31.6,36,32.9z"/>
	</g>
</g>
</svg>
