<?xml version="1.0" encoding="utf-8"?>
<!-- Generator: Adobe Illustrator 24.0.3, SVG Export Plug-In . SVG Version: 6.00 Build 0)  -->
<svg version="1.1" id="Calque_1" xmlns="http://www.w3.org/2000/svg" xmlns:xlink="http://www.w3.org/1999/xlink" x="0px" y="0px"
	 width="20px" height="85px" viewBox="0 0 20 85" style="enable-background:new 0 0 20 85;" xml:space="preserve">
<style type="text/css">
	.st0{fill:#EA6619;}
	.st1{fill:none;stroke:#CF9E1C;stroke-width:4;stroke-miterlimit:10;}
</style>
<g>
	<g>
		<circle class="st0" cx="10" cy="9.2" r="7.5"/>
	</g>
	<g>
		<circle class="st0" cx="10" cy="75.9" r="7.5"/>
	</g>
	<line class="st1" x1="10" y1="9.2" x2="10" y2="75.9"/>
</g>
</svg>
