<?xml version="1.0" encoding="UTF-8" standalone="no"?>
<svg
   xmlns:dc="http://purl.org/dc/elements/1.1/"
   xmlns:cc="http://creativecommons.org/ns#"
   xmlns:rdf="http://www.w3.org/1999/02/22-rdf-syntax-ns#"
   xmlns:svg="http://www.w3.org/2000/svg"
   xmlns="http://www.w3.org/2000/svg"
   xmlns:sodipodi="http://sodipodi.sourceforge.net/DTD/sodipodi-0.dtd"
   xmlns:inkscape="http://www.inkscape.org/namespaces/inkscape"
   width="70"
   height="70"
   viewBox="0 0 70 70"
   version="1.1"
   id="svg20"
   sodipodi:docname="avatar_100.svg"
   inkscape:version="0.92.3 (2405546, 2018-03-11)">
  <metadata
     id="metadata24">
    <rdf:RDF>
      <cc:Work
         rdf:about="">
        <dc:format>image/svg+xml</dc:format>
        <dc:type
           rdf:resource="http://purl.org/dc/dcmitype/StillImage" />
        <dc:title></dc:title>
      </cc:Work>
    </rdf:RDF>
  </metadata>
  <sodipodi:namedview
     pagecolor="#ffffff"
     bordercolor="#666666"
     borderopacity="1"
     objecttolerance="10"
     gridtolerance="10"
     guidetolerance="10"
     inkscape:pageopacity="0"
     inkscape:pageshadow="2"
     inkscape:window-width="1853"
     inkscape:window-height="1025"
     id="namedview22"
     showgrid="false"
     inkscape:zoom="7.8666667"
     inkscape:cx="15.1735"
     inkscape:cy="36.624754"
     inkscape:window-x="67"
     inkscape:window-y="27"
     inkscape:window-maximized="1"
     inkscape:current-layer="svg20" />
  <defs
     id="defs4">
    <style
       id="style2">.a{fill:#353c4f;}</style>
  </defs>
  <g
     transform="matrix(2.1142307,0,0,2.1142307,1.6525427,2.130077)"
     id="g18">
    <g
       transform="translate(0,0.4)"
       id="g8">
      <path
         class="a"
         d="M 29.523,30.4 H 15.173 A 15.1,15.1 0 0 1 0,15.4 a 15.174,15.174 0 0 1 30.347,0 V 29.576 A 0.823,0.823 0 0 1 29.523,30.4 Z M 15.173,2.047 A 13.452,13.452 0 0 0 1.647,15.4 13.452,13.452 0 0 0 15.173,28.753 H 28.7 V 15.4 A 13.452,13.452 0 0 0 15.173,2.047 Z"
         transform="translate(0,-0.4)"
         id="path6"
         inkscape:connector-curvature="0"
         style="fill:#353c4f" />
    </g>
    <g
       transform="translate(0,0.4)"
       id="g12">
      <path
         class="a"
         d="M 29.523,30.4 H 15.173 A 15.1,15.1 0 0 1 0,15.4 a 15.174,15.174 0 0 1 30.347,0 V 29.576 A 0.823,0.823 0 0 1 29.523,30.4 Z M 15.173,2.047 A 13.452,13.452 0 0 0 1.647,15.4 13.452,13.452 0 0 0 15.173,28.753 H 28.7 V 15.4 A 13.452,13.452 0 0 0 15.173,2.047 Z"
         transform="translate(0,-0.4)"
         id="path10"
         inkscape:connector-curvature="0"
         style="fill:#353c4f" />
    </g>
    <g
       transform="translate(6.858,7.67)"
       id="g16">
      <path
         class="a"
         d="m 34.3,35.248 a 12.681,12.681 0 0 0 -14.373,0 L 18.8,33.657 a 14.694,14.694 0 0 1 16.631,0 z m -7.186,-5.7 a 4.825,4.825 0 1 1 4.877,-4.825 4.864,4.864 0 0 1 -4.875,4.827 z m 0,-7.7 a 2.914,2.914 0 0 0 -2.926,2.875 2.881,2.881 0 0 0 2.928,2.877 2.875,2.875 0 1 0 0,-5.749 z"
         transform="translate(-18.8,-19.9)"
         id="path14"
         inkscape:connector-curvature="0"
         style="fill:#353c4f" />
    </g>
  </g>
</svg>
