<?xml version="1.0" encoding="UTF-8" standalone="no"?>
<!-- Generator: Adobe Illustrator 25.2.3, SVG Export Plug-In . SVG Version: 6.00 Build 0)  -->

<svg
   xmlns:dc="http://purl.org/dc/elements/1.1/"
   xmlns:cc="http://creativecommons.org/ns#"
   xmlns:rdf="http://www.w3.org/1999/02/22-rdf-syntax-ns#"
   xmlns:svg="http://www.w3.org/2000/svg"
   xmlns="http://www.w3.org/2000/svg"
   xmlns:sodipodi="http://sodipodi.sourceforge.net/DTD/sodipodi-0.dtd"
   xmlns:inkscape="http://www.inkscape.org/namespaces/inkscape"
   version="1.1"
   id="Calque_1"
   x="0px"
   y="0px"
   viewBox="0 0 154.5 142.5"
   xml:space="preserve"
   sodipodi:docname="logo.svg"
   width="154.5"
   height="142.5"
   inkscape:version="0.92.5 (2060ec1f9f, 2020-04-08)"><metadata
   id="metadata79"><rdf:RDF><cc:Work
       rdf:about=""><dc:format>image/svg+xml</dc:format><dc:type
         rdf:resource="http://purl.org/dc/dcmitype/StillImage" /><dc:title></dc:title></cc:Work></rdf:RDF></metadata><defs
   id="defs77" /><sodipodi:namedview
   pagecolor="#ffffff"
   bordercolor="#666666"
   borderopacity="1"
   objecttolerance="10"
   gridtolerance="10"
   guidetolerance="10"
   inkscape:pageopacity="0"
   inkscape:pageshadow="2"
   inkscape:window-width="1920"
   inkscape:window-height="1043"
   id="namedview75"
   showgrid="false"
   inkscape:zoom="0.64043419"
   inkscape:cx="184.25"
   inkscape:cy="184.25"
   inkscape:window-x="0"
   inkscape:window-y="0"
   inkscape:window-maximized="1"
   inkscape:current-layer="Calque_1" />
<style
   type="text/css"
   id="style2">
	.st0{fill:#9FC519;}
	.st1{fill:#534395;}
</style>
<g
   id="fond_vert"
   transform="translate(-90.563559,-108.89195)">
	<g
   id="g60">
		<g
   id="g6">
			<path
   class="st0"
   d="m 163.3,244.5 c -20.3,0 -39.8,-11.3 -49,-30.6 -1.6,-3.3 -0.2,-7.4 3.2,-8.9 3.3,-1.6 7.3,-0.2 8.9,3.1 9.7,20.3 34.4,28.7 55,18.9 3.3,-1.6 7.4,-0.2 8.9,3.1 1.6,3.3 0.2,7.4 -3.1,8.9 -7.8,3.8 -15.9,5.5 -23.9,5.5 z"
   id="path4"
   inkscape:connector-curvature="0"
   style="fill:#9fc519" />
		</g>
		<g
   id="g58">
			<path
   class="st0"
   d="m 112.2,165.5 c -0.7,0 -1.4,-0.2 -2.1,-0.5 -2.2,-1.1 -3,-3.8 -1.8,-6 l 0.1,-0.2 c 1.2,-2.1 3.9,-3 6,-1.8 2.1,1.2 3,3.8 1.8,5.9 l -0.2,0.3 c -0.7,1.5 -2.2,2.3 -3.8,2.3 z m 8.3,-12.4 c -1,0 -2,-0.3 -2.8,-1 -1.9,-1.5 -2.2,-4.3 -0.6,-6.2 l 0.3,-0.3 c 1.6,-1.9 4.3,-2.1 6.2,-0.6 1.9,1.6 2.1,4.3 0.6,6.2 l -0.2,0.2 c -0.9,1.1 -2.2,1.7 -3.5,1.7 z m 10.7,-10.5 c -1.3,0 -2.6,-0.6 -3.4,-1.6 -1.5,-1.9 -1.2,-4.7 0.7,-6.2 l 0.4,-0.3 c 1.9,-1.5 4.7,-1.1 6.2,0.8 1.5,1.9 1.1,4.7 -0.8,6.2 l -0.2,0.2 c -1,0.6 -2,0.9 -2.9,0.9 z m 12.7,-8 c -1.7,0 -3.2,-0.9 -4,-2.5 -1,-2.2 -0.1,-4.8 2.1,-5.9 l 0.3,-0.2 c 2.2,-1 4.8,-0.1 5.9,2.1 1,2.2 0.1,4.8 -2.1,5.9 l -0.3,0.1 c -0.7,0.4 -1.3,0.5 -1.9,0.5 z m 43.7,-0.6 c -0.7,0 -1.4,-0.1 -2,-0.5 l -0.3,-0.2 c -2.2,-1.1 -3.1,-3.7 -1.9,-5.9 1.1,-2.2 3.7,-3 5.9,-1.9 l 0.3,0.2 c 2.2,1.1 3,3.8 1.9,5.9 -0.7,1.5 -2.3,2.4 -3.9,2.4 z m -29.5,-4 c -2.1,0 -3.9,-1.5 -4.3,-3.6 -0.4,-2.4 1.2,-4.7 3.6,-5.1 l 0.4,-0.1 c 2.4,-0.4 4.7,1.2 5.1,3.6 0.4,2.4 -1.2,4.7 -3.6,5.1 l -0.4,0.1 c -0.3,-0.1 -0.6,0 -0.8,0 z m 15.3,-0.5 c -0.2,0 -0.4,0 -0.6,0 h -0.3 c -2.4,-0.3 -4.1,-2.5 -3.8,-4.9 0.3,-2.4 2.5,-4.1 4.9,-3.8 l 0.4,0.1 c 2.4,0.3 4.1,2.6 3.8,5 -0.4,2 -2.3,3.6 -4.4,3.6 z"
   id="path8"
   inkscape:connector-curvature="0"
   style="fill:#9fc519" />
			<g
   id="g54">
				<g
   id="g32">
					<g
   id="g30">
						<g
   id="g12">
							<path
   class="st1"
   d="m 99.1,181 c -0.5,-2.6 0.7,-4 2.6,-4.4 0.9,-0.2 1.6,-0.1 2.3,0.4 1,-0.9 2.3,-1.3 3.5,-1.6 2.4,-0.5 4.4,-0.3 6.2,0.5 1.3,-1.4 3.2,-2.4 5.5,-2.9 5.8,-1.2 9.8,1.4 11,7.2 l 1.6,7.9 c 0.6,2.7 -0.7,4.2 -2.5,4.6 -1.9,0.4 -3.6,-0.5 -4.1,-3.2 l -1.6,-7.8 c -0.3,-1.4 -1.7,-2.3 -3.1,-2 -1.3,0.3 -2.2,1.5 -2,2.8 l 1.7,8 c 0.6,2.7 -0.7,4.2 -2.5,4.6 -1.9,0.4 -3.6,-0.5 -4.1,-3.2 l -1.6,-7.8 c -0.3,-1.4 -1.7,-2.3 -3.1,-2 -1.3,0.3 -2.2,1.5 -2,2.8 l 1.7,8 c 0.5,2.6 -0.7,4.2 -2.4,4.6 -1.9,0.4 -3.5,-0.3 -4.2,-3.2 z"
   id="path10"
   inkscape:connector-curvature="0"
   style="fill:#534395" />
						</g>
						<g
   id="g16">
							<path
   class="st1"
   d="m 141.5,168.3 c 5.8,-1.2 11.4,2.5 12.6,8.3 1.2,5.9 -2.5,11.5 -8.3,12.7 -5.8,1.2 -11.5,-2.5 -12.7,-8.4 -1.1,-5.8 2.6,-11.4 8.4,-12.6 z m 3,14.3 c 2.1,-0.4 3.5,-2.5 3,-4.7 -0.4,-2.1 -2.5,-3.5 -4.6,-3 -2.2,0.4 -3.5,2.5 -3,4.6 0.4,2.2 2.4,3.6 4.6,3.1 z"
   id="path14"
   inkscape:connector-curvature="0"
   style="fill:#534395" />
						</g>
						<g
   id="g20">
							<path
   class="st1"
   d="m 153.3,161.6 c -0.5,-2.4 0.2,-4.1 2.6,-4.6 1.8,-0.4 3.5,0.6 4.1,3.2 l 1,4.8 c 1.1,-0.8 2.3,-1.2 3.8,-1.6 5.7,-1.2 11.4,2.6 12.6,8.3 1.2,5.8 -2.6,11.4 -8.3,12.6 -1.8,0.4 -3.6,0.3 -5.1,-0.1 -0.5,0.7 -1.2,1.3 -2.2,1.5 -2,0.4 -3.7,-0.9 -4.1,-3.2 z m 12.8,8.5 c -2.2,0.5 -3.6,2.5 -3.1,4.7 0.5,2.2 2.5,3.6 4.7,3.1 2.2,-0.4 3.5,-2.5 3.1,-4.7 -0.5,-2.2 -2.5,-3.6 -4.7,-3.1 z"
   id="path18"
   inkscape:connector-curvature="0"
   style="fill:#534395" />
						</g>
						<g
   id="g24">
							<path
   class="st1"
   d="m 178.9,153.1 c 1.8,-0.4 3.7,0.9 4,2.6 0.4,1.8 -0.9,3.7 -2.6,4 -1.8,0.4 -3.6,-0.8 -4,-2.6 -0.5,-1.8 0.7,-3.6 2.6,-4 z m -1,12 c -0.6,-2.7 0.6,-4.2 2.5,-4.6 1.8,-0.4 3.6,0.5 4.1,3.2 l 2.6,12.7 c 0.6,2.7 -0.7,4.2 -2.5,4.6 -1.9,0.4 -3.6,-0.5 -4.1,-3.2 z"
   id="path22"
   inkscape:connector-curvature="0"
   style="fill:#534395" />
						</g>
						<g
   id="g28">
							<path
   class="st1"
   d="m 186.3,154.7 c -0.6,-2.7 0.6,-4.2 2.6,-4.6 1.8,-0.4 3.5,0.6 4.1,3.2 l 4.4,21.1 c 0.6,2.7 -0.7,4.2 -2.4,4.6 -1.9,0.4 -3.6,-0.5 -4.2,-3.2 z"
   id="path26"
   inkscape:connector-curvature="0"
   style="fill:#534395" />
						</g>
					</g>
				</g>
				<g
   id="g52">
					<g
   id="g50">
						<g
   id="g36">
							<path
   class="st1"
   d="m 155,194.6 c 1.8,-0.4 3.5,-0.3 5.1,0.1 0.5,-0.8 1.2,-1.3 2.2,-1.5 l 0.3,-0.1 c 2.3,-0.3 3.4,1.5 3.8,3.3 l 2.7,13 c 0.4,1.9 -0.1,4.1 -2.2,4.5 l -0.2,0.1 c -0.9,0.2 -1.9,0.1 -2.6,-0.5 -1.3,1 -2.9,1.8 -4.6,2.1 -5.7,1.2 -11.4,-2.6 -12.6,-8.3 -1.2,-5.7 2.4,-11.5 8.1,-12.7 z m 3,14.5 c 2.2,-0.5 3.6,-2.5 3.1,-4.8 -0.5,-2.2 -2.5,-3.6 -4.7,-3.1 -2.2,0.4 -3.5,2.5 -3.1,4.8 0.5,2.2 2.6,3.5 4.7,3.1 z"
   id="path34"
   inkscape:connector-curvature="0"
   style="fill:#534395" />
						</g>
						<g
   id="g40">
							<path
   class="st1"
   d="m 190.7,205.2 c 0.5,2.6 -0.7,4 -2.6,4.4 -0.9,0.2 -1.6,0.1 -2.4,-0.3 -1,0.8 -2.3,1.3 -3.5,1.5 -5.8,1.2 -9.9,-1.4 -11.1,-7.2 l -1.6,-7.9 c -0.6,-2.7 0.7,-4.2 2.5,-4.6 1.9,-0.4 3.6,0.5 4.1,3.2 l 1.6,7.8 c 0.3,1.4 1.7,2.3 3.1,2 1.3,-0.3 2.2,-1.5 2.1,-2.8 l -1.7,-8 c -0.5,-2.6 0.7,-4.2 2.4,-4.6 1.9,-0.4 3.5,0.3 4.2,3.2 z"
   id="path38"
   inkscape:connector-curvature="0"
   style="fill:#534395" />
						</g>
						<g
   id="g44">
							<path
   class="st1"
   d="m 213.9,200.1 c 0.5,2.3 -0.5,4.1 -2.5,4.6 -0.9,0.2 -1.8,0 -2.6,-0.5 -1.2,0.9 -2.8,1.7 -4.6,2.1 -5.8,1.2 -11.5,-2.5 -12.7,-8.3 -1.2,-5.8 2.6,-11.4 8.3,-12.6 1.5,-0.3 2.7,-0.4 4.1,-0.1 l -1,-4.9 c -0.6,-2.7 0.6,-4.2 2.5,-4.6 2.3,-0.5 3.6,0.8 4.1,3.2 z m -11.1,-0.3 c 2.2,-0.5 3.5,-2.5 3.1,-4.7 -0.4,-2.2 -2.5,-3.6 -4.7,-3.1 -2.2,0.5 -3.6,2.5 -3.1,4.7 0.5,2.2 2.5,3.5 4.7,3.1 z"
   id="path42"
   inkscape:connector-curvature="0"
   style="fill:#534395" />
						</g>
						<g
   id="g48">
							<path
   class="st1"
   d="m 231.6,193.2 c 0.1,-0.1 0.4,-0.1 0.6,-0.2 1.6,-0.3 2.7,0.4 3,1.9 0.2,1 0,1.9 -0.6,2.7 -1.6,2.3 -4.1,3.2 -6.6,3.7 -5.8,1.2 -11.5,-2.5 -12.7,-8.4 -1.2,-5.8 2.5,-11.4 8.3,-12.6 5.4,-1.1 10.6,2 12.2,7.1 l 0.1,0.3 c 0.4,1.8 -0.9,3.5 -2.6,3.9 l -10.4,2.2 c 0.2,0.8 2,2 4.2,1.6 2.9,-0.6 2.9,-1.7 4.5,-2.2 z m -2.8,-5.3 c -0.2,-0.9 -1.8,-1.8 -4,-1.3 -2.2,0.5 -3.2,2.4 -3.1,2.8 v 0 z"
   id="path46"
   inkscape:connector-curvature="0"
   style="fill:#534395" />
						</g>
					</g>
				</g>
			</g>
			<path
   class="st1"
   d="m 224.8,118.7 c -9.8,-3.7 -20.2,-0.3 -25,12.2 -4.8,12.5 5.7,34.6 5.7,34.6 0,0 24.9,-8.6 29.7,-21.1 4.8,-12.5 -0.6,-22 -10.4,-25.7 z m 1,21.3 c -1.7,4.4 -6.6,6.6 -11.1,4.9 -4.5,-1.7 -6.6,-6.6 -4.9,-11.1 1.7,-4.5 6.6,-6.6 11.1,-4.9 4.4,1.7 6.6,6.6 4.9,11.1 z"
   id="path56"
   inkscape:connector-curvature="0"
   style="fill:#534395" />
		</g>
	</g>
</g>
<g
   id="colline"
   transform="translate(0,-226)">
</g>
<g
   id="tracé"
   transform="translate(0,-226)">
</g>
<g
   id="teleephone"
   transform="translate(0,-226)">
</g>
<g
   id="picto"
   transform="translate(0,-226)">
</g>
<g
   id="bande_violette"
   transform="translate(0,-226)">
</g>
<g
   id="blanc"
   transform="translate(0,-226)">
</g>
<g
   id="bas"
   transform="translate(0,-226)">
</g>
<g
   id="Telecharger"
   transform="translate(0,-226)">
</g>
<g
   id="bulle"
   transform="translate(0,-226)">
</g>
<g
   id="head"
   transform="translate(0,-226)">
</g>
<g
   id="votre_trajet"
   transform="translate(0,-226)">
</g>
</svg>