<?xml version="1.0" encoding="utf-8"?>
<!-- Generator: Adobe Illustrator 24.0.3, SVG Export Plug-In . SVG Version: 6.00 Build 0)  -->
<svg version="1.1" id="Calque_1" xmlns="http://www.w3.org/2000/svg" xmlns:xlink="http://www.w3.org/1999/xlink" x="0px" y="0px"
	 width="11px" height="19px" viewBox="0 0 11 19" style="enable-background:new 0 0 11 19;" xml:space="preserve">
<style type="text/css">
	.st0{fill:#FF802C;}
</style>
<path class="st0" d="M6.4,4.9c0-1,0.9-0.9,0.9-0.9H10V1H5.9C2.8,1,2.8,4.4,2.8,4.4v2.3v0L1,6.7v2.8h1.8V18h3.7V9.5h3.1L10,6.7
	l-3.6,0v0C6.4,6.7,6.4,5.9,6.4,4.9z"/>
</svg>
