<svg id="Groupe_121" data-name="Groupe 121" xmlns="http://www.w3.org/2000/svg" xmlns:xlink="http://www.w3.org/1999/xlink" width="24.463" height="28.587" viewBox="0 0 24.463 28.587">
  <defs>
    <clipPath id="clip-path">
      <rect id="Rectangle_65" data-name="Rectangle 65" width="24.463" height="28.587" fill="none"/>
    </clipPath>
  </defs>
  <g id="Groupe_120" data-name="Groupe 120" transform="translate(0 0)" clip-path="url(#clip-path)">
    <path id="Tracé_910" data-name="Tracé 910" d="M24.459,11.565q-.351.034-.7.036A7.633,7.633,0,0,1,17.37,8.151V19.9a8.685,8.685,0,1,1-8.685-8.685c.181,0,.359.017.537.028v4.28a4.3,4.3,0,0,0-.537-.055,4.433,4.433,0,0,0,0,8.866A4.541,4.541,0,0,0,13.3,19.958L13.339,0h4.095a7.626,7.626,0,0,0,7.029,6.809v4.757" transform="translate(0 0)" fill="#fff"/>
  </g>
</svg>
