<?xml version="1.0" encoding="utf-8"?>
<!-- Generator: Adobe Illustrator 24.0.3, SVG Export Plug-In . SVG Version: 6.00 Build 0)  -->
<svg version="1.1" id="Calque_1" xmlns="http://www.w3.org/2000/svg" xmlns:xlink="http://www.w3.org/1999/xlink" x="0px" y="0px"
	 width="20px" height="36px" viewBox="0 0 20 36" style="enable-background:new 0 0 20 36;" xml:space="preserve">
<style type="text/css">
	.st0{fill:#FFFFFF;}
</style>
<path class="st0" d="M11.9,9.1c0-2,1.7-1.7,1.7-1.7h5.5V1.3h-8.2c-6.2,0-6.3,6.8-6.3,6.8v4.6v0l-3.5,0v5.5h3.5v17h7.3v-17h6.2l1-5.7
	l-7.2,0.1v-0.1C11.9,12.6,11.9,11.1,11.9,9.1z"/>
</svg>
