<?xml version="1.0" encoding="utf-8"?>
<!-- Generator: Adobe Illustrator 23.1.1, SVG Export Plug-In . SVG Version: 6.00 Build 0)  -->
<svg version="1.1" id="Calque_1" xmlns="http://www.w3.org/2000/svg" xmlns:xlink="http://www.w3.org/1999/xlink" x="0px" y="0px"
	 width="70px" height="70px" viewBox="0 0 70 70" style="enable-background:new 0 0 70 70;" xml:space="preserve">
<style type="text/css">
	.st0{fill:#E3640A;}
	.st1{fill:#ffd27b;}
</style>
<g>
	<circle class="st0" cx="35" cy="35" r="30"/>
	<path class="st1" d="M43.7,39.3c-2.4,1.9-5.4,3.1-8.7,3.1c-3.3,0-6.3-1.2-8.7-3.1c-5.6,2.6-9.9,7.5-11.5,13.6
		c5,5.6,12.2,9.2,20.3,9.2s15.3-3.6,20.3-9.2C53.6,46.8,49.3,41.8,43.7,39.3z"/>
	<circle class="st1" cx="35" cy="28.6" r="10.8"/>
</g>
</svg>