<?xml version="1.0" encoding="utf-8"?>
<!-- Generator: Adobe Illustrator 24.0.3, SVG Export Plug-In . SVG Version: 6.00 Build 0)  -->
<svg version="1.1" id="Calque_1" xmlns="http://www.w3.org/2000/svg" xmlns:xlink="http://www.w3.org/1999/xlink" x="0px" y="0px"
	 width="44px" height="36px" viewBox="0 0 44 36" style="enable-background:new 0 0 44 36;" xml:space="preserve">
<style type="text/css">
	.st0{fill:#FFFFFF;}
</style>
<path class="st0" d="M38.2,6.4c0,0,3.2-2.6,3.5-4.7c0,0-2.2,1.6-5.4,2.1c0,0-3-3.7-8.6-2.4c-5.6,1.3-6.8,7.6-6.1,10.1
	c0,0-9.7,0.2-17.6-8.9c0,0-3.9,6.5,2.8,11.4c0,0-3.2-0.2-3.9-1c0,0-0.3,6.8,7,8.4c0,0-1.7,0.6-4,0.4c0,0,1.9,5.6,8,5.7
	c0,0-5.6,4.6-12.8,3.6c0,0,7.6,5.6,18,3.4c0.5-0.1,1-0.2,1.5-0.4c6.6-2,12.3-6.3,15.4-12.5c0.2-0.4,0.4-0.8,0.6-1.2
	c1.4-3,2.4-6.7,2.1-11.1c0,0,3.3-2.3,4.3-4.3C43,5.1,40.9,6.1,38.2,6.4z"/>
</svg>
