{
    "VOCABULARY_NAME": "Single term vocabulary",
    "VOCABULARY_PURL": "https://purls.helmholtz-metadaten.de/vp/Singlet-56465003-vp",
    "VOCPOPULI_GLOBAL_ID": "Singlet-56465003-vp",
    "VOCABULARY_PUBLISHER": "Mohammad Seyedalizadeh",
    "VOCABULARY_PUBLISHED_ON_UTC": "2024-06-10T13:45:31.152838",
    "VOCABULARY_UPDATED_ON_UTC": "2024-06-10T13:45:31.152864",
    "VOCABULARY_LICENSE": {
        "name": null,
        "html_url": null
    },
    "VOCABULARY_CONTRIBUTORS": [
        {
            "name": "Mohammad Seyedalizadeh",
            "email": "mo.seyedalizadeh@gmail.com",
            "commits": 6,
            "additions": 0,
            "deletions": 0
        }
    ]
}