{
    "VOCABULARY_NAME": "Single term vocabulary",
    "VOCABULARY_PURL": "https://purls.helmholtz-metadaten.de/vp/Singlet-56465003-vp",
    "VOCPOPULI_GLOBAL_ID": "Singlet-56465003-vp",
    "VOCABULARY_PUBLISHER": "Mohammad Seyedalizadeh",
    "VOCABULARY_PUBLISHED_ON_UTC": "2024-06-03T10:26:20.761766",
    "VOCABULARY_UPDATED_ON_UTC": "2024-06-03T10:26:20.761790",
    "VOCABULARY_LICENSE": {
        "key": "cc-by-4.0",
        "name": "Creative Commons Attribution 4.0 International",
        "nickname": null,
        "html_url": "https://creativecommons.org/licenses/by/4.0",
        "source_url": null
    },
    "VOCABULARY_CONTRIBUTORS": [
        {
            "name": "Mohammad Seyedalizadeh",
            "email": "mo.seyedalizadeh@gmail.com",
            "commits": 6,
            "additions": 0,
            "deletions": 0
        }
    ]
}