[
  {
    "@id": "https://purls.helmholtz-metadaten.de/vp/Testxxx-54900989-vp/pro_xxx_xxx-0ba7c30f13f4471ea6327cdd5fa4a562-vp",
    "@type": [
      "http://www.w3.org/2004/02/skos/core#Concept"
    ],
    "http://www.w3.org/2004/02/skos/core#broader": [
      {
        "@id": "https://purls.helmholtz-metadaten.de/vp/Testxxx-54900989-vp/pro_ter_xxx-8a05ff3d8b95404796b5fe6efcb5cef5-vp"
      }
    ],
    "http://www.w3.org/2004/02/skos/core#definition": [
      {
        "@language": "en",
        "@value": "for testing"
      }
    ],
    "http://www.w3.org/2004/02/skos/core#inScheme": [
      {
        "@id": "https://purls.helmholtz-metadaten.de/vp/Testxxx-54900989-vp"
      }
    ],
    "http://www.w3.org/2004/02/skos/core#notation": [
      {
        "@value": "b39eb022200f43538f66f90acb15bd63-vp"
      },
      {
        "@value": "b34c16ee598a40a69542f91779aaf21d-vp"
      }
    ],
    "http://www.w3.org/2004/02/skos/core#prefLabel": [
      {
        "@language": "en",
        "@value": "property2"
      }
    ],
    "http://www.w3.org/2004/02/skos/core#scopeNote": [
      {
        "@language": "en",
        "@value": "string"
      }
    ]
  }
]