[
  {
    "@id": "https://purls.helmholtz-metadaten.de/vp/Testxxx-54900989-vp/pro_ter_xxx-8a05ff3d8b95404796b5fe6efcb5cef5-vp",
    "@type": [
      "http://www.w3.org/2004/02/skos/core#Concept"
    ],
    "http://www.w3.org/2004/02/skos/core#definition": [
      {
        "@language": "en",
        "@value": "process "
      }
    ],
    "http://www.w3.org/2004/02/skos/core#inScheme": [
      {
        "@id": "https://purls.helmholtz-metadaten.de/vp/Testxxx-54900989-vp"
      }
    ],
    "http://www.w3.org/2004/02/skos/core#notation": [
      {
        "@value": "05b46e48eb504d4f87527863b1ed55e1-vp"
      },
      {
        "@value": "cce1d1c51f064897b449f003319cc07b-vp"
      }
    ],
    "http://www.w3.org/2004/02/skos/core#prefLabel": [
      {
        "@language": "en",
        "@value": "process term "
      }
    ],
    "http://www.w3.org/2004/02/skos/core#scopeNote": [
      {
        "@language": "en",
        "@value": "process"
      },
      {
        "@language": "en",
        "@value": "record"
      }
    ]
  }
]