{
    "VOCABULARY_NAME": "Skostest",
    "VOCABULARY_PURL": "https://purls.helmholtz-metadaten.de/vp/Skostes-55842324-vp",
    "VOCPOPULI_GLOBAL_ID": "Skostes-55842324-vp",
    "VOCABULARY_PUBLISHER": "Mohammad Seyedalizadeh",
    "VOCABULARY_PUBLISHED_ON_UTC": "2024-06-20T10:52:31.925109",
    "VOCABULARY_UPDATED_ON_UTC": "2024-06-20T10:52:31.925117",
    "VOCABULARY_LICENSE": {
        "name": null,
        "html_url": null
    },
    "VOCABULARY_CONTRIBUTORS": [
        {
            "name": "Mohammad Seyedalizadeh",
            "email": "mo.seyedalizadeh@gmail.com",
            "commits": 6,
            "additions": 0,
            "deletions": 0
        }
    ]
}