﻿height,geneder,name,width
180,male,sam,180
200,male,sam2,200
130,male,omar,130
150,male,ahmad,150
160,male,muhammad,160
170,male,ahmad2,170
200,female,hiba,200
50,female,fatima,50
100,female,afnan,100
10,female,othman,500
300,female,somer,500
