{
  "name": "Linda",
  "github": "",
  "twitter": "",
  "site": "",
  "avatar": "https://s3.amazonaws.com/assets.site.getmny.co/linda.jpg",
  "instagram": "https://www.instagram.com/lindaaaohvee/",
  "bio": {
    "short": "Linda is a marketing specialist and graphic designer who loves to eat.",
    "long":
      "Linda is a marketing specialist and graphic designer who loves to eat. She loves dogs, and all sorts of animals. She loves makeup, sleeping in, and video games (Brawl Stars and League of Legends)."
    }
}
