{
  "took" : 5,
  "timed_out" : false,
  "_shards" : {
    "total" : 1,
    "successful" : 1,
    "skipped" : 0,
    "failed" : 0
  },
  "hits" : {
    "total" : {
      "value" : 10000,
      "relation" : "gte"
    },
    "max_score" : 1.0,
    "hits" : [
      {
        "_index" : "bu-collection-event-manual__2024-03-14t0636553639210000",
        "_type" : "_doc",
        "_id" : "tWWuO44BF3xNhTExOXkP",
        "_score" : 1.0,
        "_source" : {
          "created_at" : "2024-03-13T12:41:10.660140",
          "geolocation_id" : "760f9ca7-724b-5785-8e70-a33a1b6995ca",
          "is_deleted" : false,
          "deleted_at" : null,
          "collection_event_id" : "84ab5a09-d6f5-54d9-9bfe-3580351c25ba",
          "coordinates_id" : "70912bf8-e652-5036-89bd-8969095311f3",
          "attributes" : {
            "collected_by" : "Descamps M."
          },
          "last_modified_at" : "2024-03-13T12:41:10.764210"
        }
      },
      {
        "_index" : "bu-collection-event-manual__2024-03-14t0636553639210000",
        "_type" : "_doc",
        "_id" : "tmWuO44BF3xNhTExOXkP",
        "_score" : 1.0,
        "_source" : {
          "created_at" : "2024-03-13T12:41:10.660142",
          "geolocation_id" : "7c3839ef-a321-5f84-8713-04e4844e0206",
          "is_deleted" : false,
          "deleted_at" : null,
          "collection_event_id" : "f0404750-e5e2-5fcd-9c22-3409bdea833a",
          "coordinates_id" : "f531dc23-3c47-57b5-a771-1624e69f1a44",
          "attributes" : {
            "collected_by" : "Aubert de la Rüe E."
          },
          "last_modified_at" : "2024-03-13T12:41:10.764212"
        }
      },
      {
        "_index" : "bu-collection-event-manual__2024-03-14t0636553639210000",
        "_type" : "_doc",
        "_id" : "t2WuO44BF3xNhTExOXkP",
        "_score" : 1.0,
        "_source" : {
          "created_at" : "2024-03-13T12:41:10.660144",
          "geolocation_id" : "4a6f5a5c-54ac-5ada-a002-19b3e1d98687",
          "is_deleted" : false,
          "deleted_at" : null,
          "collection_event_id" : "ebf047c3-4ce3-557d-832c-ebd4ac9f1871",
          "coordinates_id" : "f7546aca-9f9e-54ce-9256-d1a905b12cf0",
          "attributes" : {
            "collected_by" : "Descamps M."
          },
          "last_modified_at" : "2024-03-13T12:41:10.764214"
        }
      },
      {
        "_index" : "bu-collection-event-manual__2024-03-14t0636553639210000",
        "_type" : "_doc",
        "_id" : "uGWuO44BF3xNhTExOXkP",
        "_score" : 1.0,
        "_source" : {
          "created_at" : "2024-03-13T12:41:10.660146",
          "geolocation_id" : "50a3b949-1c3e-5fed-a9f3-5c30b63b5d5f",
          "is_deleted" : false,
          "deleted_at" : null,
          "collection_event_id" : "25768831-69d1-5993-888d-e9c3935c67ac",
          "coordinates_id" : "9f4ef388-4fe8-5ac4-b0b7-6674b1166291",
          "attributes" : {
            "collected_by" : "Descamps M."
          },
          "last_modified_at" : "2024-03-13T12:41:10.764216"
        }
      },
      {
        "_index" : "bu-collection-event-manual__2024-03-14t0636553639210000",
        "_type" : "_doc",
        "_id" : "uWWuO44BF3xNhTExOXkP",
        "_score" : 1.0,
        "_source" : {
          "created_at" : "2024-03-13T12:41:10.660147",
          "geolocation_id" : "bf7fc7f8-906e-5b17-9111-a710767bc4db",
          "is_deleted" : false,
          "deleted_at" : null,
          "collection_event_id" : "949ec9d4-44c8-5517-a3e0-bdee3218f702",
          "coordinates_id" : "c5394a88-4be7-5081-b2a2-5372dbcdf9c0",
          "attributes" : {
            "collected_by" : "Descamps M."
          },
          "last_modified_at" : "2024-03-13T12:41:10.764218"
        }
      },
      {
        "_index" : "bu-collection-event-manual__2024-03-14t0636553639210000",
        "_type" : "_doc",
        "_id" : "umWuO44BF3xNhTExOXkP",
        "_score" : 1.0,
        "_source" : {
          "created_at" : "2024-03-13T12:41:10.660149",
          "geolocation_id" : "a0600f36-4f6c-55ba-88c1-838e8175b7d9",
          "is_deleted" : false,
          "deleted_at" : null,
          "collection_event_id" : "91861129-5f9f-57ce-8ad3-9cf546f4c9b7",
          "coordinates_id" : "ff855348-73d2-5f09-8216-05807793a9df",
          "attributes" : {
            "collected_by" : "Lucas H.",
            "remarks" : "environs d'Alger"
          },
          "last_modified_at" : "2024-03-13T12:41:10.764223"
        }
      },
      {
        "_index" : "bu-collection-event-manual__2024-03-14t0636553639210000",
        "_type" : "_doc",
        "_id" : "u2WuO44BF3xNhTExOXkP",
        "_score" : 1.0,
        "_source" : {
          "created_at" : "2024-03-13T12:41:10.660151",
          "geolocation_id" : "726a1ce7-95e7-5720-9a85-310b50b861af",
          "is_deleted" : false,
          "deleted_at" : null,
          "collection_event_id" : "cd365fc3-90aa-57f8-9636-8107307d6b84",
          "coordinates_id" : "d2077bb7-be47-531d-baf0-d3aeb16e17f9",
          "attributes" : {
            "collected_by" : "Descamps M."
          },
          "last_modified_at" : "2024-03-13T12:41:10.764225"
        }
      },
      {
        "_index" : "bu-collection-event-manual__2024-03-14t0636553639210000",
        "_type" : "_doc",
        "_id" : "vGWuO44BF3xNhTExOXkP",
        "_score" : 1.0,
        "_source" : {
          "created_at" : "2024-03-13T12:41:10.660155",
          "geolocation_id" : "7d196fdc-654e-5287-90fd-15eaf02bf643",
          "is_deleted" : false,
          "deleted_at" : null,
          "collection_event_id" : "9e3e6049-e7b3-5446-9cf4-9a4436736535",
          "coordinates_id" : "c740695b-cc4b-5923-8d83-0fe4808700e3",
          "attributes" : {
            "collected_by" : "Wagner E.-R."
          },
          "last_modified_at" : "2024-03-13T12:41:10.764227"
        }
      },
      {
        "_index" : "bu-collection-event-manual__2024-03-14t0636553639210000",
        "_type" : "_doc",
        "_id" : "vWWuO44BF3xNhTExOXkP",
        "_score" : 1.0,
        "_source" : {
          "created_at" : "2024-03-13T12:41:10.660156",
          "geolocation_id" : "865a6ff3-baff-5f92-a501-fac665b2dcc7",
          "is_deleted" : false,
          "deleted_at" : null,
          "collection_event_id" : "247963e2-a40f-5ec2-b737-acd2c503aa0f",
          "coordinates_id" : "c5537c7a-6904-5e62-ba1e-0de8f4cd18ef",
          "attributes" : {
            "collected_by" : "Descamps M."
          },
          "last_modified_at" : "2024-03-13T12:41:10.764229"
        }
      },
      {
        "_index" : "bu-collection-event-manual__2024-03-14t0636553639210000",
        "_type" : "_doc",
        "_id" : "vmWuO44BF3xNhTExOXkP",
        "_score" : 1.0,
        "_source" : {
          "created_at" : "2024-03-13T12:41:10.660158",
          "geolocation_id" : "8fa7a86d-472d-568f-8341-823b6dea63b8",
          "is_deleted" : false,
          "deleted_at" : null,
          "collection_event_id" : "b1a852c2-7887-5683-b824-1c9769044dfe",
          "coordinates_id" : "83ed009f-c1bc-50e9-bb30-15bdbd89dd43",
          "attributes" : {
            "collected_by" : "Descamps M."
          },
          "last_modified_at" : "2024-03-13T12:41:10.764231"
        }
      },
      {
        "_index" : "bu-collection-event-manual__2024-03-14t0636553639210000",
        "_type" : "_doc",
        "_id" : "v2WuO44BF3xNhTExOXkP",
        "_score" : 1.0,
        "_source" : {
          "created_at" : "2024-03-13T12:41:10.660160",
          "geolocation_id" : "c7f3a8db-4dea-511e-a145-3a5442f8b01a",
          "is_deleted" : false,
          "deleted_at" : null,
          "collection_event_id" : "4ebc45d1-3e21-5154-8eba-6af7774e7f9e",
          "coordinates_id" : "97f42af5-5bcd-5713-88c7-6861dc22d191",
          "attributes" : {
            "collected_by" : "Dumerle P."
          },
          "last_modified_at" : "2024-03-13T12:41:10.764233"
        }
      },
      {
        "_index" : "bu-collection-event-manual__2024-03-14t0636553639210000",
        "_type" : "_doc",
        "_id" : "wGWuO44BF3xNhTExOXkP",
        "_score" : 1.0,
        "_source" : {
          "created_at" : "2024-03-13T12:41:10.660162",
          "geolocation_id" : "c22c52e0-0c83-533e-833e-49ff4c9c8d0e",
          "is_deleted" : false,
          "deleted_at" : null,
          "collection_event_id" : "ca71a4ee-ab56-55ff-8738-514870b24184",
          "coordinates_id" : "e746803c-d293-531f-b46e-e602864168eb",
          "attributes" : {
            "collected_by" : "Simon E.",
            "remarks" : "Forêt de la Teste-de-Buch"
          },
          "last_modified_at" : "2024-03-13T12:41:10.764237"
        }
      },
      {
        "_index" : "bu-collection-event-manual__2024-03-14t0636553639210000",
        "_type" : "_doc",
        "_id" : "wWWuO44BF3xNhTExOXkP",
        "_score" : 1.0,
        "_source" : {
          "created_at" : "2024-03-13T12:41:10.660163",
          "geolocation_id" : "da66c2d7-5d22-5a9f-a787-079bc374d7d5",
          "is_deleted" : false,
          "deleted_at" : null,
          "collection_event_id" : "769d2a81-aa74-56f2-8873-f07b796abf18",
          "coordinates_id" : "0995be00-9789-5d74-9467-6b854f86b1a5",
          "attributes" : {
            "collected_by" : "Grant & Vickery"
          },
          "last_modified_at" : "2024-03-13T12:41:10.764239"
        }
      },
      {
        "_index" : "bu-collection-event-manual__2024-03-14t0636553639210000",
        "_type" : "_doc",
        "_id" : "wmWuO44BF3xNhTExOXkP",
        "_score" : 1.0,
        "_source" : {
          "created_at" : "2024-03-13T12:41:10.660165",
          "geolocation_id" : "5c8fde30-7471-541c-86ea-0f63e6cb9ca8",
          "is_deleted" : false,
          "deleted_at" : null,
          "collection_event_id" : "177a5199-4054-5e4c-bf42-3f18c4c5b0a2",
          "coordinates_id" : "6845a229-de0d-5db2-bb35-beb5928edb6b",
          "attributes" : {
            "collected_by" : "Descamps M."
          },
          "last_modified_at" : "2024-03-13T12:41:10.764241"
        }
      },
      {
        "_index" : "bu-collection-event-manual__2024-03-14t0636553639210000",
        "_type" : "_doc",
        "_id" : "w2WuO44BF3xNhTExOXkP",
        "_score" : 1.0,
        "_source" : {
          "created_at" : "2024-03-13T12:41:10.660167",
          "geolocation_id" : "32e48c5e-e785-5e5b-9229-4052e6b527d8",
          "is_deleted" : false,
          "deleted_at" : null,
          "collection_event_id" : "70740017-5ba1-54c1-86aa-e8c98be3b647",
          "coordinates_id" : "ad4a50e6-511a-596a-899a-3a2df8e6aa8c",
          "attributes" : {
            "collected_by" : "Descamps M."
          },
          "last_modified_at" : "2024-03-13T12:41:10.764243"
        }
      },
      {
        "_index" : "bu-collection-event-manual__2024-03-14t0636553639210000",
        "_type" : "_doc",
        "_id" : "xGWuO44BF3xNhTExOXkP",
        "_score" : 1.0,
        "_source" : {
          "created_at" : "2024-03-13T12:41:10.660169",
          "geolocation_id" : "fa8c3631-7c26-58d1-93a1-516f259e6e6d",
          "is_deleted" : false,
          "deleted_at" : null,
          "collection_event_id" : "b3597900-27b2-5c32-9a83-27fd46648b56",
          "coordinates_id" : "07d4856e-6839-52bf-80d9-681305ceb4b0",
          "attributes" : {
            "collected_by" : "Simon E."
          },
          "last_modified_at" : "2024-03-13T12:41:10.764246"
        }
      },
      {
        "_index" : "bu-collection-event-manual__2024-03-14t0636553639210000",
        "_type" : "_doc",
        "_id" : "xWWuO44BF3xNhTExOXkP",
        "_score" : 1.0,
        "_source" : {
          "created_at" : "2024-03-13T12:41:10.660171",
          "geolocation_id" : "121d5056-0abc-57d4-8d89-a4ea8fde68ef",
          "is_deleted" : false,
          "deleted_at" : null,
          "collection_event_id" : "c333e6f9-78fd-5dec-9a56-31fc673de8da",
          "coordinates_id" : "aecccc62-36bb-53b6-a4f0-47c90bda4449",
          "attributes" : {
            "collected_by" : "Descamps M."
          },
          "last_modified_at" : "2024-03-13T12:41:10.764248"
        }
      },
      {
        "_index" : "bu-collection-event-manual__2024-03-14t0636553639210000",
        "_type" : "_doc",
        "_id" : "xmWuO44BF3xNhTExOXkP",
        "_score" : 1.0,
        "_source" : {
          "created_at" : "2024-03-13T12:41:10.660172",
          "geolocation_id" : "80442db1-1d42-51a5-8a76-a216228d8ca7",
          "is_deleted" : false,
          "deleted_at" : null,
          "collection_event_id" : "7c605201-0cb5-5dec-94e0-6afef73a3f7a",
          "coordinates_id" : "ebc57bcc-d155-58d3-bd67-97dc3ff2a224",
          "attributes" : {
            "collected_by" : "Descamps M."
          },
          "last_modified_at" : "2024-03-13T12:41:10.764250"
        }
      },
      {
        "_index" : "bu-collection-event-manual__2024-03-14t0636553639210000",
        "_type" : "_doc",
        "_id" : "x2WuO44BF3xNhTExOXkP",
        "_score" : 1.0,
        "_source" : {
          "created_at" : "2024-03-13T12:41:10.660174",
          "geolocation_id" : "d4932f6a-bd13-5826-a9bb-ffd3d5a8cc7f",
          "is_deleted" : false,
          "deleted_at" : null,
          "collection_event_id" : "7090f621-3eba-5154-95b8-e13ac6927543",
          "coordinates_id" : "108a1565-7d11-5452-86b6-ff2695b82099",
          "attributes" : {
            "collected_by" : "Dalmas R. de",
            "remarks" : "hameau de Gabas"
          },
          "last_modified_at" : "2024-03-13T12:41:10.764254"
        }
      },
      {
        "_index" : "bu-collection-event-manual__2024-03-14t0636553639210000",
        "_type" : "_doc",
        "_id" : "yGWuO44BF3xNhTExOXkP",
        "_score" : 1.0,
        "_source" : {
          "created_at" : "2024-03-13T12:41:10.660176",
          "geolocation_id" : "5400a838-cdb0-500b-be8a-980ecb68bd73",
          "is_deleted" : false,
          "deleted_at" : null,
          "collection_event_id" : "e4f7cf6a-5d45-57a9-8bb3-0b12f022e963",
          "coordinates_id" : "c8b536c7-9681-5eb6-9630-e9bb5f092d91",
          "attributes" : {
            "collected_by" : "Santschi F."
          },
          "last_modified_at" : "2024-03-13T12:41:10.764256"
        }
      },
      {
        "_index" : "bu-collection-event-manual__2024-03-14t0636553639210000",
        "_type" : "_doc",
        "_id" : "yWWuO44BF3xNhTExOXkP",
        "_score" : 1.0,
        "_source" : {
          "created_at" : "2024-03-13T12:41:10.660178",
          "geolocation_id" : "c106ad1b-366c-54ad-9ce2-88c9860d0cad",
          "is_deleted" : false,
          "deleted_at" : null,
          "collection_event_id" : "66cd825e-9841-5930-8692-b8b450619307",
          "coordinates_id" : "0ed56305-cfe5-5dc6-97ab-130e41748e0e",
          "attributes" : {
            "collected_by" : "Millot J."
          },
          "last_modified_at" : "2024-03-13T12:41:10.764259"
        }
      },
      {
        "_index" : "bu-collection-event-manual__2024-03-14t0636553639210000",
        "_type" : "_doc",
        "_id" : "ymWuO44BF3xNhTExOXkP",
        "_score" : 1.0,
        "_source" : {
          "created_at" : "2024-03-13T12:41:10.660179",
          "geolocation_id" : "6c2598eb-92a0-516f-925c-86aa7dedb792",
          "is_deleted" : false,
          "deleted_at" : null,
          "collection_event_id" : "4a69498c-9c65-575e-b4b8-2a9c3b1335ae",
          "coordinates_id" : "afc871d5-69b4-563d-be00-bdf2406c12cb",
          "attributes" : {
            "collected_by" : "Balachowsky A. & Gruner L."
          },
          "last_modified_at" : "2024-03-13T12:41:10.764261"
        }
      },
      {
        "_index" : "bu-collection-event-manual__2024-03-14t0636553639210000",
        "_type" : "_doc",
        "_id" : "y2WuO44BF3xNhTExOXkP",
        "_score" : 1.0,
        "_source" : {
          "created_at" : "2024-03-13T12:41:10.660181",
          "geolocation_id" : "9c416802-8c57-5b5e-b57f-f259aaad9555",
          "is_deleted" : false,
          "deleted_at" : null,
          "collection_event_id" : "13fd034d-0990-54e6-b61e-bc38d26288ca",
          "coordinates_id" : "d7e37f8d-92c8-5b6f-84de-758131810b08",
          "attributes" : {
            "collected_by" : "Balachowsky A. & Gruner L."
          },
          "last_modified_at" : "2024-03-13T12:41:10.764263"
        }
      },
      {
        "_index" : "bu-collection-event-manual__2024-03-14t0636553639210000",
        "_type" : "_doc",
        "_id" : "zGWuO44BF3xNhTExOXkP",
        "_score" : 1.0,
        "_source" : {
          "created_at" : "2024-03-13T12:41:10.660183",
          "geolocation_id" : "2fc4f37a-7be4-5af1-b3cd-68408ce753ca",
          "is_deleted" : false,
          "deleted_at" : null,
          "collection_event_id" : "f2882bd4-75f8-5c63-9e1f-3beeef952214",
          "coordinates_id" : "42d4d6e8-32ba-5e01-b20e-49c1cff22240",
          "attributes" : {
            "collected_by" : "Balachowsky A. & Gruner L."
          },
          "last_modified_at" : "2024-03-13T12:41:10.764266"
        }
      },
      {
        "_index" : "bu-collection-event-manual__2024-03-14t0636553639210000",
        "_type" : "_doc",
        "_id" : "zWWuO44BF3xNhTExOXkP",
        "_score" : 1.0,
        "_source" : {
          "created_at" : "2024-03-13T12:41:10.660185",
          "geolocation_id" : "04e9df0a-53fb-5c12-ae37-fa17d60f118e",
          "is_deleted" : false,
          "deleted_at" : null,
          "collection_event_id" : "7230e759-fb36-51de-9474-7c840c51c509",
          "coordinates_id" : "945b6936-51ed-58dc-ac1a-1d07bba64ece",
          "attributes" : {
            "collected_by" : "Balachowsky A. & Gruner L."
          },
          "last_modified_at" : "2024-03-13T12:41:10.764268"
        }
      },
      {
        "_index" : "bu-collection-event-manual__2024-03-14t0636553639210000",
        "_type" : "_doc",
        "_id" : "zmWuO44BF3xNhTExOXkP",
        "_score" : 1.0,
        "_source" : {
          "created_at" : "2024-03-13T12:41:10.660186",
          "geolocation_id" : "35131187-6d4c-5620-a1aa-648c829802fe",
          "is_deleted" : false,
          "deleted_at" : null,
          "collection_event_id" : "1475f7a1-7b7f-556a-9e72-25708645fe57",
          "coordinates_id" : "1d5d7ef8-1647-571c-97ea-b02cadb8ee5e",
          "attributes" : {
            "collected_by" : "Banks N."
          },
          "last_modified_at" : "2024-03-13T12:41:10.764271"
        }
      },
      {
        "_index" : "bu-collection-event-manual__2024-03-14t0636553639210000",
        "_type" : "_doc",
        "_id" : "z2WuO44BF3xNhTExOXkP",
        "_score" : 1.0,
        "_source" : {
          "created_at" : "2024-03-13T12:41:10.660188",
          "geolocation_id" : "d42282da-e64c-5bc1-a0dd-62014799e874",
          "is_deleted" : false,
          "deleted_at" : null,
          "collection_event_id" : "044389cc-1b33-5f2b-9092-dbd16c8a0855",
          "coordinates_id" : "dc770207-d31b-5269-b54d-deb27e98e31b",
          "attributes" : {
            "collected_by" : "Denis J.",
            "remarks" : "Île de Port-Cros"
          },
          "last_modified_at" : "2024-03-13T12:41:10.764275"
        }
      },
      {
        "_index" : "bu-collection-event-manual__2024-03-14t0636553639210000",
        "_type" : "_doc",
        "_id" : "0GWuO44BF3xNhTExOXkP",
        "_score" : 1.0,
        "_source" : {
          "created_at" : "2024-03-13T12:41:10.660190",
          "geolocation_id" : "043d3d45-23b9-5376-8ecc-3a4e5113ecf2",
          "is_deleted" : false,
          "deleted_at" : null,
          "collection_event_id" : "d89b3811-4120-57cf-bd32-1547fc425d66",
          "coordinates_id" : "cd6322ff-4266-5945-9448-79d030662380",
          "attributes" : {
            "collected_by" : "Descamps M."
          },
          "last_modified_at" : "2024-03-13T12:41:10.764277"
        }
      },
      {
        "_index" : "bu-collection-event-manual__2024-03-14t0636553639210000",
        "_type" : "_doc",
        "_id" : "0WWuO44BF3xNhTExOXkP",
        "_score" : 1.0,
        "_source" : {
          "created_at" : "2024-03-13T12:41:10.660192",
          "geolocation_id" : "28a1f5f1-1839-5130-ab87-2c331e534638",
          "is_deleted" : false,
          "deleted_at" : null,
          "collection_event_id" : "3ee4619c-e303-5e44-b0a7-4afd467b25d2",
          "coordinates_id" : "59b84afc-d97f-5417-9aa3-36af52671751",
          "attributes" : {
            "collected_by" : "Coiffait H."
          },
          "last_modified_at" : "2024-03-13T12:41:10.764280"
        }
      },
      {
        "_index" : "bu-collection-event-manual__2024-03-14t0636553639210000",
        "_type" : "_doc",
        "_id" : "0mWuO44BF3xNhTExOXkP",
        "_score" : 1.0,
        "_source" : {
          "created_at" : "2024-03-13T12:41:10.660193",
          "geolocation_id" : "d5af16a7-05f9-5de7-bb6d-e9bcf02830d8",
          "is_deleted" : false,
          "deleted_at" : null,
          "collection_event_id" : "8a622f04-317d-5463-97af-b92f37ffb5da",
          "coordinates_id" : "bd818772-01db-5f93-b1f3-80205c30400c",
          "attributes" : {
            "collected_by" : "Boulard M., Jauffret P. & Pompanon P."
          },
          "last_modified_at" : "2024-03-13T12:41:10.764282"
        }
      },
      {
        "_index" : "bu-collection-event-manual__2024-03-14t0636553639210000",
        "_type" : "_doc",
        "_id" : "02WuO44BF3xNhTExOXkP",
        "_score" : 1.0,
        "_source" : {
          "created_at" : "2024-03-13T12:41:10.660195",
          "geolocation_id" : "52f819de-97fc-5bf1-a748-3167b0fbe760",
          "is_deleted" : false,
          "deleted_at" : null,
          "collection_event_id" : "ad1d8ac6-970a-5454-bb5e-040958e775a8",
          "coordinates_id" : "e529469c-0c47-50ca-ac59-f55d2ab67e14",
          "attributes" : {
            "collected_by" : "Potanin G.N.",
            "remarks" : "La localité et la date de récolte sont tirées de la publication originale. La station publiée (Potanin 67) ne correspond pas à la localité du tube (Potanin 74)"
          },
          "last_modified_at" : "2024-03-13T12:41:10.764287"
        }
      },
      {
        "_index" : "bu-collection-event-manual__2024-03-14t0636553639210000",
        "_type" : "_doc",
        "_id" : "1GWuO44BF3xNhTExOXkP",
        "_score" : 1.0,
        "_source" : {
          "created_at" : "2024-03-13T12:41:10.660197",
          "geolocation_id" : "d96cc073-7865-5043-ac7e-e24b0cbf9a80",
          "is_deleted" : false,
          "deleted_at" : null,
          "collection_event_id" : "e69b242a-4286-5f7a-8ad6-e18d4214e172",
          "coordinates_id" : "490a6b39-f37b-5ebd-acb1-dc91c57330fc",
          "attributes" : {
            "collected_by" : "Bonfils J."
          },
          "last_modified_at" : "2024-03-13T12:41:10.764289"
        }
      },
      {
        "_index" : "bu-collection-event-manual__2024-03-14t0636553639210000",
        "_type" : "_doc",
        "_id" : "1WWuO44BF3xNhTExOXkP",
        "_score" : 1.0,
        "_source" : {
          "created_at" : "2024-03-13T12:41:10.660199",
          "geolocation_id" : "c4624336-2963-5d2a-9b26-40f6601cf0e2",
          "is_deleted" : false,
          "deleted_at" : null,
          "collection_event_id" : "01cbbdfa-0594-54b5-bffb-dad817b6d1dc",
          "coordinates_id" : "203f1a2d-69cd-5aa6-ac56-d07661580c24",
          "attributes" : {
            "collected_by" : "Descamps M."
          },
          "last_modified_at" : "2024-03-13T12:41:10.764291"
        }
      },
      {
        "_index" : "bu-collection-event-manual__2024-03-14t0636553639210000",
        "_type" : "_doc",
        "_id" : "1mWuO44BF3xNhTExOXkP",
        "_score" : 1.0,
        "_source" : {
          "created_at" : "2024-03-13T12:41:10.660200",
          "geolocation_id" : "53398ad5-4679-5f65-af3d-d7ea35abe53c",
          "is_deleted" : false,
          "deleted_at" : null,
          "collection_event_id" : "5db7370f-f308-54bb-9772-76a17aca2927",
          "coordinates_id" : "b1fcfea9-3dc7-5d54-9326-582d094bdf79",
          "attributes" : {
            "collected_by" : "Descamps M."
          },
          "last_modified_at" : "2024-03-13T12:41:10.764294"
        }
      },
      {
        "_index" : "bu-collection-event-manual__2024-03-14t0636553639210000",
        "_type" : "_doc",
        "_id" : "12WuO44BF3xNhTExOXkP",
        "_score" : 1.0,
        "_source" : {
          "created_at" : "2024-03-13T12:41:10.660202",
          "geolocation_id" : "aa3dd104-000d-5245-87d8-8e2662e3ecc6",
          "is_deleted" : false,
          "deleted_at" : null,
          "collection_event_id" : "1497a634-eb9c-5f8b-98ae-d41f4c01edcb",
          "coordinates_id" : "705bb0ee-1366-5a7a-acbe-a458fca7541b",
          "attributes" : {
            "collected_by" : "Berland L."
          },
          "last_modified_at" : "2024-03-13T12:41:10.764296"
        }
      },
      {
        "_index" : "bu-collection-event-manual__2024-03-14t0636553639210000",
        "_type" : "_doc",
        "_id" : "2GWuO44BF3xNhTExOXkP",
        "_score" : 1.0,
        "_source" : {
          "created_at" : "2024-03-13T12:41:10.660204",
          "geolocation_id" : "a518a931-32c7-5490-90d0-0dfbedeebeda",
          "is_deleted" : false,
          "deleted_at" : null,
          "collection_event_id" : "82d7aa6e-ed92-5bc9-9962-57f5d67ad9b7",
          "coordinates_id" : "18b7da89-f4b0-5d67-81d5-cb3dbaa5618f",
          "attributes" : {
            "collected_by" : "Simon E."
          },
          "last_modified_at" : "2024-03-13T12:41:10.764298"
        }
      },
      {
        "_index" : "bu-collection-event-manual__2024-03-14t0636553639210000",
        "_type" : "_doc",
        "_id" : "2WWuO44BF3xNhTExOXkP",
        "_score" : 1.0,
        "_source" : {
          "created_at" : "2024-03-13T12:41:10.660206",
          "geolocation_id" : "11cb8218-58ec-5a71-b3d7-2d13535c77ee",
          "is_deleted" : false,
          "deleted_at" : null,
          "collection_event_id" : "dd5feda9-6565-5318-a535-69b5f7132307",
          "coordinates_id" : "9b4e543e-c014-5e18-ba72-367dd006a14b",
          "attributes" : {
            "collected_by" : "Simon E."
          },
          "last_modified_at" : "2024-03-13T12:41:10.764301"
        }
      },
      {
        "_index" : "bu-collection-event-manual__2024-03-14t0636553639210000",
        "_type" : "_doc",
        "_id" : "2mWuO44BF3xNhTExOXkP",
        "_score" : 1.0,
        "_source" : {
          "created_at" : "2024-03-13T12:41:10.660207",
          "geolocation_id" : "2792dd99-d42d-5259-b919-6ab18a262fc3",
          "is_deleted" : false,
          "deleted_at" : null,
          "collection_event_id" : "cb9772f6-bb00-5364-bdbf-a48cff17b549",
          "coordinates_id" : "030f30e4-e1f1-55a4-b69a-9aa308026fc1",
          "attributes" : {
            "collected_by" : "Dalmas R. de",
            "remarks" : "hameau de Gabas"
          },
          "last_modified_at" : "2024-03-13T12:41:10.764305"
        }
      },
      {
        "_index" : "bu-collection-event-manual__2024-03-14t0636553639210000",
        "_type" : "_doc",
        "_id" : "22WuO44BF3xNhTExOXkP",
        "_score" : 1.0,
        "_source" : {
          "created_at" : "2024-03-13T12:41:10.660209",
          "geolocation_id" : "24327b76-7e2e-5ffa-8f78-d42bda9489eb",
          "is_deleted" : false,
          "deleted_at" : null,
          "collection_event_id" : "a849ee1e-7ed5-5dd9-8846-41391affcf2d",
          "coordinates_id" : "eab3bd25-3f27-5b2e-8f2e-8692bb3f2d19",
          "attributes" : {
            "collected_by" : "Fage L."
          },
          "last_modified_at" : "2024-03-13T12:41:10.764306"
        }
      },
      {
        "_index" : "bu-collection-event-manual__2024-03-14t0636553639210000",
        "_type" : "_doc",
        "_id" : "3GWuO44BF3xNhTExOXkP",
        "_score" : 1.0,
        "_source" : {
          "created_at" : "2024-03-13T12:41:10.660211",
          "geolocation_id" : "ed197940-d16b-561a-9995-baff14b3e6f2",
          "is_deleted" : false,
          "deleted_at" : null,
          "collection_event_id" : "f550acaf-10ec-5be0-b268-6424026edf29",
          "coordinates_id" : "ecc39dbf-3359-50ed-ae19-d5d45387738d",
          "attributes" : {
            "collected_by" : "Denis J."
          },
          "last_modified_at" : "2024-03-13T12:41:10.764308"
        }
      },
      {
        "_index" : "bu-collection-event-manual__2024-03-14t0636553639210000",
        "_type" : "_doc",
        "_id" : "3WWuO44BF3xNhTExOXkP",
        "_score" : 1.0,
        "_source" : {
          "created_at" : "2024-03-13T12:41:10.660213",
          "geolocation_id" : "1eb46824-f698-5a00-bdc3-3fc6b6fa037f",
          "is_deleted" : false,
          "deleted_at" : null,
          "collection_event_id" : "1a43d117-6561-5aad-9db0-9a2d709bf617",
          "coordinates_id" : "b772d7e0-5afb-5bfd-b3b8-a788d51953ac",
          "attributes" : {
            "collected_by" : "Descamps M."
          },
          "last_modified_at" : "2024-03-13T12:41:10.764310"
        }
      },
      {
        "_index" : "bu-collection-event-manual__2024-03-14t0636553639210000",
        "_type" : "_doc",
        "_id" : "3mWuO44BF3xNhTExOXkP",
        "_score" : 1.0,
        "_source" : {
          "created_at" : "2024-03-13T12:41:10.660214",
          "geolocation_id" : "a430d17c-f19f-50a7-ac67-e764d3855746",
          "is_deleted" : false,
          "deleted_at" : null,
          "collection_event_id" : "e19991da-91aa-59d0-a842-d7f0d0414ec9",
          "coordinates_id" : "9474b837-f547-5267-a09f-72f5d998aac9",
          "attributes" : {
            "collected_by" : "Descamps M."
          },
          "last_modified_at" : "2024-03-13T12:41:10.764312"
        }
      },
      {
        "_index" : "bu-collection-event-manual__2024-03-14t0636553639210000",
        "_type" : "_doc",
        "_id" : "32WuO44BF3xNhTExOXkP",
        "_score" : 1.0,
        "_source" : {
          "created_at" : "2024-03-13T12:41:10.660216",
          "geolocation_id" : "6980dcd5-760a-546b-be60-ab44a4461c8e",
          "is_deleted" : false,
          "deleted_at" : null,
          "collection_event_id" : "a788c051-495a-5b46-9681-689d551611d9",
          "coordinates_id" : "66204d50-187d-55bf-9bc9-a170cf90f331",
          "attributes" : {
            "collected_by" : "Descamps M."
          },
          "last_modified_at" : "2024-03-13T12:41:10.764314"
        }
      },
      {
        "_index" : "bu-collection-event-manual__2024-03-14t0636553639210000",
        "_type" : "_doc",
        "_id" : "4GWuO44BF3xNhTExOXkP",
        "_score" : 1.0,
        "_source" : {
          "created_at" : "2024-03-13T12:41:10.660218",
          "geolocation_id" : "407e5993-a55b-5811-8dfa-f921b1a72c05",
          "is_deleted" : false,
          "deleted_at" : null,
          "collection_event_id" : "2edeeeaa-3634-5671-8ab8-7e324482ea55",
          "coordinates_id" : "8806f83e-e2a9-5c39-b823-9dd5fc86f5c7",
          "attributes" : {
            "collected_by" : "Descamps M."
          },
          "last_modified_at" : "2024-03-13T12:41:10.764315"
        }
      },
      {
        "_index" : "bu-collection-event-manual__2024-03-14t0636553639210000",
        "_type" : "_doc",
        "_id" : "4WWuO44BF3xNhTExOXkP",
        "_score" : 1.0,
        "_source" : {
          "created_at" : "2024-03-13T12:41:10.660220",
          "geolocation_id" : "a9384981-8f36-573e-8c3b-eea97ac9d431",
          "is_deleted" : false,
          "deleted_at" : null,
          "collection_event_id" : "a1c02949-d1f3-56c0-8847-88ce792c67b5",
          "coordinates_id" : "f3abdab7-eec1-526a-91f5-0240c7a09ab0",
          "attributes" : {
            "collected_by" : "Amédégnato C. & Poulain S."
          },
          "last_modified_at" : "2024-03-13T12:41:10.764318"
        }
      },
      {
        "_index" : "bu-collection-event-manual__2024-03-14t0636553639210000",
        "_type" : "_doc",
        "_id" : "4mWuO44BF3xNhTExOXkP",
        "_score" : 1.0,
        "_source" : {
          "created_at" : "2024-03-13T12:41:10.660221",
          "geolocation_id" : "e8cd846f-d3ea-5411-b170-7212856ae4c5",
          "is_deleted" : false,
          "deleted_at" : null,
          "collection_event_id" : "ced357ab-a821-56bb-a398-1c13ee7356d6",
          "coordinates_id" : "1cde22d1-816d-59ec-91e8-cfa6e0877c97",
          "attributes" : {
            "collected_by" : "Amédégnato C. & Poulain S."
          },
          "last_modified_at" : "2024-03-13T12:41:10.764320"
        }
      },
      {
        "_index" : "bu-collection-event-manual__2024-03-14t0636553639210000",
        "_type" : "_doc",
        "_id" : "42WuO44BF3xNhTExOXkP",
        "_score" : 1.0,
        "_source" : {
          "created_at" : "2024-03-13T12:41:10.660223",
          "geolocation_id" : "4cebfa04-dd97-567e-b50c-085690683109",
          "is_deleted" : false,
          "deleted_at" : null,
          "collection_event_id" : "5ea702d0-8baa-5f0f-a832-389e32a95504",
          "coordinates_id" : "98d46203-44aa-5116-8148-80a1bca83a70",
          "attributes" : {
            "collected_by" : "Diguet L."
          },
          "last_modified_at" : "2024-03-13T12:41:10.764321"
        }
      },
      {
        "_index" : "bu-collection-event-manual__2024-03-14t0636553639210000",
        "_type" : "_doc",
        "_id" : "5GWuO44BF3xNhTExOXkP",
        "_score" : 1.0,
        "_source" : {
          "created_at" : "2024-03-13T12:41:10.660225",
          "geolocation_id" : "74b1aa64-edb0-5125-9089-fbbfc5face4d",
          "is_deleted" : false,
          "deleted_at" : null,
          "collection_event_id" : "3bc2a53e-3e7e-5b67-84a5-702d05686121",
          "coordinates_id" : "8cb4da1b-bb46-5eda-88e5-66ce9c7307b5",
          "attributes" : { },
          "last_modified_at" : "2024-03-13T12:41:10.660225"
        }
      },
      {
        "_index" : "bu-collection-event-manual__2024-03-14t0636553639210000",
        "_type" : "_doc",
        "_id" : "5WWuO44BF3xNhTExOXkP",
        "_score" : 1.0,
        "_source" : {
          "created_at" : "2024-03-13T12:41:10.660227",
          "geolocation_id" : "269f469c-3101-5027-bf2f-ffaf9d6cd618",
          "is_deleted" : false,
          "deleted_at" : null,
          "collection_event_id" : "e89c952d-6c7d-5dbc-8cab-f1c085ad8ff7",
          "coordinates_id" : "81c34e1d-7bc3-59cf-8b4b-e33a3f5d6d5a",
          "attributes" : {
            "remarks" : "Coll. Finot A."
          },
          "last_modified_at" : "2024-03-13T12:41:10.764323"
        }
      },
      {
        "_index" : "bu-collection-event-manual__2024-03-14t0636553639210000",
        "_type" : "_doc",
        "_id" : "5mWuO44BF3xNhTExOXkP",
        "_score" : 1.0,
        "_source" : {
          "created_at" : "2024-03-13T12:41:10.660228",
          "geolocation_id" : "be6c8b66-27e0-51c1-8994-26a407ac3ee6",
          "is_deleted" : false,
          "deleted_at" : null,
          "collection_event_id" : "69db4aac-1198-50b9-8e7d-cdcd1099ab6d",
          "coordinates_id" : "2dac1def-3589-512c-abb8-632b152e9ba8",
          "attributes" : {
            "collected_by" : "Poulain S."
          },
          "last_modified_at" : "2024-03-13T12:41:10.764325"
        }
      },
      {
        "_index" : "bu-collection-event-manual__2024-03-14t0636553639210000",
        "_type" : "_doc",
        "_id" : "52WuO44BF3xNhTExOXkP",
        "_score" : 1.0,
        "_source" : {
          "created_at" : "2024-03-13T12:41:10.660230",
          "geolocation_id" : "91078243-94af-5f2e-9cf8-b9cfbd7ebed5",
          "is_deleted" : false,
          "deleted_at" : null,
          "collection_event_id" : "30b33703-cdea-588f-bed9-4f51753ae33b",
          "coordinates_id" : "3b0afb61-13f6-5d8d-ab43-eb95c27319bd",
          "attributes" : {
            "collected_by" : "Descamps M."
          },
          "last_modified_at" : "2024-03-13T12:41:10.764327"
        }
      },
      {
        "_index" : "bu-collection-event-manual__2024-03-14t0636553639210000",
        "_type" : "_doc",
        "_id" : "6GWuO44BF3xNhTExOXkP",
        "_score" : 1.0,
        "_source" : {
          "created_at" : "2024-03-13T12:41:10.660232",
          "geolocation_id" : "1bbd8a20-20c2-5e99-8ba0-4a083a000444",
          "is_deleted" : false,
          "deleted_at" : null,
          "collection_event_id" : "ad2d3e2f-8e21-5b61-a897-ed1126ab65e9",
          "coordinates_id" : "790005e8-8ef5-53da-83a6-26a00869ab94",
          "attributes" : {
            "collected_by" : "Descamps M."
          },
          "last_modified_at" : "2024-03-13T12:41:10.764329"
        }
      },
      {
        "_index" : "bu-collection-event-manual__2024-03-14t0636553639210000",
        "_type" : "_doc",
        "_id" : "6WWuO44BF3xNhTExOXkP",
        "_score" : 1.0,
        "_source" : {
          "created_at" : "2024-03-13T12:41:10.660234",
          "geolocation_id" : "4d4ada11-5cf0-58e5-b1fd-f911525d3e09",
          "is_deleted" : false,
          "deleted_at" : null,
          "collection_event_id" : "ad9ef567-dfb0-589c-b6cd-0c90b0b21365",
          "coordinates_id" : "0103fa99-f61c-51a5-a0ef-fcb81cf1e8aa",
          "attributes" : {
            "collected_by" : "Descamps M."
          },
          "last_modified_at" : "2024-03-13T12:41:10.764330"
        }
      },
      {
        "_index" : "bu-collection-event-manual__2024-03-14t0636553639210000",
        "_type" : "_doc",
        "_id" : "6mWuO44BF3xNhTExOXkP",
        "_score" : 1.0,
        "_source" : {
          "created_at" : "2024-03-13T12:41:10.660235",
          "geolocation_id" : "e7ebdc5a-086d-522b-8bdf-9d6fdc2c0745",
          "is_deleted" : false,
          "deleted_at" : null,
          "collection_event_id" : "80dcbebb-c977-5505-bdc0-49eb99d65723",
          "coordinates_id" : "5907a7e9-f1de-59a6-b919-32c68efce472",
          "attributes" : {
            "collected_by" : "Carbonell C.S."
          },
          "last_modified_at" : "2024-03-13T12:41:10.764332"
        }
      },
      {
        "_index" : "bu-collection-event-manual__2024-03-14t0636553639210000",
        "_type" : "_doc",
        "_id" : "62WuO44BF3xNhTExOXkP",
        "_score" : 1.0,
        "_source" : {
          "created_at" : "2024-03-13T12:41:10.660237",
          "geolocation_id" : "ef08a0aa-337d-5e06-9bad-68b98ace6b48",
          "is_deleted" : false,
          "deleted_at" : null,
          "collection_event_id" : "c1c01ed7-8621-574c-be61-226a7f52cf99",
          "coordinates_id" : "8cc94baf-1974-5ede-aba9-ea95938b8b9a",
          "attributes" : {
            "collected_by" : "Descamps M."
          },
          "last_modified_at" : "2024-03-13T12:41:10.764334"
        }
      },
      {
        "_index" : "bu-collection-event-manual__2024-03-14t0636553639210000",
        "_type" : "_doc",
        "_id" : "7GWuO44BF3xNhTExOXkP",
        "_score" : 1.0,
        "_source" : {
          "created_at" : "2024-03-13T12:41:10.660239",
          "geolocation_id" : "8c9be66e-e1cb-5f38-a555-168af23b7b7d",
          "is_deleted" : false,
          "deleted_at" : null,
          "collection_event_id" : "48adc9d3-f454-5bdc-ae9f-149f6fce2e6c",
          "coordinates_id" : "fb6ec167-7785-5f44-92b4-c95c6bbfa7fc",
          "attributes" : {
            "collected_by" : "Descamps M."
          },
          "last_modified_at" : "2024-03-13T12:41:10.764336"
        }
      },
      {
        "_index" : "bu-collection-event-manual__2024-03-14t0636553639210000",
        "_type" : "_doc",
        "_id" : "7WWuO44BF3xNhTExOXkP",
        "_score" : 1.0,
        "_source" : {
          "created_at" : "2024-03-13T12:41:10.660241",
          "geolocation_id" : "86bbdedc-03b1-59b6-afbc-8e136ccd7a93",
          "is_deleted" : false,
          "deleted_at" : null,
          "collection_event_id" : "1bd3bdbe-74a5-5579-b721-9c8d783f09cb",
          "coordinates_id" : "10a57fa8-ae94-5a91-895c-0d46f521434b",
          "attributes" : {
            "collected_by" : "Amédégnato C. & Poulain S."
          },
          "last_modified_at" : "2024-03-13T12:41:10.764337"
        }
      },
      {
        "_index" : "bu-collection-event-manual__2024-03-14t0636553639210000",
        "_type" : "_doc",
        "_id" : "7mWuO44BF3xNhTExOXkP",
        "_score" : 1.0,
        "_source" : {
          "created_at" : "2024-03-13T12:41:10.660242",
          "geolocation_id" : "a1836395-2bcd-5c21-91f2-9f6339a8a895",
          "is_deleted" : false,
          "deleted_at" : null,
          "collection_event_id" : "c445c9f2-462c-5f25-8eba-d5edc8e41074",
          "coordinates_id" : "cec2f80f-0d13-5a14-a28a-a9cd9b32b680",
          "attributes" : {
            "collected_by" : "Amédégnato C. & Poulain S."
          },
          "last_modified_at" : "2024-03-13T12:41:10.764339"
        }
      },
      {
        "_index" : "bu-collection-event-manual__2024-03-14t0636553639210000",
        "_type" : "_doc",
        "_id" : "72WuO44BF3xNhTExOXkP",
        "_score" : 1.0,
        "_source" : {
          "created_at" : "2024-03-13T12:41:10.660244",
          "geolocation_id" : "4826e4bc-4b54-5c8d-a683-7f44b481da0e",
          "is_deleted" : false,
          "deleted_at" : null,
          "collection_event_id" : "749c2d00-0cb4-566d-849c-ad30b88388b2",
          "coordinates_id" : "a4b84485-edfd-56b5-97b4-8a923d7dc66b",
          "attributes" : {
            "collected_by" : "Carayon J."
          },
          "last_modified_at" : "2024-03-13T12:41:10.764341"
        }
      },
      {
        "_index" : "bu-collection-event-manual__2024-03-14t0636553639210000",
        "_type" : "_doc",
        "_id" : "8GWuO44BF3xNhTExOXkP",
        "_score" : 1.0,
        "_source" : {
          "created_at" : "2024-03-13T12:41:10.660246",
          "geolocation_id" : "294c5e56-1b6a-5442-9adc-7d9a01a6eb3c",
          "is_deleted" : false,
          "deleted_at" : null,
          "collection_event_id" : "735f872f-bec3-5342-b4f7-cbac56b20a55",
          "coordinates_id" : "296a7bff-a923-5a6f-8e19-3c049eeaa847",
          "attributes" : {
            "collected_by" : "Collection Le Moult",
            "remarks" : "Coll. L. Chopard 1914, ex. Coll. Le Moult"
          },
          "last_modified_at" : "2024-03-13T12:41:10.764344"
        }
      },
      {
        "_index" : "bu-collection-event-manual__2024-03-14t0636553639210000",
        "_type" : "_doc",
        "_id" : "8WWuO44BF3xNhTExOXkP",
        "_score" : 1.0,
        "_source" : {
          "created_at" : "2024-03-13T12:41:10.660248",
          "geolocation_id" : "0061763d-a418-57b5-9ccc-2af0f9a45b33",
          "is_deleted" : false,
          "deleted_at" : null,
          "collection_event_id" : "14327795-8442-5198-96b4-7219ea36879d",
          "coordinates_id" : "51ef8e0d-c48b-59a1-ac6b-00281e3b08f7",
          "attributes" : {
            "collected_by" : "Descamps M."
          },
          "last_modified_at" : "2024-03-13T12:41:10.764346"
        }
      },
      {
        "_index" : "bu-collection-event-manual__2024-03-14t0636553639210000",
        "_type" : "_doc",
        "_id" : "8mWuO44BF3xNhTExOXkP",
        "_score" : 1.0,
        "_source" : {
          "created_at" : "2024-03-13T12:41:10.660249",
          "geolocation_id" : "81d17f0a-a7eb-5318-83ea-ff9c954b743a",
          "is_deleted" : false,
          "deleted_at" : null,
          "collection_event_id" : "61a3f979-ffac-58a4-b67f-f2a752b7661e",
          "coordinates_id" : "52a14d14-d15a-5aee-8b9b-b3ecb9bf170f",
          "attributes" : {
            "collected_by" : "Descamps M."
          },
          "last_modified_at" : "2024-03-13T12:41:10.764348"
        }
      },
      {
        "_index" : "bu-collection-event-manual__2024-03-14t0636553639210000",
        "_type" : "_doc",
        "_id" : "82WuO44BF3xNhTExOXkP",
        "_score" : 1.0,
        "_source" : {
          "created_at" : "2024-03-13T12:41:10.660251",
          "geolocation_id" : "7754f811-6cbe-5436-9537-d4eecbe2c2f5",
          "is_deleted" : false,
          "deleted_at" : null,
          "collection_event_id" : "0c12ecfb-5f2c-57d8-8430-aeefb01b10b8",
          "coordinates_id" : "772b4d14-1171-50ff-b5ce-e6395918c14d",
          "attributes" : {
            "collected_by" : "Descamps M."
          },
          "last_modified_at" : "2024-03-13T12:41:10.764350"
        }
      },
      {
        "_index" : "bu-collection-event-manual__2024-03-14t0636553639210000",
        "_type" : "_doc",
        "_id" : "9GWuO44BF3xNhTExOXkP",
        "_score" : 1.0,
        "_source" : {
          "created_at" : "2024-03-13T12:41:10.660253",
          "geolocation_id" : "0178066c-3beb-588d-bdec-b2da3613e8a6",
          "is_deleted" : false,
          "deleted_at" : null,
          "collection_event_id" : "1f935497-7835-58f1-be70-89593c4caa2b",
          "coordinates_id" : "240dd768-d88f-59ee-b55d-e43cc664d7b8",
          "attributes" : {
            "collected_by" : "Descamps M."
          },
          "last_modified_at" : "2024-03-13T12:41:10.764351"
        }
      },
      {
        "_index" : "bu-collection-event-manual__2024-03-14t0636553639210000",
        "_type" : "_doc",
        "_id" : "9WWuO44BF3xNhTExOXkP",
        "_score" : 1.0,
        "_source" : {
          "created_at" : "2024-03-13T12:41:10.660255",
          "geolocation_id" : "7d26c2d8-ad68-5d27-8480-8ea62c19a255",
          "is_deleted" : false,
          "deleted_at" : null,
          "collection_event_id" : "e583173b-4ea3-5761-aec0-8a1844085b16",
          "coordinates_id" : "48e51514-4362-5d88-a74e-83640e72639d",
          "attributes" : {
            "collected_by" : "Descamps M."
          },
          "last_modified_at" : "2024-03-13T12:41:10.764353"
        }
      },
      {
        "_index" : "bu-collection-event-manual__2024-03-14t0636553639210000",
        "_type" : "_doc",
        "_id" : "9mWuO44BF3xNhTExOXkP",
        "_score" : 1.0,
        "_source" : {
          "created_at" : "2024-03-13T12:41:10.660256",
          "geolocation_id" : "9a358e58-7151-5a64-8b99-376db678f59a",
          "is_deleted" : false,
          "deleted_at" : null,
          "collection_event_id" : "94655024-c1dc-5ebf-b492-a74a24528e43",
          "coordinates_id" : "90a965a5-2711-5784-89c1-b3c77451b648",
          "attributes" : {
            "collected_by" : "Descamps M."
          },
          "last_modified_at" : "2024-03-13T12:41:10.764355"
        }
      },
      {
        "_index" : "bu-collection-event-manual__2024-03-14t0636553639210000",
        "_type" : "_doc",
        "_id" : "92WuO44BF3xNhTExOXkP",
        "_score" : 1.0,
        "_source" : {
          "created_at" : "2024-03-13T12:41:10.660258",
          "geolocation_id" : "2c730455-9cee-51ff-b117-6efa8665e147",
          "is_deleted" : false,
          "deleted_at" : null,
          "collection_event_id" : "33fe68dc-c4a2-5c33-bf34-33fb27cbeb70",
          "coordinates_id" : "20bbf827-1d57-558e-b7e6-44dc40f09efd",
          "attributes" : {
            "collected_by" : "Descamps M."
          },
          "last_modified_at" : "2024-03-13T12:41:10.764357"
        }
      },
      {
        "_index" : "bu-collection-event-manual__2024-03-14t0636553639210000",
        "_type" : "_doc",
        "_id" : "-GWuO44BF3xNhTExOXkP",
        "_score" : 1.0,
        "_source" : {
          "created_at" : "2024-03-13T12:41:10.660260",
          "geolocation_id" : "c803b3d7-2c31-5c3d-86cf-1fe69da299e0",
          "is_deleted" : false,
          "deleted_at" : null,
          "collection_event_id" : "67c86589-26c7-5625-ab14-5061548857bc",
          "coordinates_id" : "d9cc4f7f-472b-54a0-a759-39fc7ee377dd",
          "attributes" : {
            "collected_by" : "Descamps M."
          },
          "last_modified_at" : "2024-03-13T12:41:10.764358"
        }
      },
      {
        "_index" : "bu-collection-event-manual__2024-03-14t0636553639210000",
        "_type" : "_doc",
        "_id" : "-WWuO44BF3xNhTExOXkP",
        "_score" : 1.0,
        "_source" : {
          "created_at" : "2024-03-13T12:41:10.660262",
          "geolocation_id" : "e5b4293c-a1a7-5373-89b4-7f5b7f1c87cb",
          "is_deleted" : false,
          "deleted_at" : null,
          "collection_event_id" : "81469929-677f-571e-bf9a-75d82a497819",
          "coordinates_id" : "190cb512-1e0b-5166-b6df-b6a3e07ab10e",
          "attributes" : {
            "collected_by" : "Descamps M."
          },
          "last_modified_at" : "2024-03-13T12:41:10.764360"
        }
      },
      {
        "_index" : "bu-collection-event-manual__2024-03-14t0636553639210000",
        "_type" : "_doc",
        "_id" : "-mWuO44BF3xNhTExOXkP",
        "_score" : 1.0,
        "_source" : {
          "created_at" : "2024-03-13T12:41:10.660263",
          "geolocation_id" : "f719c3f2-20b4-50a9-b668-b02616e69fe4",
          "is_deleted" : false,
          "deleted_at" : null,
          "collection_event_id" : "35dcbb63-62a3-522c-bccd-3fbbeb18b6d3",
          "coordinates_id" : "52d70535-f403-55a7-9a36-b1029beeb411",
          "attributes" : {
            "collected_by" : "Descamps M."
          },
          "last_modified_at" : "2024-03-13T12:41:10.764362"
        }
      },
      {
        "_index" : "bu-collection-event-manual__2024-03-14t0636553639210000",
        "_type" : "_doc",
        "_id" : "-2WuO44BF3xNhTExOXkP",
        "_score" : 1.0,
        "_source" : {
          "created_at" : "2024-03-13T12:41:10.660265",
          "geolocation_id" : "81be2373-187e-50df-9904-0bbb1ff36cdc",
          "is_deleted" : false,
          "deleted_at" : null,
          "collection_event_id" : "a5796541-0e00-5c6d-9b38-645a9f0314fd",
          "coordinates_id" : "efcbbb7b-e1cd-5082-8250-c23f9bccb1fd",
          "attributes" : {
            "collected_by" : "Descamps M."
          },
          "last_modified_at" : "2024-03-13T12:41:10.764364"
        }
      },
      {
        "_index" : "bu-collection-event-manual__2024-03-14t0636553639210000",
        "_type" : "_doc",
        "_id" : "_GWuO44BF3xNhTExOXkP",
        "_score" : 1.0,
        "_source" : {
          "created_at" : "2024-03-13T12:41:10.660267",
          "geolocation_id" : "39beb4dc-9b54-537b-954d-cca44baa1dc6",
          "is_deleted" : false,
          "deleted_at" : null,
          "collection_event_id" : "e6fb5d94-560b-56a2-b33f-06e233dd1c30",
          "coordinates_id" : "c913308f-b335-52a9-b61a-5fb106311e06",
          "attributes" : {
            "collected_by" : "Descamps M."
          },
          "last_modified_at" : "2024-03-13T12:41:10.764365"
        }
      },
      {
        "_index" : "bu-collection-event-manual__2024-03-14t0636553639210000",
        "_type" : "_doc",
        "_id" : "_WWuO44BF3xNhTExOXkP",
        "_score" : 1.0,
        "_source" : {
          "created_at" : "2024-03-13T12:41:10.660269",
          "geolocation_id" : "d32c567c-366b-55ba-bc6b-931f24334889",
          "is_deleted" : false,
          "deleted_at" : null,
          "collection_event_id" : "56119c8a-a3f1-5ea7-8826-81cdcd81605b",
          "coordinates_id" : "5ec491d1-2520-587a-b761-27ec54b114d2",
          "attributes" : {
            "collected_by" : "Descamps M."
          },
          "last_modified_at" : "2024-03-13T12:41:10.764367"
        }
      },
      {
        "_index" : "bu-collection-event-manual__2024-03-14t0636553639210000",
        "_type" : "_doc",
        "_id" : "_mWuO44BF3xNhTExOXkP",
        "_score" : 1.0,
        "_source" : {
          "created_at" : "2024-03-13T12:41:10.660270",
          "geolocation_id" : "ec8e76ac-0daa-5027-a542-0b466307c6de",
          "is_deleted" : false,
          "deleted_at" : null,
          "collection_event_id" : "fd924860-b364-5497-924f-8db2be9d25d6",
          "coordinates_id" : "99591108-a079-5a24-a032-9e6a457aeb50",
          "attributes" : { },
          "last_modified_at" : "2024-03-13T12:41:10.660270"
        }
      },
      {
        "_index" : "bu-collection-event-manual__2024-03-14t0636553639210000",
        "_type" : "_doc",
        "_id" : "_2WuO44BF3xNhTExOXkP",
        "_score" : 1.0,
        "_source" : {
          "created_at" : "2024-03-13T12:41:10.660272",
          "geolocation_id" : "bb052161-3f2a-57f1-b907-d614dccc7402",
          "is_deleted" : false,
          "deleted_at" : null,
          "collection_event_id" : "240cc401-72bb-5a42-8543-55f17e4be7a9",
          "coordinates_id" : "91d216e5-548f-5797-b599-bdbc2b167c93",
          "attributes" : { },
          "last_modified_at" : "2024-03-13T12:41:10.660272"
        }
      },
      {
        "_index" : "bu-collection-event-manual__2024-03-14t0636553639210000",
        "_type" : "_doc",
        "_id" : "AGWuO44BF3xNhTExOXoP",
        "_score" : 1.0,
        "_source" : {
          "created_at" : "2024-03-13T12:41:10.660274",
          "geolocation_id" : "30146951-dc46-555e-b7e0-0723d030d6c4",
          "is_deleted" : false,
          "deleted_at" : null,
          "collection_event_id" : "c8756a17-2f07-5c49-a267-90c53c78c7af",
          "coordinates_id" : "f8da17ad-75d4-57b4-a55a-eeca9638ef61",
          "attributes" : {
            "collected_by" : "Lucas H."
          },
          "last_modified_at" : "2024-03-13T12:41:10.764369"
        }
      },
      {
        "_index" : "bu-collection-event-manual__2024-03-14t0636553639210000",
        "_type" : "_doc",
        "_id" : "AWWuO44BF3xNhTExOXoP",
        "_score" : 1.0,
        "_source" : {
          "created_at" : "2024-03-13T12:41:10.660276",
          "geolocation_id" : "2fa77960-eedb-5fdc-b1d6-4a5245e9e86f",
          "is_deleted" : false,
          "deleted_at" : null,
          "collection_event_id" : "2133baeb-cb1c-55d9-8e3a-afb02e95c67f",
          "coordinates_id" : "b6ad75c2-c3ef-5256-b6a2-710464ceee1b",
          "attributes" : {
            "collected_by" : "Ferton C."
          },
          "last_modified_at" : "2024-03-13T12:41:10.764371"
        }
      },
      {
        "_index" : "bu-collection-event-manual__2024-03-14t0636553639210000",
        "_type" : "_doc",
        "_id" : "AmWuO44BF3xNhTExOXoP",
        "_score" : 1.0,
        "_source" : {
          "created_at" : "2024-03-13T12:41:10.660277",
          "geolocation_id" : "29e056a7-73e5-54b5-b5e8-9fe2ae659db1",
          "is_deleted" : false,
          "deleted_at" : null,
          "collection_event_id" : "61e41ab9-068e-5b90-927d-8dd68d17483a",
          "coordinates_id" : "a2ee5abb-368e-5018-b7fa-1cbd45da606e",
          "attributes" : {
            "collected_by" : "Simon E."
          },
          "last_modified_at" : "2024-03-13T12:41:10.764373"
        }
      },
      {
        "_index" : "bu-collection-event-manual__2024-03-14t0636553639210000",
        "_type" : "_doc",
        "_id" : "A2WuO44BF3xNhTExOXoP",
        "_score" : 1.0,
        "_source" : {
          "created_at" : "2024-03-13T12:41:10.660279",
          "geolocation_id" : "107ac00c-4f31-5415-8851-ee22714d2b18",
          "is_deleted" : false,
          "deleted_at" : null,
          "collection_event_id" : "7aae41bb-d9ec-5924-a5dc-47e56b003498",
          "coordinates_id" : "f831c52e-1e6c-57cc-b5f3-509252f6f5b3",
          "attributes" : {
            "collected_by" : "Descamps M."
          },
          "last_modified_at" : "2024-03-13T12:41:10.764374"
        }
      },
      {
        "_index" : "bu-collection-event-manual__2024-03-14t0636553639210000",
        "_type" : "_doc",
        "_id" : "BGWuO44BF3xNhTExOXoP",
        "_score" : 1.0,
        "_source" : {
          "created_at" : "2024-03-13T12:41:10.660281",
          "geolocation_id" : "d4f05512-b50c-5980-b8c3-f281ed086db5",
          "is_deleted" : false,
          "deleted_at" : null,
          "collection_event_id" : "f3e977dd-036e-5d1e-89a9-82ab97fdc1b4",
          "coordinates_id" : "208182d2-3c93-549d-9040-aa63a3b4aa90",
          "attributes" : {
            "collected_by" : "Riede K."
          },
          "last_modified_at" : "2024-03-13T12:41:10.764376"
        }
      },
      {
        "_index" : "bu-collection-event-manual__2024-03-14t0636553639210000",
        "_type" : "_doc",
        "_id" : "BWWuO44BF3xNhTExOXoP",
        "_score" : 1.0,
        "_source" : {
          "created_at" : "2024-03-13T12:41:10.660283",
          "geolocation_id" : "2ea3984f-e607-5bf6-a4d7-474ac4084bd8",
          "is_deleted" : false,
          "deleted_at" : null,
          "collection_event_id" : "a81054ac-e144-5771-b83f-f11c8152b74d",
          "coordinates_id" : "c17ac435-e10a-5231-8870-0632841633ca",
          "attributes" : {
            "collected_by" : "Descamps M."
          },
          "last_modified_at" : "2024-03-13T12:41:10.764378"
        }
      },
      {
        "_index" : "bu-collection-event-manual__2024-03-14t0636553639210000",
        "_type" : "_doc",
        "_id" : "BmWuO44BF3xNhTExOXoP",
        "_score" : 1.0,
        "_source" : {
          "created_at" : "2024-03-13T12:41:10.660285",
          "geolocation_id" : "585ad493-db20-5ff9-890e-db81545f7534",
          "is_deleted" : false,
          "deleted_at" : null,
          "collection_event_id" : "6c08538a-6a57-591e-a225-683060968c98",
          "coordinates_id" : "b8e5066e-f9f9-5bbd-a323-47760d51efa2",
          "attributes" : {
            "collected_by" : "Masters G."
          },
          "last_modified_at" : "2024-03-13T12:41:10.764380"
        }
      },
      {
        "_index" : "bu-collection-event-manual__2024-03-14t0636553639210000",
        "_type" : "_doc",
        "_id" : "B2WuO44BF3xNhTExOXoP",
        "_score" : 1.0,
        "_source" : {
          "created_at" : "2024-03-13T12:41:10.660286",
          "geolocation_id" : "84357a5e-da85-50fe-b10f-bc4f604142b4",
          "is_deleted" : false,
          "deleted_at" : null,
          "collection_event_id" : "1143a2e0-bcbc-5d6c-8d07-4aba75253b3e",
          "coordinates_id" : "a16a0e8c-13a7-5c30-a619-18e92646795c",
          "attributes" : {
            "collected_by" : "Laglaize L."
          },
          "last_modified_at" : "2024-03-13T12:41:10.764381"
        }
      },
      {
        "_index" : "bu-collection-event-manual__2024-03-14t0636553639210000",
        "_type" : "_doc",
        "_id" : "CGWuO44BF3xNhTExOXoP",
        "_score" : 1.0,
        "_source" : {
          "created_at" : "2024-03-13T12:41:10.660288",
          "geolocation_id" : "5897a9da-e041-540a-b2ae-ed485de5ad95",
          "is_deleted" : false,
          "deleted_at" : null,
          "collection_event_id" : "824c8c67-fae3-5715-a0c3-1d880c619265",
          "coordinates_id" : "fadf14b6-c49c-54c4-bfde-d1cb85ae9082",
          "attributes" : {
            "collected_by" : "Descamps M."
          },
          "last_modified_at" : "2024-03-13T12:41:10.764383"
        }
      },
      {
        "_index" : "bu-collection-event-manual__2024-03-14t0636553639210000",
        "_type" : "_doc",
        "_id" : "CWWuO44BF3xNhTExOXoP",
        "_score" : 1.0,
        "_source" : {
          "created_at" : "2024-03-13T12:41:10.660290",
          "geolocation_id" : "088de618-e27e-58f5-b16f-024bdb1a81bd",
          "is_deleted" : false,
          "deleted_at" : null,
          "collection_event_id" : "4a085261-646d-5b09-bcb5-0cc6ac135f07",
          "coordinates_id" : "0805d3ad-7a8c-5dd4-a501-92cfc4339293",
          "attributes" : {
            "collected_by" : "Descamps M."
          },
          "last_modified_at" : "2024-03-13T12:41:10.764385"
        }
      },
      {
        "_index" : "bu-collection-event-manual__2024-03-14t0636553639210000",
        "_type" : "_doc",
        "_id" : "CmWuO44BF3xNhTExOXoP",
        "_score" : 1.0,
        "_source" : {
          "created_at" : "2024-03-13T12:41:10.660292",
          "geolocation_id" : "7e23ced1-ee21-575a-b493-461a8023003f",
          "is_deleted" : false,
          "deleted_at" : null,
          "collection_event_id" : "1b835821-715a-511b-9a12-a1b39d267e23",
          "coordinates_id" : "7f7e2bc7-9bd8-57d2-a684-b194296a56f3",
          "attributes" : {
            "collected_by" : "Descamps M."
          },
          "last_modified_at" : "2024-03-13T12:41:10.764387"
        }
      },
      {
        "_index" : "bu-collection-event-manual__2024-03-14t0636553639210000",
        "_type" : "_doc",
        "_id" : "C2WuO44BF3xNhTExOXoP",
        "_score" : 1.0,
        "_source" : {
          "created_at" : "2024-03-13T12:41:10.660293",
          "geolocation_id" : "8ec6330e-c759-5682-84a8-4e6e5021d30b",
          "is_deleted" : false,
          "deleted_at" : null,
          "collection_event_id" : "7292c54e-d5c9-5d35-b4ab-9632ac3e279f",
          "coordinates_id" : "48e444be-baf7-5bfe-b627-255cd127b7c1",
          "attributes" : {
            "collected_by" : "Descamps M."
          },
          "last_modified_at" : "2024-03-13T12:41:10.764388"
        }
      },
      {
        "_index" : "bu-collection-event-manual__2024-03-14t0636553639210000",
        "_type" : "_doc",
        "_id" : "DGWuO44BF3xNhTExOXoP",
        "_score" : 1.0,
        "_source" : {
          "created_at" : "2024-03-13T12:41:10.660295",
          "geolocation_id" : "d616385d-fde7-5c57-9d59-f0ad9d254c91",
          "is_deleted" : false,
          "deleted_at" : null,
          "collection_event_id" : "b97841e5-9ad9-5ca9-a8d0-2db33d288af5",
          "coordinates_id" : "157b9440-e6fc-5d8e-9bef-9035ae17b64d",
          "attributes" : {
            "collected_by" : "Onore G."
          },
          "last_modified_at" : "2024-03-13T12:41:10.764390"
        }
      },
      {
        "_index" : "bu-collection-event-manual__2024-03-14t0636553639210000",
        "_type" : "_doc",
        "_id" : "DWWuO44BF3xNhTExOXoP",
        "_score" : 1.0,
        "_source" : {
          "created_at" : "2024-03-13T12:41:10.660297",
          "geolocation_id" : "ed7d2b7a-49d3-5fe2-a88c-668545a334bd",
          "is_deleted" : false,
          "deleted_at" : null,
          "collection_event_id" : "7185d712-0230-5882-8faf-6e78cba51d77",
          "coordinates_id" : "e22383a2-2a9a-5cdd-9768-837e63cdcff1",
          "attributes" : {
            "collected_by" : "Descamps M."
          },
          "last_modified_at" : "2024-03-13T12:41:10.764392"
        }
      },
      {
        "_index" : "bu-collection-event-manual__2024-03-14t0636553639210000",
        "_type" : "_doc",
        "_id" : "DmWuO44BF3xNhTExOXoP",
        "_score" : 1.0,
        "_source" : {
          "created_at" : "2024-03-13T12:41:10.660299",
          "geolocation_id" : "41926332-7e6b-5d18-8abb-8f42d92548b3",
          "is_deleted" : false,
          "deleted_at" : null,
          "collection_event_id" : "2150bb16-2617-517a-ac68-bcdd4625acbf",
          "coordinates_id" : "a6b1d621-8494-5617-b6ca-43766a6443b9",
          "attributes" : {
            "collected_by" : "Descamps M."
          },
          "last_modified_at" : "2024-03-13T12:41:10.764394"
        }
      },
      {
        "_index" : "bu-collection-event-manual__2024-03-14t0636553639210000",
        "_type" : "_doc",
        "_id" : "D2WuO44BF3xNhTExOXoP",
        "_score" : 1.0,
        "_source" : {
          "created_at" : "2024-03-13T12:41:10.660300",
          "geolocation_id" : "9bbf4031-ff90-5fc2-841d-8b86e50a4ea8",
          "is_deleted" : false,
          "deleted_at" : null,
          "collection_event_id" : "e929df0a-617b-5ff1-a717-c4f92d4bf1f0",
          "coordinates_id" : "75dce6d9-93ef-5509-9c81-86ce8a7d08c5",
          "attributes" : {
            "collected_by" : "Descamps M."
          },
          "last_modified_at" : "2024-03-13T12:41:10.764396"
        }
      },
      {
        "_index" : "bu-collection-event-manual__2024-03-14t0636553639210000",
        "_type" : "_doc",
        "_id" : "EGWuO44BF3xNhTExOXoP",
        "_score" : 1.0,
        "_source" : {
          "created_at" : "2024-03-13T12:41:10.660302",
          "geolocation_id" : "19e9d4b9-2ee7-5b62-a8ab-629c4eb0386a",
          "is_deleted" : false,
          "deleted_at" : null,
          "collection_event_id" : "f18d3170-054a-5555-92c6-77375ed946a0",
          "coordinates_id" : "21663156-4110-5b5b-8195-7ec4440d1b10",
          "attributes" : {
            "collected_by" : "Descamps M."
          },
          "last_modified_at" : "2024-03-13T12:41:10.764397"
        }
      },
      {
        "_index" : "bu-collection-event-manual__2024-03-14t0636553639210000",
        "_type" : "_doc",
        "_id" : "EWWuO44BF3xNhTExOXoP",
        "_score" : 1.0,
        "_source" : {
          "created_at" : "2024-03-13T12:41:10.660310",
          "geolocation_id" : "3d463a2d-cda6-5f9f-b926-a32ae3a42396",
          "is_deleted" : false,
          "deleted_at" : null,
          "collection_event_id" : "022934c0-80dd-530e-a10b-4765d8798409",
          "coordinates_id" : "7d9bd2c1-9333-5f05-b9f3-0b2b5a3ac3e8",
          "attributes" : {
            "collected_by" : "Descamps M."
          },
          "last_modified_at" : "2024-03-13T12:41:10.764399"
        }
      },
      {
        "_index" : "bu-collection-event-manual__2024-03-14t0636553639210000",
        "_type" : "_doc",
        "_id" : "EmWuO44BF3xNhTExOXoP",
        "_score" : 1.0,
        "_source" : {
          "created_at" : "2024-03-13T12:41:10.660312",
          "geolocation_id" : "5f83807a-7f0c-5c0b-9c24-89ae92502e56",
          "is_deleted" : false,
          "deleted_at" : null,
          "collection_event_id" : "6404444a-5519-5e7c-a0c3-b3c31834f3ee",
          "coordinates_id" : "4f805fb9-c768-5aff-a4ba-9d3fb619c06e",
          "attributes" : {
            "collected_by" : "Descamps M."
          },
          "last_modified_at" : "2024-03-13T12:41:10.764401"
        }
      },
      {
        "_index" : "bu-collection-event-manual__2024-03-14t0636553639210000",
        "_type" : "_doc",
        "_id" : "E2WuO44BF3xNhTExOXoP",
        "_score" : 1.0,
        "_source" : {
          "created_at" : "2024-03-13T12:41:10.660314",
          "geolocation_id" : "7f229bd7-a714-50e2-a492-0bfc0de06cfd",
          "is_deleted" : false,
          "deleted_at" : null,
          "collection_event_id" : "2c135144-cf4b-5740-9770-19cc67e8cb1f",
          "coordinates_id" : "07855fb3-f0cc-5954-a28c-883879e697b8",
          "attributes" : {
            "collected_by" : "Mao Y.-E."
          },
          "last_modified_at" : "2024-03-13T12:41:10.764403"
        }
      },
      {
        "_index" : "bu-collection-event-manual__2024-03-14t0636553639210000",
        "_type" : "_doc",
        "_id" : "FGWuO44BF3xNhTExOXoP",
        "_score" : 1.0,
        "_source" : {
          "created_at" : "2024-03-13T12:41:10.660315",
          "geolocation_id" : "4e826755-09c2-5dd4-bff6-e930b4d6e7a5",
          "is_deleted" : false,
          "deleted_at" : null,
          "collection_event_id" : "45f64e4b-862e-5e1b-bd80-da775bcdebc7",
          "coordinates_id" : "d13016df-2390-57ff-bd29-aac520ea2fca",
          "attributes" : {
            "collected_by" : "Descamps M."
          },
          "last_modified_at" : "2024-03-13T12:41:10.764404"
        }
      },
      {
        "_index" : "bu-collection-event-manual__2024-03-14t0636553639210000",
        "_type" : "_doc",
        "_id" : "FWWuO44BF3xNhTExOXoP",
        "_score" : 1.0,
        "_source" : {
          "created_at" : "2024-03-13T12:41:10.660317",
          "geolocation_id" : "06760531-9779-58d9-85b8-f2b62c1bb858",
          "is_deleted" : false,
          "deleted_at" : null,
          "collection_event_id" : "95a2bda5-e2c4-5aa8-90f1-554b6c78ffda",
          "coordinates_id" : "cfcf9528-5e2f-5a51-a3c0-cea100c8a3b1",
          "attributes" : {
            "collected_by" : "Qiu J.-Y."
          },
          "last_modified_at" : "2024-03-13T12:41:10.764406"
        }
      },
      {
        "_index" : "bu-collection-event-manual__2024-03-14t0636553639210000",
        "_type" : "_doc",
        "_id" : "FmWuO44BF3xNhTExOXoP",
        "_score" : 1.0,
        "_source" : {
          "created_at" : "2024-03-13T12:41:10.660319",
          "geolocation_id" : "387be47d-99d8-570d-a123-38b15c92d4da",
          "is_deleted" : false,
          "deleted_at" : null,
          "collection_event_id" : "b1c2a1f1-735e-5b81-a392-45b966145894",
          "coordinates_id" : "0400100d-24f0-5099-84a4-3a2374766b51",
          "attributes" : {
            "collected_by" : "Génin A."
          },
          "last_modified_at" : "2024-03-13T12:41:10.764408"
        }
      },
      {
        "_index" : "bu-collection-event-manual__2024-03-14t0636553639210000",
        "_type" : "_doc",
        "_id" : "F2WuO44BF3xNhTExOXoP",
        "_score" : 1.0,
        "_source" : {
          "created_at" : "2024-03-13T12:41:10.660321",
          "geolocation_id" : "b8b96699-365e-52f6-b4b5-f2b0fbcc2be9",
          "is_deleted" : false,
          "deleted_at" : null,
          "collection_event_id" : "73a22bf6-2267-5083-b1cd-9c6e480cb443",
          "coordinates_id" : "9f126502-56f5-577e-b9de-342140b112d6",
          "attributes" : {
            "collected_by" : "Descamps M."
          },
          "last_modified_at" : "2024-03-13T12:41:10.764410"
        }
      },
      {
        "_index" : "bu-collection-event-manual__2024-03-14t0636553639210000",
        "_type" : "_doc",
        "_id" : "GGWuO44BF3xNhTExOXoP",
        "_score" : 1.0,
        "_source" : {
          "created_at" : "2024-03-13T12:41:10.660322",
          "geolocation_id" : "30651ded-6948-54ce-9aff-c9205b50f4e6",
          "is_deleted" : false,
          "deleted_at" : null,
          "collection_event_id" : "5b9899cd-5a41-5889-aabc-c1859f41b303",
          "coordinates_id" : "18bb9e5c-a5c9-5c0b-aeb2-a5bd1e552606",
          "attributes" : {
            "collected_by" : "Descamps M."
          },
          "last_modified_at" : "2024-03-13T12:41:10.764412"
        }
      }
    ]
  }
}
