{
  "bu-geolocation-manual__2024-03-14t0636553639210000" : {
    "mappings" : {
      "dynamic_templates" : [
        {
          "ids" : {
            "match" : "*_id",
            "mapping" : {
              "type" : "keyword"
            }
          }
        },
        {
          "dates" : {
            "match" : "*_at",
            "mapping" : {
              "type" : "date"
            }
          }
        },
        {
          "bools" : {
            "match" : "is_*",
            "mapping" : {
              "type" : "boolean"
            }
          }
        },
        {
          "codes" : {
            "match" : "code",
            "mapping" : {
              "type" : "keyword"
            }
          }
        },
        {
          "labels" : {
            "match" : "label",
            "mapping" : {
              "type" : "keyword"
            }
          }
        },
        {
          "descriptions" : {
            "match" : "description",
            "mapping" : {
              "type" : "keyword"
            }
          }
        },
        {
          "names" : {
            "match" : "name",
            "mapping" : {
              "type" : "keyword"
            }
          }
        }
      ],
      "properties" : {
        "attributes" : {
          "properties" : {
            "continent" : {
              "type" : "keyword"
            },
            "country" : {
              "type" : "keyword"
            },
            "country_code" : {
              "type" : "keyword"
            },
            "county" : {
              "type" : "keyword"
            },
            "first_administrative_level" : {
              "type" : "keyword"
            },
            "island" : {
              "type" : "keyword"
            },
            "island_group" : {
              "type" : "keyword"
            },
            "locality" : {
              "type" : "keyword"
            },
            "municipality" : {
              "type" : "keyword"
            },
            "ocean" : {
              "type" : "keyword"
            },
            "original_name" : {
              "type" : "keyword"
            },
            "remarks" : {
              "type" : "keyword"
            },
            "sea" : {
              "type" : "keyword"
            },
            "second_administrative_level" : {
              "type" : "keyword"
            },
            "state_province" : {
              "type" : "keyword"
            },
            "verbatim_country" : {
              "type" : "keyword"
            },
            "verbatim_locality" : {
              "type" : "keyword"
            }
          }
        },
        "created_at" : {
          "type" : "date"
        },
        "geolocation_id" : {
          "type" : "keyword"
        },
        "is_deleted" : {
          "type" : "boolean"
        },
        "last_modified_at" : {
          "type" : "date"
        }
      }
    }
  }
}
