{
  "took" : 19,
  "timed_out" : false,
  "_shards" : {
    "total" : 1,
    "successful" : 1,
    "skipped" : 0,
    "failed" : 0
  },
  "hits" : {
    "total" : {
      "value" : 58,
      "relation" : "eq"
    },
    "max_score" : 1.0,
    "hits" : [
      {
        "_index" : "bu-collection-manual__2024-03-14t0636553639210000",
        "_type" : "_doc",
        "_id" : "D2SuO44BF3xNhTExCOeG",
        "_score" : 1.0,
        "_source" : {
          "created_at" : "2024-03-13T12:42:01.884481",
          "collection_group_id" : 1,
          "code" : "ZO",
          "collection_id" : 1,
          "institution_id" : 1,
          "name" : "Oiseaux",
          "description" : "Collection d’oiseaux"
        }
      },
      {
        "_index" : "bu-collection-manual__2024-03-14t0636553639210000",
        "_type" : "_doc",
        "_id" : "EGSuO44BF3xNhTExCOeG",
        "_score" : 1.0,
        "_source" : {
          "created_at" : "2024-03-13T12:42:01.884487",
          "collection_group_id" : 1,
          "code" : "ZM",
          "collection_id" : 2,
          "institution_id" : 1,
          "name" : "Mammifères",
          "description" : "Collection de mammifères"
        }
      },
      {
        "_index" : "bu-collection-manual__2024-03-14t0636553639210000",
        "_type" : "_doc",
        "_id" : "EWSuO44BF3xNhTExCOeG",
        "_score" : 1.0,
        "_source" : {
          "created_at" : "2024-03-13T12:42:01.884489",
          "collection_group_id" : 1,
          "code" : "ZA",
          "collection_id" : 3,
          "institution_id" : 1,
          "name" : "Anatomie comparée",
          "description" : "Collection d’anatomie comparée"
        }
      },
      {
        "_index" : "bu-collection-manual__2024-03-14t0636553639210000",
        "_type" : "_doc",
        "_id" : "EmSuO44BF3xNhTExCOeG",
        "_score" : 1.0,
        "_source" : {
          "created_at" : "2024-03-13T12:42:05.307962",
          "collection_group_id" : 2,
          "code" : "IA",
          "collection_id" : 4,
          "institution_id" : 1,
          "name" : "Annélides, Polychètes et Sipunculides",
          "description" : "Collection d’Annélides, Polychètes et Sipunculides"
        }
      },
      {
        "_index" : "bu-collection-manual__2024-03-14t0636553639210000",
        "_type" : "_doc",
        "_id" : "E2SuO44BF3xNhTExCOeG",
        "_score" : 1.0,
        "_source" : {
          "created_at" : "2024-03-13T12:42:05.307966",
          "collection_group_id" : 2,
          "code" : "IB",
          "collection_id" : 5,
          "institution_id" : 1,
          "name" : "Bryozoaires Brachiopodes",
          "description" : "Collection de Bryozoaires Brachiopodes"
        }
      },
      {
        "_index" : "bu-collection-manual__2024-03-14t0636553639210000",
        "_type" : "_doc",
        "_id" : "FGSuO44BF3xNhTExCOeG",
        "_score" : 1.0,
        "_source" : {
          "created_at" : "2024-03-13T12:42:05.307968",
          "collection_group_id" : 2,
          "code" : "IE",
          "collection_id" : 6,
          "institution_id" : 1,
          "name" : "Échinodermes",
          "description" : "Collection d’échinodermes"
        }
      },
      {
        "_index" : "bu-collection-manual__2024-03-14t0636553639210000",
        "_type" : "_doc",
        "_id" : "FWSuO44BF3xNhTExCOeG",
        "_score" : 1.0,
        "_source" : {
          "created_at" : "2024-03-13T12:42:05.307969",
          "collection_group_id" : 2,
          "code" : "IK",
          "collection_id" : 7,
          "institution_id" : 1,
          "name" : "Cnidaires",
          "description" : "Collection de Cnidaires"
        }
      },
      {
        "_index" : "bu-collection-manual__2024-03-14t0636553639210000",
        "_type" : "_doc",
        "_id" : "FmSuO44BF3xNhTExCOeG",
        "_score" : 1.0,
        "_source" : {
          "created_at" : "2024-03-13T12:42:05.307971",
          "collection_group_id" : 2,
          "code" : "IM",
          "collection_id" : 8,
          "institution_id" : 1,
          "name" : "Mollusques",
          "description" : "Collection de Mollusques"
        }
      },
      {
        "_index" : "bu-collection-manual__2024-03-14t0636553639210000",
        "_type" : "_doc",
        "_id" : "Z4KyO44BF3xNhTExVXHv",
        "_score" : 1.0,
        "_source" : {
          "created_at" : "2024-03-13T12:42:05.307972",
          "collection_group_id" : 2,
          "code" : "IP",
          "collection_id" : 9,
          "institution_id" : 1,
          "name" : "Porifères",
          "description" : "Collection de Porifères"
        }
      },
      {
        "_index" : "bu-collection-manual__2024-03-14t0636553639210000",
        "_type" : "_doc",
        "_id" : "aIKyO44BF3xNhTExVXHv",
        "_score" : 1.0,
        "_source" : {
          "created_at" : "2024-03-13T12:42:05.307974",
          "collection_group_id" : 2,
          "code" : "IR",
          "collection_id" : 10,
          "institution_id" : 1,
          "name" : "Protistes",
          "description" : "Collection de Protistes"
        }
      },
      {
        "_index" : "bu-collection-manual__2024-03-14t0636553639210000",
        "_type" : "_doc",
        "_id" : "aYKyO44BF3xNhTExVXHv",
        "_score" : 1.0,
        "_source" : {
          "created_at" : "2024-03-13T12:42:05.307976",
          "collection_group_id" : 2,
          "code" : "IT",
          "collection_id" : 11,
          "institution_id" : 1,
          "name" : "Tuniciers/ascidies",
          "description" : "Collection de Tuniciers/ascidies"
        }
      },
      {
        "_index" : "bu-collection-manual__2024-03-14t0636553639210000",
        "_type" : "_doc",
        "_id" : "aoKyO44BF3xNhTExVXHv",
        "_score" : 1.0,
        "_source" : {
          "created_at" : "2024-03-13T12:42:05.307977",
          "collection_group_id" : 2,
          "code" : "IU",
          "collection_id" : 12,
          "institution_id" : 1,
          "name" : "Crustacés",
          "description" : "Collection de Crustacés"
        }
      },
      {
        "_index" : "bu-collection-manual__2024-03-14t0636553639210000",
        "_type" : "_doc",
        "_id" : "a4KyO44BF3xNhTExVXHv",
        "_score" : 1.0,
        "_source" : {
          "created_at" : "2024-03-13T12:42:05.307979",
          "collection_group_id" : 2,
          "code" : "SC",
          "collection_id" : 13,
          "institution_id" : 1,
          "name" : "Scléractiniaires",
          "description" : "Collection de scléractiniaires"
        }
      },
      {
        "_index" : "bu-collection-manual__2024-03-14t0636553639210000",
        "_type" : "_doc",
        "_id" : "bIKyO44BF3xNhTExVXHv",
        "_score" : 1.0,
        "_source" : {
          "created_at" : "2024-03-13T12:42:05.307980",
          "collection_group_id" : 2,
          "code" : "II",
          "collection_id" : 14,
          "institution_id" : 1,
          "name" : "Invertébrés Indéterminés",
          "description" : "Collection d’invertébrés indéterminés"
        }
      },
      {
        "_index" : "bu-collection-manual__2024-03-14t0636553639210000",
        "_type" : "_doc",
        "_id" : "bYKyO44BF3xNhTExVXHv",
        "_score" : 1.0,
        "_source" : {
          "created_at" : "2024-03-13T12:42:09.609305",
          "collection_group_id" : null,
          "code" : "IC",
          "collection_id" : 15,
          "institution_id" : 1,
          "name" : "Poissons et Ichtyologie",
          "description" : "Collection de Poissons (Ichtyologie)"
        }
      },
      {
        "_index" : "bu-collection-manual__2024-03-14t0636553639210000",
        "_type" : "_doc",
        "_id" : "boKyO44BF3xNhTExVXHv",
        "_score" : 1.0,
        "_source" : {
          "created_at" : "2024-03-13T12:42:13.916863",
          "collection_group_id" : 3,
          "code" : "AC",
          "collection_id" : 16,
          "institution_id" : 1,
          "name" : "Arachnides : Acariens",
          "description" : "Collection d’acariens"
        }
      },
      {
        "_index" : "bu-collection-manual__2024-03-14t0636553639210000",
        "_type" : "_doc",
        "_id" : "l-S-O44BF3xNhTExy95l",
        "_score" : 1.0,
        "_source" : {
          "created_at" : "2024-03-13T12:42:13.916867",
          "collection_group_id" : 3,
          "code" : "AR",
          "collection_id" : 17,
          "institution_id" : 1,
          "name" : "Arachnides : Araneae",
          "description" : "Collection d’aranae"
        }
      },
      {
        "_index" : "bu-collection-manual__2024-03-14t0636553639210000",
        "_type" : "_doc",
        "_id" : "mOS-O44BF3xNhTExy95l",
        "_score" : 1.0,
        "_source" : {
          "created_at" : "2024-03-13T12:42:13.916869",
          "collection_group_id" : 3,
          "code" : "EA",
          "collection_id" : 18,
          "institution_id" : 1,
          "name" : "Aptérygotes & Collemboles",
          "description" : "Collection d’aptérygotes et de collemboles"
        }
      },
      {
        "_index" : "bu-collection-manual__2024-03-14t0636553639210000",
        "_type" : "_doc",
        "_id" : "meS-O44BF3xNhTExy95l",
        "_score" : 1.0,
        "_source" : {
          "created_at" : "2024-03-13T12:42:13.916871",
          "collection_group_id" : 3,
          "code" : "EC",
          "collection_id" : 19,
          "institution_id" : 1,
          "name" : "Insectes - Coléoptères",
          "description" : "Collection de coléoptères"
        }
      },
      {
        "_index" : "bu-collection-manual__2024-03-14t0636553639210000",
        "_type" : "_doc",
        "_id" : "muS-O44BF3xNhTExy95l",
        "_score" : 1.0,
        "_source" : {
          "created_at" : "2024-03-13T12:42:13.916872",
          "collection_group_id" : 3,
          "code" : "ED",
          "collection_id" : 20,
          "institution_id" : 1,
          "name" : "Insectes - Diptères",
          "description" : "Collection de diptères"
        }
      },
      {
        "_index" : "bu-collection-manual__2024-03-14t0636553639210000",
        "_type" : "_doc",
        "_id" : "m-S-O44BF3xNhTExy95l",
        "_score" : 1.0,
        "_source" : {
          "created_at" : "2024-03-13T12:42:13.916874",
          "collection_group_id" : 3,
          "code" : "EH",
          "collection_id" : 21,
          "institution_id" : 1,
          "name" : "Insectes - Hémiptères",
          "description" : "Collection d’hémiptères"
        }
      },
      {
        "_index" : "bu-collection-manual__2024-03-14t0636553639210000",
        "_type" : "_doc",
        "_id" : "nOS-O44BF3xNhTExy95l",
        "_score" : 1.0,
        "_source" : {
          "created_at" : "2024-03-13T12:42:13.916875",
          "collection_group_id" : 3,
          "code" : "EL",
          "collection_id" : 22,
          "institution_id" : 1,
          "name" : "Insectes - Lépidoptères",
          "description" : "Collection de lépidoptères"
        }
      },
      {
        "_index" : "bu-collection-manual__2024-03-14t0636553639210000",
        "_type" : "_doc",
        "_id" : "neS-O44BF3xNhTExy95l",
        "_score" : 1.0,
        "_source" : {
          "created_at" : "2024-03-13T12:42:13.916877",
          "collection_group_id" : 3,
          "code" : "E0",
          "collection_id" : 23,
          "institution_id" : 1,
          "name" : "Insectes - Orthoptéroïdes",
          "description" : "Collection d’orthoptéroïdes"
        }
      },
      {
        "_index" : "bu-collection-manual__2024-03-14t0636553639210000",
        "_type" : "_doc",
        "_id" : "nuS-O44BF3xNhTExy95l",
        "_score" : 1.0,
        "_source" : {
          "created_at" : "2024-03-13T12:42:13.916878",
          "collection_group_id" : 3,
          "code" : "EP",
          "collection_id" : 24,
          "institution_id" : 1,
          "name" : "Insectes - Petits ordres & Odonates",
          "description" : "Collection d’odonates et des petits ordres"
        }
      },
      {
        "_index" : "bu-collection-manual__2024-03-14t0636553639210000",
        "_type" : "_doc",
        "_id" : "ixPEO44BF3xNhTExaShn",
        "_score" : 1.0,
        "_source" : {
          "created_at" : "2024-03-13T12:42:13.916880",
          "collection_group_id" : 3,
          "code" : "EY",
          "collection_id" : 25,
          "institution_id" : 1,
          "name" : "Insectes - Hyménoptères",
          "description" : "Collection d’hyménoptères"
        }
      },
      {
        "_index" : "bu-collection-manual__2024-03-14t0636553639210000",
        "_type" : "_doc",
        "_id" : "jBPEO44BF3xNhTExaShn",
        "_score" : 1.0,
        "_source" : {
          "created_at" : "2024-03-13T12:42:13.916881",
          "collection_group_id" : 3,
          "code" : "MY",
          "collection_id" : 26,
          "institution_id" : 1,
          "name" : "Myriapodes",
          "description" : "Collection de myriapodes"
        }
      },
      {
        "_index" : "bu-collection-manual__2024-03-14t0636553639210000",
        "_type" : "_doc",
        "_id" : "jRPEO44BF3xNhTExaShn",
        "_score" : 1.0,
        "_source" : {
          "created_at" : "2024-03-13T12:42:13.916883",
          "collection_group_id" : 3,
          "code" : "RS",
          "collection_id" : 27,
          "institution_id" : 1,
          "name" : "Arachnides : Scorpionidae",
          "description" : "Collection de scorpionidae"
        }
      },
      {
        "_index" : "bu-collection-manual__2024-03-14t0636553639210000",
        "_type" : "_doc",
        "_id" : "jhPEO44BF3xNhTExaShn",
        "_score" : 1.0,
        "_source" : {
          "created_at" : "2024-03-13T12:42:21.457486",
          "collection_group_id" : 1,
          "code" : "RA",
          "collection_id" : 28,
          "institution_id" : 1,
          "name" : "Reptiles et amphibiens",
          "description" : "Collection de reptiles et amphibiens"
        }
      },
      {
        "_index" : "bu-collection-manual__2024-03-14t0636553639210000",
        "_type" : "_doc",
        "_id" : "jxPEO44BF3xNhTExaShn",
        "_score" : 1.0,
        "_source" : {
          "created_at" : "2024-03-13T14:15:16.627786",
          "collection_group_id" : 4,
          "code" : "P",
          "collection_id" : 29,
          "institution_id" : 1,
          "name" : "Plantes vasculaires",
          "description" : "Collection de plantes vasculaires"
        }
      },
      {
        "_index" : "bu-collection-manual__2024-03-14t0636553639210000",
        "_type" : "_doc",
        "_id" : "kBPEO44BF3xNhTExaShn",
        "_score" : 1.0,
        "_source" : {
          "created_at" : "2024-03-13T14:15:16.627793",
          "collection_group_id" : 4,
          "code" : "PC",
          "collection_id" : 30,
          "institution_id" : 1,
          "name" : "Cryptogames",
          "description" : "Collection de cryptogamie"
        }
      },
      {
        "_index" : "bu-collection-manual__2024-03-14t0636553639210000",
        "_type" : "_doc",
        "_id" : "kRPEO44BF3xNhTExaShn",
        "_score" : 1.0,
        "_source" : {
          "created_at" : "2024-03-13T14:15:16.627794",
          "collection_group_id" : 4,
          "code" : "CO",
          "collection_id" : 31,
          "institution_id" : 1,
          "name" : "Laboratoire Maritime de Concarneau",
          "description" : "Collection du Laboratoire Maritime de Concarneau"
        }
      },
      {
        "_index" : "bu-collection-manual__2024-03-14t0636553639210000",
        "_type" : "_doc",
        "_id" : "khPEO44BF3xNhTExaShn",
        "_score" : 1.0,
        "_source" : {
          "created_at" : "2024-03-13T14:15:16.627796",
          "collection_group_id" : 4,
          "code" : "DIN",
          "collection_id" : 32,
          "institution_id" : 1,
          "name" : "Laboratoire Maritime de Dinard",
          "description" : "Collection du Laboratoire Maritime de Dinard"
        }
      },
      {
        "_index" : "bu-collection-manual__2024-03-14t0636553639210000",
        "_type" : "_doc",
        "_id" : "hizHO44BF3xNhTExthnn",
        "_score" : 1.0,
        "_source" : {
          "created_at" : "2024-03-13T14:15:16.627797",
          "collection_group_id" : 4,
          "code" : "FABR",
          "collection_id" : 33,
          "institution_id" : 1,
          "name" : "Herbier du harmas de J. H. Fabre",
          "description" : "Collection de l’Herbier du harmas de J. H. Fabre"
        }
      },
      {
        "_index" : "bu-collection-manual__2024-03-14t0636553639210000",
        "_type" : "_doc",
        "_id" : "hyzHO44BF3xNhTExthnn",
        "_score" : 1.0,
        "_source" : {
          "created_at" : "2024-03-13T14:15:16.627799",
          "collection_group_id" : 4,
          "code" : "PAT",
          "collection_id" : 34,
          "institution_id" : 1,
          "name" : "Ethnobotanique",
          "description" : "Collection ethnobotanique"
        }
      },
      {
        "_index" : "bu-collection-manual__2024-03-14t0636553639210000",
        "_type" : "_doc",
        "_id" : "iCzHO44BF3xNhTExthnn",
        "_score" : 1.0,
        "_source" : {
          "created_at" : "2024-03-13T14:15:16.627800",
          "collection_group_id" : 4,
          "code" : "AIX",
          "collection_id" : 35,
          "institution_id" : 12,
          "name" : "Herbier du M.H.N. d'Aix-en-Provence",
          "description" : "Collection du M.H.N. d'Aix-en-Provence"
        }
      },
      {
        "_index" : "bu-collection-manual__2024-03-14t0636553639210000",
        "_type" : "_doc",
        "_id" : "iSzHO44BF3xNhTExthnn",
        "_score" : 1.0,
        "_source" : {
          "created_at" : "2024-03-13T14:15:16.627802",
          "collection_group_id" : 4,
          "code" : "ALF",
          "collection_id" : 36,
          "institution_id" : 4,
          "name" : "Herbier du Dép. d’Élevage et de Médecine Vétérinaire (CIRAD)",
          "description" : "Collection du Dép. d’Élevage et de Médecine Vétérinaire"
        }
      },
      {
        "_index" : "bu-collection-manual__2024-03-14t0636553639210000",
        "_type" : "_doc",
        "_id" : "iizHO44BF3xNhTExthnn",
        "_score" : 1.0,
        "_source" : {
          "created_at" : "2024-03-13T14:15:16.627803",
          "collection_group_id" : 4,
          "code" : "ANVL",
          "collection_id" : 37,
          "institution_id" : 3,
          "name" : "Herbier de l’Association des Naturalistes de la Vallée du Loing et du Massif de Fontainebleau",
          "description" : "Collection de l’Association des Naturalistes de la Vallée du Loing et du Massif de Fontainebleau"
        }
      },
      {
        "_index" : "bu-collection-manual__2024-03-14t0636553639210000",
        "_type" : "_doc",
        "_id" : "iyzHO44BF3xNhTExthnn",
        "_score" : 1.0,
        "_source" : {
          "created_at" : "2024-03-13T14:15:16.627805",
          "collection_group_id" : 4,
          "code" : "AUT",
          "collection_id" : 38,
          "institution_id" : 13,
          "name" : "Herbier du Muséum d'Autun",
          "description" : "Collection de l’Herbier du Muséum d'Autun"
        }
      },
      {
        "_index" : "bu-collection-manual__2024-03-14t0636553639210000",
        "_type" : "_doc",
        "_id" : "jCzHO44BF3xNhTExthnn",
        "_score" : 1.0,
        "_source" : {
          "created_at" : "2024-03-13T14:15:16.643846",
          "collection_group_id" : 4,
          "code" : "BAMBO",
          "collection_id" : 39,
          "institution_id" : null,
          "name" : "Herbier de la Bambouseraie Prafrance",
          "description" : "Collection de la Bambouseraie Prafrance"
        }
      },
      {
        "_index" : "bu-collection-manual__2024-03-14t0636553639210000",
        "_type" : "_doc",
        "_id" : "jSzHO44BF3xNhTExthnn",
        "_score" : 1.0,
        "_source" : {
          "created_at" : "2024-03-13T14:15:16.644758",
          "collection_group_id" : 4,
          "code" : "CHE",
          "collection_id" : 40,
          "institution_id" : 17,
          "name" : "Herbier de la Société Nationale des Sciences Naturelles et Mathématiques de Cherbourg",
          "description" : "Collection de la Société Nationale des Sciences Naturelles et Mathématiques de Cherbourg"
        }
      },
      {
        "_index" : "bu-collection-manual__2024-03-14t0636553639210000",
        "_type" : "_doc",
        "_id" : "TUbLO44BF3xNhTExU2Dc",
        "_score" : 1.0,
        "_source" : {
          "created_at" : "2024-03-13T14:15:16.644762",
          "collection_group_id" : 4,
          "code" : "CLF",
          "collection_id" : 41,
          "institution_id" : 18,
          "name" : "Herbier de l’Inst. des Herbiers Universitaires",
          "description" : "Collection de l’Inst. des Herbiers Universitaires"
        }
      },
      {
        "_index" : "bu-collection-manual__2024-03-14t0636553639210000",
        "_type" : "_doc",
        "_id" : "TkbLO44BF3xNhTExU2Dc",
        "_score" : 1.0,
        "_source" : {
          "created_at" : "2024-03-13T14:15:16.644764",
          "collection_group_id" : 4,
          "code" : "FEN",
          "collection_id" : 42,
          "institution_id" : 10,
          "name" : "Herbier G. Fenoul, Lycée Félix Esclangon/Comité Patrimoine Manosquin",
          "description" : "Collection de G. Fenoul, Lycée Félix Esclangon/Comité Patrimoine Manosquin"
        }
      },
      {
        "_index" : "bu-collection-manual__2024-03-14t0636553639210000",
        "_type" : "_doc",
        "_id" : "T0bLO44BF3xNhTExU2Dc",
        "_score" : 1.0,
        "_source" : {
          "created_at" : "2024-03-13T14:15:16.644765",
          "collection_group_id" : 4,
          "code" : "GAP",
          "collection_id" : 43,
          "institution_id" : 5,
          "name" : "Conservatoire Botanique National Alpin",
          "description" : "Collection du Conservatoire Botanique National Alpin"
        }
      },
      {
        "_index" : "bu-collection-manual__2024-03-14t0636553639210000",
        "_type" : "_doc",
        "_id" : "UEbLO44BF3xNhTExU2Dc",
        "_score" : 1.0,
        "_source" : {
          "created_at" : "2024-03-13T14:15:16.644767",
          "collection_group_id" : 4,
          "code" : "INH",
          "collection_id" : 44,
          "institution_id" : 9,
          "name" : "Institut National d'Horticulture",
          "description" : "Collection de l’Institut National d'Horticulture"
        }
      },
      {
        "_index" : "bu-collection-manual__2024-03-14t0636553639210000",
        "_type" : "_doc",
        "_id" : "UUbLO44BF3xNhTExU2Dc",
        "_score" : 1.0,
        "_source" : {
          "created_at" : "2024-03-13T14:15:16.645583",
          "collection_group_id" : 4,
          "code" : "JUN",
          "collection_id" : 45,
          "institution_id" : null,
          "name" : "Herbier de Saint-Junien",
          "description" : "Collection de l’Herbier de Saint-Junien"
        }
      },
      {
        "_index" : "bu-collection-manual__2024-03-14t0636553639210000",
        "_type" : "_doc",
        "_id" : "UkbLO44BF3xNhTExU2Dc",
        "_score" : 1.0,
        "_source" : {
          "created_at" : "2024-03-13T14:15:16.646050",
          "collection_group_id" : 4,
          "code" : "LIMO",
          "collection_id" : 46,
          "institution_id" : 21,
          "name" : "Herbier de l’Université de Limoges",
          "description" : "Collection de l’Université de Limoges"
        }
      },
      {
        "_index" : "bu-collection-manual__2024-03-14t0636553639210000",
        "_type" : "_doc",
        "_id" : "U0bLO44BF3xNhTExU2Dc",
        "_score" : 1.0,
        "_source" : {
          "created_at" : "2024-03-13T14:15:16.646054",
          "collection_group_id" : 4,
          "code" : "LY",
          "collection_id" : 47,
          "institution_id" : 19,
          "name" : "Herbier de l’Université Claude Bernard Lyon 1",
          "description" : "Collection de l’Université Claude Bernard Lyon 1"
        }
      },
      {
        "_index" : "bu-collection-manual__2024-03-14t0636553639210000",
        "_type" : "_doc",
        "_id" : "VEbLO44BF3xNhTExU2Dc",
        "_score" : 1.0,
        "_source" : {
          "created_at" : "2024-03-13T14:15:16.646055",
          "collection_group_id" : 4,
          "code" : "MARS",
          "collection_id" : 48,
          "institution_id" : 2,
          "name" : "Herbier de Aix-Marseille Université",
          "description" : "Collection de Aix-Marseille Université"
        }
      },
      {
        "_index" : "bu-collection-manual__2024-03-14t0636553639210000",
        "_type" : "_doc",
        "_id" : "0qbYO44BF3xNhTExIPfU",
        "_score" : 1.0,
        "_source" : {
          "created_at" : "2024-03-13T14:15:16.646057",
          "collection_group_id" : 4,
          "code" : "MJSD",
          "collection_id" : 49,
          "institution_id" : 14,
          "name" : "Herbier du Muséum-Jardin des Sciences",
          "description" : "Collection du Muséum-Jardin des Sciences"
        }
      },
      {
        "_index" : "bu-collection-manual__2024-03-14t0636553639210000",
        "_type" : "_doc",
        "_id" : "06bYO44BF3xNhTExIPfU",
        "_score" : 1.0,
        "_source" : {
          "created_at" : "2024-03-13T14:15:16.646058",
          "collection_group_id" : 4,
          "code" : "MPU",
          "collection_id" : 50,
          "institution_id" : 22,
          "name" : "Herbier de l’Université de Montpellier",
          "description" : "Collection de l’Université de Montpellier"
        }
      },
      {
        "_index" : "bu-collection-manual__2024-03-14t0636553639210000",
        "_type" : "_doc",
        "_id" : "1KbYO44BF3xNhTExIPfU",
        "_score" : 1.0,
        "_source" : {
          "created_at" : "2024-03-13T14:15:16.646060",
          "collection_group_id" : 4,
          "code" : "MTL",
          "collection_id" : 51,
          "institution_id" : 11,
          "name" : "Herbier du Musée Toulouse Lautrec d’Albi",
          "description" : "Collection du Musée Toulouse Lautrec d’Albi"
        }
      },
      {
        "_index" : "bu-collection-manual__2024-03-14t0636553639210000",
        "_type" : "_doc",
        "_id" : "1abYO44BF3xNhTExIPfU",
        "_score" : 1.0,
        "_source" : {
          "created_at" : "2024-03-13T14:15:16.646061",
          "collection_group_id" : 4,
          "code" : "NCY",
          "collection_id" : 52,
          "institution_id" : 6,
          "name" : "Herbier du Conservatoire et Jardins Botaniques de Nancy",
          "description" : "Collection du Conservatoire et Jardins Botaniques de Nancy"
        }
      },
      {
        "_index" : "bu-collection-manual__2024-03-14t0636553639210000",
        "_type" : "_doc",
        "_id" : "1qbYO44BF3xNhTExIPfU",
        "_score" : 1.0,
        "_source" : {
          "created_at" : "2024-03-13T14:15:16.646063",
          "collection_group_id" : 4,
          "code" : "NOU",
          "collection_id" : 53,
          "institution_id" : 8,
          "name" : "Herbier de Nouméa",
          "description" : "Collection de Nouméa"
        }
      },
      {
        "_index" : "bu-collection-manual__2024-03-14t0636553639210000",
        "_type" : "_doc",
        "_id" : "16bYO44BF3xNhTExIPfU",
        "_score" : 1.0,
        "_source" : {
          "created_at" : "2024-03-13T14:15:16.646064",
          "collection_group_id" : 4,
          "code" : "PBB",
          "collection_id" : 54,
          "institution_id" : 15,
          "name" : "Herbier du Jardin botanique de Phu An",
          "description" : "Collection du Jardin botanique de Phu An"
        }
      },
      {
        "_index" : "bu-collection-manual__2024-03-14t0636553639210000",
        "_type" : "_doc",
        "_id" : "2KbYO44BF3xNhTExIPfU",
        "_score" : 1.0,
        "_source" : {
          "created_at" : "2024-03-13T14:15:16.646066",
          "collection_group_id" : 4,
          "code" : "RAB",
          "collection_id" : 55,
          "institution_id" : 7,
          "name" : "Herbier de l’Institut Scientifique de Rabat",
          "description" : "Collection de l’Institut Scientifique de Rabat"
        }
      },
      {
        "_index" : "bu-collection-manual__2024-03-14t0636553639210000",
        "_type" : "_doc",
        "_id" : "2abYO44BF3xNhTExIPfU",
        "_score" : 1.0,
        "_source" : {
          "created_at" : "2024-03-13T14:15:16.646067",
          "collection_group_id" : 4,
          "code" : "REN",
          "collection_id" : 56,
          "institution_id" : 23,
          "name" : "Culture Scientifique et Technique (CST) Université de Rennes 1",
          "description" : "Collection de l’Université de Rennes 1"
        }
      },
      {
        "_index" : "bu-collection-manual__2024-03-14t0636553639210000",
        "_type" : "_doc",
        "_id" : "J9LdO44BF3xNhTExiw1y",
        "_score" : 1.0,
        "_source" : {
          "created_at" : "2024-03-13T14:15:16.646069",
          "collection_group_id" : 4,
          "code" : "SLA",
          "collection_id" : 57,
          "institution_id" : 16,
          "name" : "Herbier de la Société des Lettres de l'Aveyron",
          "description" : "Collection de la Société des Lettres de l'Aveyron"
        }
      },
      {
        "_index" : "bu-collection-manual__2024-03-14t0636553639210000",
        "_type" : "_doc",
        "_id" : "KNLdO44BF3xNhTExiw1y",
        "_score" : 1.0,
        "_source" : {
          "created_at" : "2024-03-13T14:15:16.646070",
          "collection_group_id" : 4,
          "code" : "TOU",
          "collection_id" : 58,
          "institution_id" : 20,
          "name" : "Université François Rabelais",
          "description" : "Collection de l’Université François Rabelais"
        }
      }
    ]
  }
}
