green	open	bu-collection-event-manual__2023-12-05t1625059816200000	GnbpglhJRv6j6N2lHgxcRQ	1	1	1889520	0	1.1gb	604.2mb
green	open	bu-collection-event-manual__2024-03-12t0858414545370000	tpUm9nKSR3GZSFT0aI_1Kg	1	1	2237895	0	1.4gb	749mb
green	open	bu-collection-event-manual__2024-03-14t0636553639210000	dC4M8_l2Q_mh8J7Cce-sVw	1	1	2238192	0	1.4gb	763mb
green	open	bu-collection-group-manual__2023-12-05t1625059816200000	KJoyPptQQHilemJ-NRgEcA	1	1	3	0	27.9kb	13.9kb
green	open	bu-collection-group-manual__2024-03-12t0858414545370000	GVJWGD6PQLCrmWxxbvG5BA	1	1	4	0	20.1kb	10kb
green	open	bu-collection-group-manual__2024-03-14t0636553639210000	uHQpb3upRSOSqTwVDKpAyg	1	1	4	0	37.1kb	18.5kb
green	open	bu-collection-manual__2023-12-05t1625059816200000	17uNFe2XQwuecWrKzEg8Ug	1	1	41	0	96.2kb	48.1kb
green	open	bu-collection-manual__2024-03-12t0858414545370000	dndxFaZBRp-F1yxdNZgqhw	1	1	55	0	103.5kb	51.7kb
green	open	bu-collection-manual__2024-03-14t0636553639210000	s-QJRscmT_Convf6eXRYKw	1	1	58	0	103.6kb	51.8kb
green	open	bu-coordinates-manual__2023-12-05t1625059816200000	K8LWv0jpTMeRlJXpQarwxA	1	1	1801817	0	583.2mb	291.6mb
green	open	bu-coordinates-manual__2024-03-12t0858414545370000	occfCjKsQRa_Lw250IJe5g	1	1	1962240	0	625.5mb	312.6mb
green	open	bu-coordinates-manual__2024-03-14t0636553639210000	I8BFNge_QYK7b5AuJYspZw	1	1	1962523	0	627.7mb	313.7mb
green	open	bu-domain-manual__2023-12-05t1625059816200000	_Kt0i97fTnSvoWzBgO1yyQ	1	1	3	0	28.5kb	14.2kb
green	open	bu-domain-manual__2024-03-12t0858414545370000	B5NdBpv-SF2EyTkJFjiuog	1	1	6	0	32.3kb	16.1kb
green	open	bu-domain-manual__2024-03-14t0636553639210000	ui55gFkcS3yssxFIMmCAzA	1	1	6	0	41.4kb	20.7kb
green	open	bu-geolocation-manual__2023-12-05t1625059816200000	ghoIGmf5TkmvwvovAdptwA	1	1	1801817	0	574.2mb	287.1mb
green	open	bu-geolocation-manual__2024-03-12t0858414545370000	ZOlxXybuT0y-Io0UpuGAsg	1	1	1962240	0	611.3mb	305.7mb
green	open	bu-geolocation-manual__2024-03-14t0636553639210000	fLQmi6IAQP2F7qNnPwpz-g	1	1	1962523	0	624.7mb	312.4mb
green	open	bu-identification-manual__2023-12-05t1625059816200000	ZdVT9na7SdCWWxZxEaJNMA	1	1	9824203	0	5.1gb	2.5gb
green	open	bu-identification-manual__2024-03-12t0858414545370000	U3QAL2JhSKuOcnbfSBEv4w	1	1	10444200	0	5.3gb	2.6gb
green	open	bu-identification-manual__2024-03-14t0636553639210000	CcZ1ouU6QDav1L9sS20aXA	1	1	10417380	0	5.3gb	2.6gb
green	open	bu-institution-manual__2023-12-05t1625059816200000	vJ7LPdaESfCpdVnLmKcx8Q	1	1	23	0	58.4kb	29.2kb
green	open	bu-institution-manual__2024-03-12t0858414545370000	w8nU92RcQraLsVtR1egjSg	1	1	23	0	66.2kb	33.1kb
green	open	bu-institution-manual__2024-03-14t0636553639210000	JCTghAA_RfeCoeQFfq6lKw	1	1	23	0	58.4kb	29.2kb
green	open	bu-material-full-manual__2024-01-31t1320360669600000	0wKfQWFpQ5qwDkuQFOQ5xw	1	1	9118784	0	14.9gb	7.4gb
green	open	bu-material-full-manual__2024-03-11t1518056950310000	Hj0srMjeQc6weFbHYCE-sA	1	1	1163164	0	2.7gb	1.3gb
green	open	bu-material-full-manual__2024-03-12t0858349021020000	-Bz6PRBlRSqW-DLRGGH5yQ	1	1	35000	0	50.6mb	25.1mb
green	open	bu-material-manual__2024-01-31t1320360669600000	z4nmJCRYSXWgrIyGrdnJNQ	1	1	0	0	416b	208b
green	open	bu-material-manual__2024-03-11t1518056950310000	lq3LDjmpT0-XwqnkzBCaew	1	1	0	0	416b	208b
green	open	bu-material-manual__2024-03-12t0858349021020000	QdgQQMknS_SjpUVySUOI_Q	1	1	0	0	416b	208b
green	open	bu-material-manual__2024-03-12t0858414545370000	gHHl9uzQSmWLlGifGCCccQ	1	1	9151262	0	3.5gb	1.7gb
green	open	bu-material-manual__2024-03-14t0636553639210000	pWPvduBSQumMCizx2ah4gg	1	1	9151894	0	3.3gb	1.6gb
green	open	bu-material-relationship-manual__2023-12-05t1625059816200000	6Wo88mXBS46hZN3S2vXNHQ	1	1	3652	0	1.3mb	674.1kb
green	open	bu-material-relationship-manual__2024-03-12t0858414545370000	sA_iSDH0Q8usOHuz8Bn4wQ	1	1	3636	0	1.3mb	670.8kb
green	open	bu-material-relationship-manual__2024-03-14t0636553639210000	lOzN87oRSdaOYOmGZbOkIA	1	1	3636	0	1.3mb	671kb
green	open	bu-taxon-manual__2023-12-05t1625059816200000	-Eke2c3SR12s0uCZOYkMxQ	1	1	672931	0	441.4mb	220.7mb
green	open	bu-taxon-manual__2024-03-12t0858414545370000	Of-Sz7fZQtqyHJjGKWpQ1g	1	1	764210	0	491.4mb	245.9mb
green	open	bu-taxon-manual__2024-03-14t0636553639210000	yUQ-h1tOSN64DCo0GQ8qGw	1	1	764321	0	514mb	256.4mb
green	open	datahub-material-20230728	dgNFKGmfTWqDNFldPin6rw	1	1	0	0	416b	208b
green	open	rcn_specimen_short	qnp78apvTL28dj9WiT0pOQ	2	0	0	0	416b	416b
green	open	ref-taxon-taxref-20221011103110	zUbksZA1TNOGSJgCIcilWQ	1	1	657609	0	315mb	157.5mb
green	open	ref-taxon-taxref-20221011115619	bjPayENqR9CG_5jJ0vRY2w	1	1	657609	0	331.3mb	165.6mb
green	open	ref-taxon-taxref-20221026154110	5GO0DaixS4u6SsIRSY-_Sg	1	1	657609	0	334.9mb	167.4mb
green	open	taxon	JrLm-8LLQkG5at9VTRFmHA	1	1	1716	0	1.3mb	707.4kb
green	open	taxon_gbif_scientificname	2s-PiRrxR421RiHO4QOY_w	1	1	1716	0	1.2mb	614.5kb
green	open	taxon_ref_gbif	bSmeWyjJSAKqIs4ase3vCw	1	1	6957236	10	7.4gb	3.7gb
green	open	taxon_ref_taxref	DikmmicoQqmXz-_MA2Jw7A	1	1	657609	0	690.5mb	345.2mb
green	open	test_taxon_ref_col	9VmapHqSRK6eX-fdkuQK7A	1	1	4706130	0	5.9gb	2.9gb
green	open	test_taxon_ref_gbif_v2	yl88_qsDRwCy0bimSVGxNg	1	1	6957236	0	7.2gb	3.6gb