<?xml version="1.0" encoding="utf-8"?>
<svg viewBox="100 97.997 1746.103 302.003" xmlns="http://www.w3.org/2000/svg">
  <defs>
    <clipPath id="A">
      <path d="M0 800h2000V0H0z"/>
    </clipPath>
  </defs>
  <g clip-path="url(#A)" transform="matrix(1.333333, 0, 0, -1.333333, -300.725494, 795.966614)">
    <path d="M565.051 296.975h-4.837v225h4.837zm142.418 120.038h0l-20.794 96.311a8.72 8.72 0 0 1-4.187 5.635c-2.486 1.484-5.34 2.233-8.233 2.163h-35.797l46.491-149.709h32.324zm70.022 99.574a11.07 11.07 0 0 1-2.685 2.442c-2.434 1.535-5.271 2.315-8.146 2.233h-19.922c-1.118-.007-2.23-.142-3.315-.402l41.745-147.459a1.87 1.87 0 0 1 .262-.279 7.28 7.28 0 0 1 4.901-1.744h25.697zm453.979-.96a11.57 11.57 0 0 1-3.21 3.244 13.72 13.72 0 0 1-8.006 2.251h-37.245l58.021-149.709h32.552zm319.201-5.06a29.52 29.52 0 0 1-1.361 4.92 7.82 7.82 0 0 1-2.319 3.244 9.63 9.63 0 0 1-3.751 1.745 22.52 22.52 0 0 1-5.548.593h-27.911V371.413h40.821zm-711.6 10.555c-2.73.038-5.413-.713-7.726-2.163a8.72 8.72 0 0 1-4.102-5.635l-15.839-67.127-3.488-15.088-.907-4.205 14.741-55.491h5.005l46.438 149.709zm440.216-149.709h2.458l57.986 149.709h-35.464a12.63 12.63 0 0 1-7.501-2.251c-2.007-1.335-3.528-3.28-4.344-5.547l-28.033-90.922zM738.399 518.487c-1.691-1.24-2.918-3.008-3.488-5.023l-24.283-85.286 12.21-56.331c3.218 1.011 5.639 3.679 6.332 6.979l24.423 86.315zm850.79.054c-10.092-.112-20.047-2.347-29.219-6.559-1.221-.577-2.391-1.24-3.577-1.884v-48.601c2.935 4.754 7.092 8.634 12.037 11.234a31.88 31.88 0 0 0 14.897 3.191c7.104-.048 13.484 4.339 15.98 10.99l10.815 29.307c-6.852 1.654-13.885 2.433-20.933 2.322zm-571.92-79.268c1.074.492 1.979 1.295 2.598 2.302.874 1.552 1.414 3.269 1.589 5.041a62.07 62.07 0 0 1 .435 8.233c.186 9.867-1.471 19.682-4.885 28.942a61.55 61.55 0 0 1-13.955 21.596c-6.03 5.937-13.263 10.511-21.213 13.414a82.87 82.87 0 0 1-58.037-1.29 69.08 69.08 0 0 1-37.979-39.565c-3.444-9.081-5.182-18.721-5.127-28.434a121.36 121.36 0 0 1 .436-10.239zm-81.85 45.965c4.815 4.861 11.501 7.292 20.061 7.292 4.204.112 8.378-.731 12.211-2.459a22.79 22.79 0 0 0 8.146-6.419c2.108-2.687 3.652-5.774 4.535-9.072.916-3.415 1.375-6.933 1.362-10.466H925.91c1.524 9.222 4.694 16.263 9.509 21.124zm73.127-88.165c-.497 2.072-1.865 3.826-3.751 4.814-1.177.633-2.484.984-3.819 1.032h-10.59-34.889c-6.93.62-13.47 3.465-18.648 8.11-5.408 4.954-8.966 12.595-10.73 22.835h-44.36c.856-6.607 2.515-13.085 4.936-19.293 3.614-9.425 9.171-17.984 16.312-25.12a67.78 67.78 0 0 1 24.108-15.23c9.072-3.322 18.65-5.046 28.312-5.095h53.554v23.725c.024 1.421-.123 2.837-.435 4.222zm166.578 42.2c1.074.492 1.979 1.295 2.601 2.302.846 1.577 1.362 3.309 1.516 5.094a65.28 65.28 0 0 1 .437 8.234 79.3 79.3 0 0 1-4.989 28.939 61.28 61.28 0 0 1-13.851 21.596 59.3 59.3 0 0 1-21.232 13.417 82.88 82.88 0 0 1-58.036-1.291A69.12 69.12 0 0 1 1043.61 478c-3.445-9.083-5.185-18.722-5.128-28.435 0-3.489.155-6.978.434-10.241zm-81.866 45.965c4.814 4.861 11.506 7.292 20.077 7.292a27.76 27.76 0 0 0 12.211-2.459 22.88 22.88 0 0 0 8.165-6.419c2.102-2.689 3.639-5.774 4.519-9.072a39.15 39.15 0 0 0 1.376-10.466h-55.822c1.484 9.262 4.745 16.258 9.474 21.124zm73.128-88.165a7.35 7.35 0 0 1-1.362 2.844 7.45 7.45 0 0 1-2.391 1.97 8.61 8.61 0 0 1-3.802 1.032h-10.588-34.889a32.28 32.28 0 0 0-18.666 8.11c-5.407 4.954-8.95 12.595-10.729 22.835h-44.275a83.15 83.15 0 0 1 4.938-19.293c3.612-9.43 9.176-17.991 16.329-25.12 6.859-6.727 15.071-11.916 24.089-15.23a83.62 83.62 0 0 1 28.295-5.095h53.555v23.725a17.24 17.24 0 0 1-.504 4.222zm312.274 42.2c1.074.492 1.979 1.295 2.601 2.302a13.15 13.15 0 0 1 1.516 5.094 65.28 65.28 0 0 1 .437 8.234 78.94 78.94 0 0 1-4.989 28.939 61.28 61.28 0 0 1-13.851 21.596 59.32 59.32 0 0 1-21.231 13.417 82.88 82.88 0 0 1-58.037-1.291 69.12 69.12 0 0 1-37.96-39.564c-3.445-9.083-5.185-18.722-5.128-28.435a121.07 121.07 0 0 1 .435-10.241zm-81.85 45.965c4.803 4.861 11.49 7.292 20.061 7.292a27.76 27.76 0 0 0 12.211-2.459c3.177-1.486 5.971-3.681 8.165-6.419 2.106-2.687 3.651-5.774 4.535-9.072.916-3.415 1.375-6.933 1.361-10.466h-55.823c1.524 9.222 4.687 16.263 9.49 21.124zm73.111-88.165a7.32 7.32 0 0 1-1.361 2.844 7.45 7.45 0 0 1-2.391 1.97 8.61 8.61 0 0 1-3.802 1.032h-10.588-34.889c-6.934.62-13.481 3.465-18.665 8.11-5.409 4.954-8.952 12.595-10.73 22.835h-44.274a81.2 81.2 0 0 1 4.937-19.293c3.603-9.432 9.159-17.991 16.31-25.12a67.78 67.78 0 0 1 24.108-15.23c9.067-3.319 18.64-5.043 28.295-5.095h53.573v23.725a17.02 17.02 0 0 1-.523 4.222z"/>
  </g>
  <text x="551.586" y="389.095" fill="#333" font-family="Lato" font-size="50" style="white-space: pre; font-size: 50px;">Du document à la connaissance partageable et actionnable</text>
  <circle class="a" cx="250" cy="250" r="150" style="fill: rgb(255, 255, 255);"/>
  <path class="b" d="M 200.635 205.519 C 200.404 205.629 200.179 205.752 199.962 205.885 C 198.125 206.898 196.748 208.577 196.115 210.577 L 181.481 259.115 L 191.731 301.808 C 192.887 301.612 193.975 301.137 194.904 300.423 C 196.337 299.217 197.363 297.598 197.846 295.788 L 213.462 246.154 L 200.635 205.519" style="fill: rgb(250, 136, 35);"/>
  <path class="c" d="M 159.173 204.269 L 131.269 204.269 L 165.135 301.923 L 168.654 301.923 L 181.481 259.096 L 169.942 210.731 C 169.398 208.613 167.96 206.837 166 205.865 C 163.921 204.752 161.588 204.196 159.231 204.25" style="fill: rgb(247, 221, 77);"/>
  <path class="d" d="M 181.481 259.115 L 168.654 301.923 L 190.615 301.923 L 191.731 301.808 L 181.481 259.115" style="fill: rgb(243, 118, 14);"/>
  <path class="e" d="M 295.25 204.269 L 267.308 204.269 L 301.212 301.923 L 305.058 301.923 L 317.788 259.865 L 305.962 210.75 C 305.438 208.65 304.038 206.877 302.115 205.885 C 300.037 204.771 297.704 204.215 295.346 204.269" style="fill: rgb(32, 167, 175);"/>
  <path class="f" d="M 226.269 205.519 L 213.462 246.154 L 229.077 295.731 C 229.56 297.54 230.587 299.16 232.019 300.365 C 232.342 300.619 232.69 300.838 233.058 301.019 L 233.058 301.019 L 245.558 259.615 L 230.769 210.577 C 230.148 208.571 228.767 206.888 226.923 205.885 L 226.25 205.519" style="fill: rgb(28, 151, 195);"/>
  <path class="g" d="M 220.192 204.192 L 206.731 204.192 C 204.629 204.15 202.546 204.604 200.654 205.519 L 213.462 246.154 L 226.288 205.462 C 224.394 204.55 222.313 204.096 220.212 204.135" style="fill: rgb(27, 72, 48);"/>
  <path class="h" d="M 368.731 204.269 L 342.404 204.269 C 340.208 204.21 338.046 204.827 336.212 206.038 C 334.587 207.131 333.354 208.713 332.692 210.558 L 332.692 210.769 L 317.827 259.885 L 327.846 301.923 L 330.865 301.923 L 368.731 204.25" style="fill: rgb(166, 216, 101);"/>
  <polyline class="i" points="317.75 259.885 305.019 301.942 327.846 301.942 317.75 259.885" style="fill: rgb(23, 151, 97);"/>
  <path class="j" d="M 259.096 214.846 L 245.558 259.615 L 258.25 301.923 L 258.577 301.923 L 271.154 269.462 C 273.496 263.425 273.619 256.754 271.5 250.635 L 259.096 214.846" style="fill: rgb(141, 55, 80);"/>
  <path class="k" d="M 245.558 259.615 L 232.981 301.096 L 232.981 301.096 C 233.754 301.508 234.594 301.775 235.462 301.885 L 235.462 301.885 L 236.192 301.885 L 258.25 301.885 L 245.558 259.577" style="fill: rgb(21, 35, 76);"/>
</svg>