export let geonamesIdsDistances = {
 "4034749|4034749": 0,
 "4034749|49518": 16466,
 "4034749|203312": 17046,
 "4034749|2361809": 19605,
 "4034749|2363686": 19401,
 "4034749|2960313": 16069,
 "4034749|2233387": 18663,
 "4034749|2802361": 16005,
 "4034749|2395170": 19067,
 "4034749|935317": 12977,
 "4034749|1024031": 14395,
 "4034749|2245662": 18282,
 "4034749|239880": 17790,
 "4034749|2260494": 17813,
 "4034749|2134431": 1611,
 "4034749|2453866": 19315,
 "4034749|2287781": 18937,
 "4034749|3381670": 13901,
 "4034749|6251999": 10252,
 "4034749|3579143": 13254,
 "4034749|2993457": 16722,
 "4034749|3424932": 13580,
 "4034749|2400553": 18049,
 "4034749|1062947": 13887,
 "4034749|3175395": 16804,
 "4034749|2434508": 18226,
 "4034749|3017382": 16487,
 "4034749|2440476": 19284,
 "4034749|433561": 16376,
 "4034749|272103": 15990,
 "4034749|223816": 15625,
 "4034749|241170": 13759,
 "4034749|2658434": 16374,
 "4034749|3570311": 13284,
 "4034749|2139685": 1875,
 "4034749|921929": 14634,
 "4034749|2420477": 18693,
 "4034749|3723988": 12169,
 "4034749|4030656": 3093,
 "49518|4034749": 16466,
 "49518|49518": 0,
 "49518|203312": 932,
 "49518|2361809": 3818,
 "49518|2363686": 3432,
 "49518|2960313": 6195,
 "49518|2233387": 2205,
 "49518|2802361": 6321,
 "49518|2395170": 2849,
 "49518|935317": 3509,
 "49518|1024031": 2077,
 "49518|2245662": 5218,
 "49518|239880": 1376,
 "49518|2260494": 1575,
 "49518|2134431": 14940,
 "49518|2453866": 4305,
 "49518|2287781": 4074,
 "49518|3381670": 9259,
 "49518|6251999": 12859,
 "49518|3579143": 10234,
 "49518|2993457": 5558,
 "49518|3424932": 9890,
 "49518|2400553": 2037,
 "49518|1062947": 2636,
 "49518|3175395": 5182,
 "49518|2434508": 2293,
 "49518|3017382": 6012,
 "49518|2440476": 3234,
 "49518|433561": 160,
 "49518|272103": 4035,
 "49518|223816": 2081,
 "49518|241170": 2864,
 "49518|2658434": 5828,
 "49518|3570311": 10173,
 "49518|2139685": 14592,
 "49518|921929": 1838,
 "49518|2420477": 4582,
 "49518|3723988": 11372,
 "49518|4030656": 17857,
 "203312|4034749": 17046,
 "203312|49518": 932,
 "203312|203312": 0,
 "203312|2361809": 3154,
 "203312|2363686": 2718,
 "203312|2960313": 6183,
 "203312|2233387": 1645,
 "203312|2802361": 6295,
 "203312|2395170": 2134,
 "203312|935317": 4118,
 "203312|1024031": 2755,
 "203312|2245662": 4498,
 "203312|239880": 1189,
 "203312|2260494": 784,
 "203312|2134431": 15640,
 "203312|2453866": 3715,
 "203312|2287781": 3296,
 "203312|3381670": 8379,
 "203312|6251999": 12658,
 "203312|3579143": 9435,
 "203312|2993457": 5511,
 "203312|3424932": 9450,
 "203312|2400553": 1185,
 "203312|1062947": 3186,
 "203312|3175395": 5196,
 "203312|2434508": 2196,
 "203312|3017382": 5920,
 "203312|2440476": 2840,
 "203312|433561": 910,
 "203312|272103": 4472,
 "203312|223816": 2905,
 "203312|241170": 3746,
 "203312|2658434": 5817,
 "203312|3570311": 9361,
 "203312|2139685": 15218,
 "203312|921929": 2524,
 "203312|2420477": 3821,
 "203312|3723988": 10593,
 "203312|4030656": 17437,
 "2361809|4034749": 19605,
 "2361809|49518": 3818,
 "2361809|203312": 3154,
 "2361809|2361809": 0,
 "2361809|2363686": 480,
 "2361809|2960313": 4243,
 "2361809|2233387": 1620,
 "2361809|2802361": 4296,
 "2361809|2395170": 1027,
 "2361809|935317": 7264,
 "2361809|1024031": 5867,
 "2361809|2245662": 1419,
 "2361809|239880": 2548,
 "2361809|2260494": 2371,
 "2361809|2134431": 18754,
 "2361809|2453866": 650,
 "2361809|2287781": 682,
 "2361809|3381670": 5750,
 "2361809|6251999": 9785,
 "2361809|3579143": 6468,
 "2361809|2993457": 3612,
 "2361809|3424932": 6381,
 "2361809|2400553": 2056,
 "2361809|1062947": 6338,
 "2361809|3175395": 3574,
 "2361809|2434508": 2222,
 "2361809|3017382": 3801,
 "2361809|2440476": 1197,
 "2361809|433561": 3893,
 "2361809|272103": 4488,
 "2361809|223816": 4803,
 "2361809|241170": 6589,
 "2361809|2658434": 3959,
 "2361809|3570311": 6428,
 "2361809|2139685": 18371,
 "2361809|921929": 5630,
 "2361809|2420477": 925,
 "2361809|3723988": 7576,
 "2361809|4030656": 16536,
 "2363686|4034749": 19401,
 "2363686|49518": 3432,
 "2363686|203312": 2718,
 "2363686|2361809": 480,
 "2363686|2363686": 0,
 "2363686|2960313": 4614,
 "2363686|2233387": 1279,
 "2363686|2802361": 4676,
 "2363686|2395170": 588,
 "2363686|935317": 6836,
 "2363686|1024031": 5455,
 "2363686|2245662": 1790,
 "2363686|239880": 2231,
 "2363686|2260494": 1934,
 "2363686|2134431": 18357,
 "2363686|2453866": 1126,
 "2363686|2287781": 713,
 "2363686|3381670": 5990,
 "2363686|6251999": 10266,
 "2363686|3579143": 6812,
 "2363686|2993457": 3963,
 "2363686|3424932": 6856,
 "2363686|2400553": 1592,
 "2363686|1062947": 5904,
 "2363686|3175395": 3878,
 "2363686|2434508": 2092,
 "2363686|3017382": 4190,
 "2363686|2440476": 1273,
 "2363686|433561": 3495,
 "2363686|272103": 4555,
 "2363686|223816": 4587,
 "2363686|241170": 6248,
 "2363686|2658434": 4311,
 "2363686|3570311": 6760,
 "2363686|2139685": 17913,
 "2363686|921929": 5220,
 "2363686|2420477": 1166,
 "2363686|3723988": 7941,
 "2363686|4030656": 16667,
 "2960313|4034749": 16069,
 "2960313|49518": 6195,
 "2960313|203312": 6183,
 "2960313|2361809": 4243,
 "2960313|2363686": 4614,
 "2960313|2960313": 0,
 "2960313|2233387": 4762,
 "2960313|2802361": 141,
 "2960313|2395170": 4841,
 "2960313|935317": 9277,
 "2960313|1024031": 7950,
 "2960313|2245662": 4353,
 "2960313|239880": 5006,
 "2960313|2260494": 5649,
 "2960313|2134431": 15835,
 "2960313|2453866": 3703,
 "2960313|2287781": 4832,
 "2960313|3381670": 7524,
 "2960313|6251999": 6704,
 "2960313|3579143": 7049,
 "2960313|2993457": 684,
 "2960313|3424932": 4497,
 "2960313|2400553": 5661,
 "2960313|1062947": 8625,
 "2960313|3175395": 1015,
 "2960313|2434508": 3992,
 "2960313|3017382": 494,
 "2960313|2440476": 3591,
 "2960313|433561": 6348,
 "2960313|272103": 3008,
 "2960313|223816": 5385,
 "2960313|241170": 7696,
 "2960313|2658434": 368,
 "2960313|3570311": 7147,
 "2960313|2139685": 16351,
 "2960313|921929": 7746,
 "2960313|2420477": 4674,
 "2960313|3723988": 7597,
 "2960313|4030656": 15849,
 "2233387|4034749": 18663,
 "2233387|49518": 2205,
 "2233387|203312": 1645,
 "2233387|2361809": 1620,
 "2233387|2363686": 1279,
 "2233387|2960313": 4762,
 "2233387|2233387": 0,
 "2233387|2802361": 4858,
 "2233387|2395170": 753,
 "2233387|935317": 5687,
 "2233387|1024031": 4270,
 "2233387|2245662": 3033,
 "2233387|239880": 953,
 "2233387|2260494": 930,
 "2233387|2134431": 17134,
 "2233387|2453866": 2108,
 "2233387|2287781": 1977,
 "2233387|3381670": 7260,
 "2233387|6251999": 11040,
 "2233387|3579143": 8079,
 "2233387|2993457": 4078,
 "2233387|3424932": 7807,
 "2233387|2400553": 914,
 "2233387|1062947": 4778,
 "2233387|3175395": 3842,
 "2233387|2434508": 1138,
 "2233387|3017382": 4435,
 "2233387|2440476": 1231,
 "2233387|433561": 2289,
 "2233387|272103": 3813,
 "2233387|223816": 3355,
 "2233387|241170": 4977,
 "2233387|2658434": 4410,
 "2233387|3570311": 8032,
 "2233387|2139685": 16795,
 "2233387|921929": 4032,
 "2233387|2420477": 2444,
 "2233387|3723988": 9194,
 "2233387|4030656": 17755,
 "2802361|4034749": 16005,
 "2802361|49518": 6321,
 "2802361|203312": 6295,
 "2802361|2361809": 4296,
 "2802361|2363686": 4676,
 "2802361|2960313": 141,
 "2802361|2233387": 4858,
 "2802361|2802361": 0,
 "2802361|2395170": 4919,
 "2802361|935317": 9416,
 "2802361|1024031": 8085,
 "2802361|2245662": 4358,
 "2802361|239880": 5122,
 "2802361|2260494": 5751,
 "2802361|2134431": 15827,
 "2802361|2453866": 3743,
 "2802361|2287781": 4873,
 "2802361|3381670": 7445,
 "2802361|6251999": 6572,
 "2802361|3579143": 6941,
 "2802361|2993457": 786,
 "2802361|3424932": 4360,
 "2802361|2400553": 5753,
 "2802361|1062947": 8760,
 "2802361|3175395": 1145,
 "2802361|2434508": 4108,
 "2802361|3017382": 505,
 "2802361|2440476": 3677,
 "2802361|433561": 6473,
 "2802361|272103": 3147,
 "2802361|223816": 5525,
 "2802361|241170": 7837,
 "2802361|2658434": 495,
 "2802361|3570311": 7042,
 "2802361|2139685": 16357,
 "2802361|921929": 7881,
 "2802361|2420477": 4700,
 "2802361|3723988": 7475,
 "2802361|4030656": 15714,
 "2395170|4034749": 19067,
 "2395170|49518": 2849,
 "2395170|203312": 2134,
 "2395170|2361809": 1027,
 "2395170|2363686": 588,
 "2395170|2960313": 4841,
 "2395170|2233387": 753,
 "2395170|2802361": 4919,
 "2395170|2395170": 0,
 "2395170|935317": 6250,
 "2395170|1024031": 4867,
 "2395170|2245662": 2377,
 "2395170|239880": 1694,
 "2395170|2260494": 1349,
 "2395170|2134431": 17770,
 "2395170|2453866": 1632,
 "2395170|2287781": 1242,
 "2395170|3381670": 6518,
 "2395170|6251999": 10761,
 "2395170|3579143": 7389,
 "2395170|2993457": 4168,
 "2395170|3424932": 7395,
 "2395170|2400553": 1037,
 "2395170|1062947": 5320,
 "2395170|3175395": 4016,
 "2395170|2434508": 1755,
 "2395170|3017382": 4454,
 "2395170|2440476": 1283,
 "2395170|433561": 2909,
 "2395170|272103": 4368,
 "2395170|223816": 4107,
 "2395170|241170": 5677,
 "2395170|2658434": 4514,
 "2395170|3570311": 7333,
 "2395170|2139685": 17344,
 "2395170|921929": 4632,
 "2395170|2420477": 1736,
 "2395170|3723988": 8523,
 "2395170|4030656": 17051,
 "935317|4034749": 12977,
 "935317|49518": 3509,
 "935317|203312": 4118,
 "935317|2361809": 7264,
 "935317|2363686": 6836,
 "935317|2960313": 9277,
 "935317|2233387": 5687,
 "935317|2802361": 9416,
 "935317|2395170": 6250,
 "935317|935317": 0,
 "935317|1024031": 1438,
 "935317|2245662": 8614,
 "935317|239880": 4881,
 "935317|2260494": 4902,
 "935317|2134431": 11522,
 "935317|2453866": 7794,
 "935317|2287781": 7397,
 "935317|3381670": 12117,
 "935317|6251999": 15866,
 "935317|3579143": 13426,
 "935317|2993457": 8731,
 "935317|3424932": 13364,
 "935317|2400553": 5278,
 "935317|1062947": 944,
 "935317|3175395": 8292,
 "935317|2434508": 5723,
 "935317|3017382": 9220,
 "935317|2440476": 6738,
 "935317|433561": 3405,
 "935317|272103": 6467,
 "935317|223816": 3932,
 "935317|241170": 1830,
 "935317|2658434": 8931,
 "935317|3570311": 13323,
 "935317|2139685": 11116,
 "935317|921929": 1675,
 "935317|2420477": 7925,
 "935317|3723988": 14604,
 "935317|4030656": 14937,
 "1024031|4034749": 14395,
 "1024031|49518": 2077,
 "1024031|203312": 2755,
 "1024031|2361809": 5867,
 "1024031|2363686": 5455,
 "1024031|2960313": 7950,
 "1024031|2233387": 4270,
 "1024031|2802361": 8085,
 "1024031|2395170": 4867,
 "1024031|935317": 1438,
 "1024031|1024031": 0,
 "1024031|2245662": 7243,
 "1024031|239880": 3445,
 "1024031|2260494": 3529,
 "1024031|2134431": 12903,
 "1024031|2453866": 6377,
 "1024031|2287781": 6051,
 "1024031|3381670": 11018,
 "1024031|6251999": 14637,
 "1024031|3579143": 12177,
 "1024031|2993457": 7371,
 "1024031|3424932": 11930,
 "1024031|2400553": 3937,
 "1024031|1062947": 686,
 "1024031|3175395": 6947,
 "1024031|2434508": 4289,
 "1024031|3017382": 7853,
 "1024031|2440476": 5301,
 "1024031|433561": 1982,
 "1024031|272103": 5291,
 "1024031|223816": 2760,
 "1024031|241170": 1453,
 "1024031|2658434": 7594,
 "1024031|3570311": 12094,
 "1024031|2139685": 12525,
 "1024031|921929": 239,
 "1024031|2420477": 6575,
 "1024031|3723988": 13342,
 "1024031|4030656": 16288,
 "2245662|4034749": 18282,
 "2245662|49518": 5218,
 "2245662|203312": 4498,
 "2245662|2361809": 1419,
 "2245662|2363686": 1790,
 "2245662|2960313": 4353,
 "2245662|2233387": 3033,
 "2245662|2802361": 4358,
 "2245662|2395170": 2377,
 "2245662|935317": 8614,
 "2245662|1024031": 7243,
 "2245662|2245662": 0,
 "2245662|239880": 3967,
 "2245662|2260494": 3717,
 "2245662|2134431": 19863,
 "2245662|2453866": 1170,
 "2245662|2287781": 1243,
 "2245662|3381670": 4402,
 "2245662|6251999": 8802,
 "2245662|3579143": 5050,
 "2245662|2993457": 3863,
 "2245662|3424932": 5290,
 "2245662|2400553": 3339,
 "2245662|1062947": 7676,
 "2245662|3175395": 4005,
 "2245662|2434508": 3568,
 "2245662|3017382": 3861,
 "2245662|2440476": 2435,
 "2245662|433561": 5285,
 "2245662|272103": 5483,
 "2245662|223816": 6177,
 "2245662|241170": 8008,
 "2245662|2658434": 4171,
 "2245662|3570311": 5010,
 "2245662|2139685": 19330,
 "2245662|921929": 7008,
 "2245662|2420477": 724,
 "2245662|3723988": 6161,
 "2245662|4030656": 15222,
 "239880|4034749": 17790,
 "239880|49518": 1376,
 "239880|203312": 1189,
 "239880|2361809": 2548,
 "239880|2363686": 2231,
 "239880|2960313": 5006,
 "239880|2233387": 953,
 "239880|2802361": 5122,
 "239880|2395170": 1694,
 "239880|935317": 4881,
 "239880|1024031": 3445,
 "239880|2245662": 3967,
 "239880|239880": 0,
 "239880|2260494": 950,
 "239880|2134431": 16209,
 "239880|2453866": 2972,
 "239880|2287781": 2928,
 "239880|3381670": 8211,
 "239880|6251999": 11567,
 "239880|3579143": 9017,
 "239880|2993457": 4340,
 "239880|3424932": 8516,
 "239880|2400553": 1325,
 "239880|1062947": 4011,
 "239880|3175395": 4013,
 "239880|2434508": 1014,
 "239880|3017382": 4764,
 "239880|2440476": 1858,
 "239880|433561": 1494,
 "239880|272103": 3401,
 "239880|223816": 2448,
 "239880|241170": 4041,
 "239880|2658434": 4639,
 "239880|3570311": 8974,
 "239880|2139685": 15919,
 "239880|921929": 3207,
 "239880|2420477": 3395,
 "239880|3723988": 10120,
 "239880|4030656": 18425,
 "2260494|4034749": 17813,
 "2260494|49518": 1575,
 "2260494|203312": 784,
 "2260494|2361809": 2371,
 "2260494|2363686": 1934,
 "2260494|2960313": 5649,
 "2260494|2233387": 930,
 "2260494|2802361": 5751,
 "2260494|2395170": 1349,
 "2260494|935317": 4902,
 "2260494|1024031": 3529,
 "2260494|2245662": 3717,
 "2260494|239880": 950,
 "2260494|2260494": 0,
 "2260494|2134431": 16424,
 "2260494|2453866": 2942,
 "2260494|2287781": 2526,
 "2260494|3381670": 7686,
 "2260494|6251999": 11966,
 "2260494|3579143": 8681,
 "2260494|2993457": 4967,
 "2260494|3424932": 8694,
 "2260494|2400553": 474,
 "2260494|1062947": 3971,
 "2260494|3175395": 4699,
 "2260494|2434508": 1775,
 "2260494|3017382": 5342,
 "2260494|2440476": 2160,
 "2260494|433561": 1607,
 "2260494|272103": 4334,
 "2260494|223816": 3249,
 "2260494|241170": 4439,
 "2260494|2658434": 5291,
 "2260494|3570311": 8613,
 "2260494|2139685": 16001,
 "2260494|921929": 3296,
 "2260494|2420477": 3046,
 "2260494|3723988": 9831,
 "2260494|4030656": 17475,
 "2134431|4034749": 1611,
 "2134431|49518": 14940,
 "2134431|203312": 15640,
 "2134431|2361809": 18754,
 "2134431|2363686": 18357,
 "2134431|2960313": 15835,
 "2134431|2233387": 17134,
 "2134431|2802361": 15827,
 "2134431|2395170": 17770,
 "2134431|935317": 11522,
 "2134431|1024031": 12903,
 "2134431|2245662": 19863,
 "2134431|239880": 16209,
 "2134431|2260494": 16424,
 "2134431|2134431": 0,
 "2134431|2453866": 19047,
 "2134431|2287781": 18848,
 "2134431|3381670": 15473,
 "2134431|6251999": 11236,
 "2134431|3579143": 14858,
 "2134431|2993457": 16338,
 "2134431|3424932": 14735,
 "2134431|2400553": 16787,
 "2134431|1062947": 12456,
 "2134431|3175395": 16205,
 "2134431|2434508": 16636,
 "2134431|3017382": 16326,
 "2134431|2440476": 17776,
 "2134431|433561": 14870,
 "2134431|272103": 14741,
 "2134431|223816": 14025,
 "2134431|241170": 12168,
 "2134431|2658434": 16026,
 "2134431|3570311": 14893,
 "2134431|2139685": 632,
 "2134431|921929": 13139,
 "2134431|2420477": 19338,
 "2134431|3723988": 13756,
 "2134431|4030656": 4655,
 "2453866|4034749": 19315,
 "2453866|49518": 4305,
 "2453866|203312": 3715,
 "2453866|2361809": 650,
 "2453866|2363686": 1126,
 "2453866|2960313": 3703,
 "2453866|2233387": 2108,
 "2453866|2802361": 3743,
 "2453866|2395170": 1632,
 "2453866|935317": 7794,
 "2453866|1024031": 6377,
 "2453866|2245662": 1170,
 "2453866|239880": 2972,
 "2453866|2260494": 2942,
 "2453866|2134431": 19047,
 "2453866|2453866": 0,
 "2453866|2287781": 1131,
 "2453866|3381670": 5565,
 "2453866|6251999": 9144,
 "2453866|3579143": 6109,
 "2453866|2993457": 3104,
 "2453866|3424932": 5765,
 "2453866|2400553": 2668,
 "2453866|1062947": 6882,
 "2453866|3175395": 3131,
 "2453866|2434508": 2437,
 "2453866|3017382": 3241,
 "2453866|2440476": 1282,
 "2453866|433561": 4395,
 "2453866|272103": 4355,
 "2453866|223816": 5047,
 "2453866|241170": 6988,
 "2453866|2658434": 3444,
 "2453866|3570311": 6087,
 "2453866|2139685": 18891,
 "2453866|921929": 6138,
 "2453866|2420477": 1050,
 "2453866|3723988": 7174,
 "2453866|4030656": 16378,
 "2287781|4034749": 18937,
 "2287781|49518": 4074,
 "2287781|203312": 3296,
 "2287781|2361809": 682,
 "2287781|2363686": 713,
 "2287781|2960313": 4832,
 "2287781|2233387": 1977,
 "2287781|2802361": 4873,
 "2287781|2395170": 1242,
 "2287781|935317": 7397,
 "2287781|1024031": 6051,
 "2287781|2245662": 1243,
 "2287781|239880": 2928,
 "2287781|2260494": 2526,
 "2287781|2134431": 18848,
 "2287781|2453866": 1131,
 "2287781|2287781": 0,
 "2287781|3381670": 5284,
 "2287781|6251999": 9987,
 "2287781|3579143": 6161,
 "2287781|2993457": 4224,
 "2287781|3424932": 6501,
 "2287781|2400553": 2120,
 "2287781|1062947": 6456,
 "2287781|3175395": 4219,
 "2287781|2434508": 2789,
 "2287781|3017382": 4372,
 "2287781|2440476": 1856,
 "2287781|433561": 4124,
 "2287781|272103": 5158,
 "2287781|223816": 5299,
 "2287781|241170": 6916,
 "2287781|2658434": 4567,
 "2287781|3570311": 6100,
 "2287781|2139685": 18277,
 "2287781|921929": 5820,
 "2287781|2420477": 529,
 "2287781|3723988": 7306,
 "2287781|4030656": 15966,
 "3381670|4034749": 13901,
 "3381670|49518": 9259,
 "3381670|203312": 8379,
 "3381670|2361809": 5750,
 "3381670|2363686": 5990,
 "3381670|2960313": 7524,
 "3381670|2233387": 7260,
 "3381670|2802361": 7445,
 "3381670|2395170": 6518,
 "3381670|935317": 12117,
 "3381670|1024031": 11018,
 "3381670|2245662": 4402,
 "3381670|239880": 8211,
 "3381670|2260494": 7686,
 "3381670|2134431": 15473,
 "3381670|2453866": 5565,
 "3381670|2287781": 5284,
 "3381670|3381670": 0,
 "3381670|6251999": 7467,
 "3381670|3579143": 1654,
 "3381670|2993457": 7384,
 "3381670|3424932": 4793,
 "3381670|2400553": 7223,
 "3381670|1062947": 11215,
 "3381670|3175395": 7730,
 "3381670|2434508": 7959,
 "3381670|3017382": 7100,
 "3381670|2440476": 6837,
 "3381670|433561": 9276,
 "3381670|272103": 9684,
 "3381670|223816": 10553,
 "3381670|241170": 12120,
 "3381670|2658434": 7553,
 "3381670|3570311": 1474,
 "3381670|2139685": 15446,
 "3381670|921929": 10813,
 "3381670|2420477": 4843,
 "3381670|3723988": 2673,
 "3381670|4030656": 10820,
 "6251999|4034749": 10252,
 "6251999|49518": 12859,
 "6251999|203312": 12658,
 "6251999|2361809": 9785,
 "6251999|2363686": 10266,
 "6251999|2960313": 6704,
 "6251999|2233387": 11040,
 "6251999|2802361": 6572,
 "6251999|2395170": 10761,
 "6251999|935317": 15866,
 "6251999|1024031": 14637,
 "6251999|2245662": 8802,
 "6251999|239880": 11567,
 "6251999|2260494": 11966,
 "6251999|2134431": 11236,
 "6251999|2453866": 9144,
 "6251999|2287781": 9987,
 "6251999|3381670": 7467,
 "6251999|6251999": 0,
 "6251999|3579143": 5818,
 "6251999|2993457": 7314,
 "6251999|3424932": 3530,
 "6251999|2400553": 11785,
 "6251999|1062947": 15320,
 "6251999|3175395": 7716,
 "6251999|2434508": 10580,
 "6251999|3017382": 6850,
 "6251999|2440476": 9821,
 "6251999|433561": 13006,
 "6251999|272103": 9403,
 "6251999|223816": 11946,
 "6251999|241170": 14092,
 "6251999|2658434": 7066,
 "6251999|3570311": 6003,
 "6251999|2139685": 11822,
 "6251999|921929": 14442,
 "6251999|2420477": 9512,
 "6251999|3723988": 5016,
 "6251999|4030656": 9153,
 "3579143|4034749": 13254,
 "3579143|49518": 10234,
 "3579143|203312": 9435,
 "3579143|2361809": 6468,
 "3579143|2363686": 6812,
 "3579143|2960313": 7049,
 "3579143|2233387": 8079,
 "3579143|2802361": 6941,
 "3579143|2395170": 7389,
 "3579143|935317": 13426,
 "3579143|1024031": 12177,
 "3579143|2245662": 5050,
 "3579143|239880": 9017,
 "3579143|2260494": 8681,
 "3579143|2134431": 14858,
 "3579143|2453866": 6109,
 "3579143|2287781": 6161,
 "3579143|3381670": 1654,
 "3579143|6251999": 5818,
 "3579143|3579143": 0,
 "3579143|2993457": 7097,
 "3579143|3424932": 3444,
 "3579143|2400553": 8250,
 "3579143|1062947": 12490,
 "3579143|3175395": 7517,
 "3579143|2434508": 8536,
 "3579143|3017382": 6712,
 "3579143|2440476": 7374,
 "3579143|433561": 10284,
 "3579143|272103": 9682,
 "3579143|223816": 11126,
 "3579143|241170": 13056,
 "3579143|2658434": 7177,
 "3579143|3570311": 189,
 "3579143|2139685": 15055,
 "3579143|921929": 11953,
 "3579143|2420477": 5654,
 "3579143|3723988": 1178,
 "3579143|4030656": 10346,
 "2993457|4034749": 16722,
 "2993457|49518": 5558,
 "2993457|203312": 5511,
 "2993457|2361809": 3612,
 "2993457|2363686": 3963,
 "2993457|2960313": 684,
 "2993457|2233387": 4078,
 "2993457|2802361": 786,
 "2993457|2395170": 4168,
 "2993457|935317": 8731,
 "2993457|1024031": 7371,
 "2993457|2245662": 3863,
 "2993457|239880": 4340,
 "2993457|2260494": 4967,
 "2993457|2134431": 16338,
 "2993457|2453866": 3104,
 "2993457|2287781": 4224,
 "2993457|3381670": 7384,
 "2993457|6251999": 7314,
 "2993457|3579143": 7097,
 "2993457|2993457": 0,
 "2993457|3424932": 4864,
 "2993457|2400553": 4977,
 "2993457|1062947": 8039,
 "2993457|3175395": 469,
 "2993457|2434508": 3327,
 "2993457|3017382": 495,
 "2993457|2440476": 2910,
 "2993457|433561": 5709,
 "2993457|272103": 2685,
 "2993457|223816": 4895,
 "2993457|241170": 7222,
 "2993457|2658434": 349,
 "2993457|3570311": 7175,
 "2993457|2139685": 16797,
 "2993457|921929": 7160,
 "2993457|2420477": 4111,
 "2993457|3723988": 7762,
 "2993457|4030656": 16418,
 "3424932|4034749": 13580,
 "3424932|49518": 9890,
 "3424932|203312": 9450,
 "3424932|2361809": 6381,
 "3424932|2363686": 6856,
 "3424932|2960313": 4497,
 "3424932|2233387": 7807,
 "3424932|2802361": 4360,
 "3424932|2395170": 7395,
 "3424932|935317": 13364,
 "3424932|1024031": 11930,
 "3424932|2245662": 5290,
 "3424932|239880": 8516,
 "3424932|2260494": 8694,
 "3424932|2134431": 14735,
 "3424932|2453866": 5765,
 "3424932|2287781": 6501,
 "3424932|3381670": 4793,
 "3424932|6251999": 3530,
 "3424932|3579143": 3444,
 "3424932|2993457": 4864,
 "3424932|3424932": 0,
 "3424932|2400553": 8432,
 "3424932|1062947": 12526,
 "3424932|3175395": 5332,
 "3424932|2434508": 7641,
 "3424932|3017382": 4375,
 "3424932|2440476": 6664,
 "3424932|433561": 10010,
 "3424932|272103": 7500,
 "3424932|223816": 9728,
 "3424932|241170": 12050,
 "3424932|2658434": 4770,
 "3424932|3570311": 3617,
 "3424932|2139685": 15294,
 "3424932|921929": 11697,
 "3424932|2420477": 6008,
 "3424932|3723988": 3433,
 "3424932|4030656": 11679,
 "2400553|4034749": 18049,
 "2400553|49518": 2037,
 "2400553|203312": 1185,
 "2400553|2361809": 2056,
 "2400553|2363686": 1592,
 "2400553|2960313": 5661,
 "2400553|2233387": 914,
 "2400553|2802361": 5753,
 "2400553|2395170": 1037,
 "2400553|935317": 5278,
 "2400553|1024031": 3937,
 "2400553|2245662": 3339,
 "2400553|239880": 1325,
 "2400553|2260494": 474,
 "2400553|2134431": 16787,
 "2400553|2453866": 2668,
 "2400553|2287781": 2120,
 "2400553|3381670": 7223,
 "2400553|6251999": 11785,
 "2400553|3579143": 8250,
 "2400553|2993457": 4977,
 "2400553|3424932": 8432,
 "2400553|2400553": 0,
 "2400553|1062947": 4338,
 "2400553|3175395": 4753,
 "2400553|2434508": 1973,
 "2400553|3017382": 5317,
 "2400553|2440476": 2086,
 "2400553|433561": 2057,
 "2400553|272103": 4618,
 "2400553|223816": 3704,
 "2400553|241170": 4899,
 "2400553|2658434": 5313,
 "2400553|3570311": 8176,
 "2400553|2139685": 16321,
 "2400553|921929": 3708,
 "2400553|2420477": 2647,
 "2400553|3723988": 9408,
 "2400553|4030656": 17116,
 "1062947|4034749": 13887,
 "1062947|49518": 2636,
 "1062947|203312": 3186,
 "1062947|2361809": 6338,
 "1062947|2363686": 5904,
 "1062947|2960313": 8625,
 "1062947|2233387": 4778,
 "1062947|2802361": 8760,
 "1062947|2395170": 5320,
 "1062947|935317": 944,
 "1062947|1024031": 686,
 "1062947|2245662": 7676,
 "1062947|239880": 4011,
 "1062947|2260494": 3971,
 "1062947|2134431": 12456,
 "1062947|2453866": 6882,
 "1062947|2287781": 6456,
 "1062947|3381670": 11215,
 "1062947|6251999": 15320,
 "1062947|3579143": 12490,
 "1062947|2993457": 8039,
 "1062947|3424932": 12526,
 "1062947|2400553": 4338,
 "1062947|1062947": 0,
 "1062947|3175395": 7619,
 "1062947|2434508": 4902,
 "1062947|3017382": 8517,
 "1062947|2440476": 5867,
 "1062947|433561": 2519,
 "1062947|272103": 5975,
 "1062947|223816": 3439,
 "1062947|241170": 1827,
 "1062947|2658434": 8268,
 "1062947|3570311": 12390,
 "1062947|2139685": 12037,
 "1062947|921929": 879,
 "1062947|2420477": 6984,
 "1062947|3723988": 13667,
 "1062947|4030656": 15611,
 "3175395|4034749": 16804,
 "3175395|49518": 5182,
 "3175395|203312": 5196,
 "3175395|2361809": 3574,
 "3175395|2363686": 3878,
 "3175395|2960313": 1015,
 "3175395|2233387": 3842,
 "3175395|2802361": 1145,
 "3175395|2395170": 4016,
 "3175395|935317": 8292,
 "3175395|1024031": 6947,
 "3175395|2245662": 4005,
 "3175395|239880": 4013,
 "3175395|2260494": 4699,
 "3175395|2134431": 16205,
 "3175395|2453866": 3131,
 "3175395|2287781": 4219,
 "3175395|3381670": 7730,
 "3175395|6251999": 7716,
 "3175395|3579143": 7517,
 "3175395|2993457": 469,
 "3175395|3424932": 5332,
 "3175395|2400553": 4753,
 "3175395|1062947": 7619,
 "3175395|3175395": 0,
 "3175395|2434508": 3001,
 "3175395|3017382": 959,
 "3175395|2440476": 2735,
 "3175395|433561": 5335,
 "3175395|272103": 2225,
 "3175395|223816": 4436,
 "3175395|241170": 6762,
 "3175395|2658434": 650,
 "3175395|3570311": 7588,
 "3175395|2139685": 16605,
 "3175395|921929": 6740,
 "3175395|2420477": 4168,
 "3175395|3723988": 8210,
 "3175395|4030656": 16850,
 "2434508|4034749": 18226,
 "2434508|49518": 2293,
 "2434508|203312": 2196,
 "2434508|2361809": 2222,
 "2434508|2363686": 2092,
 "2434508|2960313": 3992,
 "2434508|2233387": 1138,
 "2434508|2802361": 4108,
 "2434508|2395170": 1755,
 "2434508|935317": 5723,
 "2434508|1024031": 4289,
 "2434508|2245662": 3568,
 "2434508|239880": 1014,
 "2434508|2260494": 1775,
 "2434508|2134431": 16636,
 "2434508|2453866": 2437,
 "2434508|2287781": 2789,
 "2434508|3381670": 7959,
 "2434508|6251999": 10580,
 "2434508|3579143": 8536,
 "2434508|2993457": 3327,
 "2434508|3424932": 7641,
 "2434508|2400553": 1973,
 "2434508|1062947": 4902,
 "2434508|3175395": 3001,
 "2434508|2434508": 0,
 "2434508|3017382": 3756,
 "2434508|2440476": 1162,
 "2434508|433561": 2432,
 "2434508|272103": 2675,
 "2434508|223816": 2612,
 "2434508|241170": 4632,
 "2434508|2658434": 3626,
 "2434508|3570311": 8520,
 "2434508|2139685": 16494,
 "2434508|921929": 4057,
 "2434508|2420477": 3146,
 "2434508|3723988": 9572,
 "2434508|4030656": 18754,
 "3017382|4034749": 16487,
 "3017382|49518": 6012,
 "3017382|203312": 5920,
 "3017382|2361809": 3801,
 "3017382|2363686": 4190,
 "3017382|2960313": 494,
 "3017382|2233387": 4435,
 "3017382|2802361": 505,
 "3017382|2395170": 4454,
 "3017382|935317": 9220,
 "3017382|1024031": 7853,
 "3017382|2245662": 3861,
 "3017382|239880": 4764,
 "3017382|2260494": 5342,
 "3017382|2134431": 16326,
 "3017382|2453866": 3241,
 "3017382|2287781": 4372,
 "3017382|3381670": 7100,
 "3017382|6251999": 6850,
 "3017382|3579143": 6712,
 "3017382|2993457": 495,
 "3017382|3424932": 4375,
 "3017382|2400553": 5317,
 "3017382|1062947": 8517,
 "3017382|3175395": 959,
 "3017382|2434508": 3756,
 "3017382|3017382": 0,
 "3017382|2440476": 3233,
 "3017382|433561": 6160,
 "3017382|272103": 3151,
 "3017382|223816": 5390,
 "3017382|241170": 7718,
 "3017382|2658434": 465,
 "3017382|3570311": 6799,
 "3017382|2139685": 16845,
 "3017382|921929": 7640,
 "3017382|2420477": 4196,
 "3017382|3723988": 7329,
 "3017382|4030656": 15929,
 "2440476|4034749": 19284,
 "2440476|49518": 3234,
 "2440476|203312": 2840,
 "2440476|2361809": 1197,
 "2440476|2363686": 1273,
 "2440476|2960313": 3591,
 "2440476|2233387": 1231,
 "2440476|2802361": 3677,
 "2440476|2395170": 1283,
 "2440476|935317": 6738,
 "2440476|1024031": 5301,
 "2440476|2245662": 2435,
 "2440476|239880": 1858,
 "2440476|2260494": 2160,
 "2440476|2134431": 17776,
 "2440476|2453866": 1282,
 "2440476|2287781": 1856,
 "2440476|3381670": 6837,
 "2440476|6251999": 9821,
 "2440476|3579143": 7374,
 "2440476|2993457": 2910,
 "2440476|3424932": 6664,
 "2440476|2400553": 2086,
 "2440476|1062947": 5867,
 "2440476|3175395": 2735,
 "2440476|2434508": 1162,
 "2440476|3017382": 3233,
 "2440476|2440476": 0,
 "2440476|433561": 3348,
 "2440476|272103": 3305,
 "2440476|223816": 3766,
 "2440476|241170": 5770,
 "2440476|2658434": 3253,
 "2440476|3570311": 7359,
 "2440476|2139685": 17656,
 "2440476|921929": 5063,
 "2440476|2420477": 2102,
 "2440476|3723988": 8415,
 "2440476|4030656": 17656,
 "433561|4034749": 16376,
 "433561|49518": 160,
 "433561|203312": 910,
 "433561|2361809": 3893,
 "433561|2363686": 3495,
 "433561|2960313": 6348,
 "433561|2233387": 2289,
 "433561|2802361": 6473,
 "433561|2395170": 2909,
 "433561|935317": 3405,
 "433561|1024031": 1982,
 "433561|2245662": 5285,
 "433561|239880": 1494,
 "433561|2260494": 1607,
 "433561|2134431": 14870,
 "433561|2453866": 4395,
 "433561|2287781": 4124,
 "433561|3381670": 9276,
 "433561|6251999": 13006,
 "433561|3579143": 10284,
 "433561|2993457": 5709,
 "433561|3424932": 10010,
 "433561|2400553": 2057,
 "433561|1062947": 2519,
 "433561|3175395": 5335,
 "433561|2434508": 2432,
 "433561|3017382": 6160,
 "433561|2440476": 3348,
 "433561|433561": 0,
 "433561|272103": 4192,
 "433561|223816": 2198,
 "433561|241170": 2844,
 "433561|2658434": 5981,
 "433561|3570311": 10218,
 "433561|2139685": 14506,
 "433561|921929": 1743,
 "433561|2420477": 4637,
 "433561|3723988": 11428,
 "433561|4030656": 17698,
 "272103|4034749": 15990,
 "272103|49518": 4035,
 "272103|203312": 4472,
 "272103|2361809": 4488,
 "272103|2363686": 4555,
 "272103|2960313": 3008,
 "272103|2233387": 3813,
 "272103|2802361": 3147,
 "272103|2395170": 4368,
 "272103|935317": 6467,
 "272103|1024031": 5291,
 "272103|2245662": 5483,
 "272103|239880": 3401,
 "272103|2260494": 4334,
 "272103|2134431": 14741,
 "272103|2453866": 4355,
 "272103|2287781": 5158,
 "272103|3381670": 9684,
 "272103|6251999": 9403,
 "272103|3579143": 9682,
 "272103|2993457": 2685,
 "272103|3424932": 7500,
 "272103|2400553": 4618,
 "272103|1062947": 5975,
 "272103|3175395": 2225,
 "272103|2434508": 2675,
 "272103|3017382": 3151,
 "272103|2440476": 3305,
 "272103|433561": 4192,
 "272103|272103": 0,
 "272103|223816": 2547,
 "272103|241170": 4762,
 "272103|2658434": 2732,
 "272103|3570311": 9738,
 "272103|2139685": 14923,
 "272103|921929": 5128,
 "272103|2420477": 5347,
 "272103|3723988": 10427,
 "272103|4030656": 18167,
 "223816|4034749": 15625,
 "223816|49518": 2081,
 "223816|203312": 2905,
 "223816|2361809": 4803,
 "223816|2363686": 4587,
 "223816|2960313": 5385,
 "223816|2233387": 3355,
 "223816|2802361": 5525,
 "223816|2395170": 4107,
 "223816|935317": 3932,
 "223816|1024031": 2760,
 "223816|2245662": 6177,
 "223816|239880": 2448,
 "223816|2260494": 3249,
 "223816|2134431": 14025,
 "223816|2453866": 5047,
 "223816|2287781": 5299,
 "223816|3381670": 10553,
 "223816|6251999": 11946,
 "223816|3579143": 11126,
 "223816|2993457": 4895,
 "223816|3424932": 9728,
 "223816|2400553": 3704,
 "223816|1062947": 3439,
 "223816|3175395": 4436,
 "223816|2434508": 2612,
 "223816|3017382": 5390,
 "223816|2440476": 3766,
 "223816|433561": 2198,
 "223816|272103": 2547,
 "223816|223816": 0,
 "223816|241170": 2328,
 "223816|2658434": 5054,
 "223816|3570311": 11119,
 "223816|2139685": 13903,
 "223816|921929": 2615,
 "223816|2420477": 5713,
 "223816|3723988": 12118,
 "223816|4030656": 18597,
 "241170|4034749": 13759,
 "241170|49518": 2864,
 "241170|203312": 3746,
 "241170|2361809": 6589,
 "241170|2363686": 6248,
 "241170|2960313": 7696,
 "241170|2233387": 4977,
 "241170|2802361": 7837,
 "241170|2395170": 5677,
 "241170|935317": 1830,
 "241170|1024031": 1453,
 "241170|2245662": 8008,
 "241170|239880": 4041,
 "241170|2260494": 4439,
 "241170|2134431": 12168,
 "241170|2453866": 6988,
 "241170|2287781": 6916,
 "241170|3381670": 12120,
 "241170|6251999": 14092,
 "241170|3579143": 13056,
 "241170|2993457": 7222,
 "241170|3424932": 12050,
 "241170|2400553": 4899,
 "241170|1062947": 1827,
 "241170|3175395": 6762,
 "241170|2434508": 4632,
 "241170|3017382": 7718,
 "241170|2440476": 5770,
 "241170|433561": 2844,
 "241170|272103": 4762,
 "241170|223816": 2328,
 "241170|241170": 0,
 "241170|2658434": 7373,
 "241170|3570311": 13008,
 "241170|2139685": 11907,
 "241170|921929": 1548,
 "241170|2420477": 7411,
 "241170|3723988": 14158,
 "241170|4030656": 16344,
 "2658434|4034749": 16374,
 "2658434|49518": 5828,
 "2658434|203312": 5817,
 "2658434|2361809": 3959,
 "2658434|2363686": 4311,
 "2658434|2960313": 368,
 "2658434|2233387": 4410,
 "2658434|2802361": 495,
 "2658434|2395170": 4514,
 "2658434|935317": 8931,
 "2658434|1024031": 7594,
 "2658434|2245662": 4171,
 "2658434|239880": 4639,
 "2658434|2260494": 5291,
 "2658434|2134431": 16026,
 "2658434|2453866": 3444,
 "2658434|2287781": 4567,
 "2658434|3381670": 7553,
 "2658434|6251999": 7066,
 "2658434|3579143": 7177,
 "2658434|2993457": 349,
 "2658434|3424932": 4770,
 "2658434|2400553": 5313,
 "2658434|1062947": 8268,
 "2658434|3175395": 650,
 "2658434|2434508": 3626,
 "2658434|3017382": 465,
 "2658434|2440476": 3253,
 "2658434|433561": 5981,
 "2658434|272103": 2732,
 "2658434|223816": 5054,
 "2658434|241170": 7373,
 "2658434|2658434": 0,
 "2658434|3570311": 7264,
 "2658434|2139685": 16508,
 "2658434|921929": 7388,
 "2658434|2420477": 4442,
 "2658434|3723988": 7783,
 "2658434|4030656": 16205,
 "3570311|4034749": 13284,
 "3570311|49518": 10173,
 "3570311|203312": 9361,
 "3570311|2361809": 6428,
 "3570311|2363686": 6760,
 "3570311|2960313": 7147,
 "3570311|2233387": 8032,
 "3570311|2802361": 7042,
 "3570311|2395170": 7333,
 "3570311|935317": 13323,
 "3570311|1024031": 12094,
 "3570311|2245662": 5010,
 "3570311|239880": 8974,
 "3570311|2260494": 8613,
 "3570311|2134431": 14893,
 "3570311|2453866": 6087,
 "3570311|2287781": 6100,
 "3570311|3381670": 1474,
 "3570311|6251999": 6003,
 "3570311|3579143": 189,
 "3570311|2993457": 7175,
 "3570311|3424932": 3617,
 "3570311|2400553": 8176,
 "3570311|1062947": 12390,
 "3570311|3175395": 7588,
 "3570311|2434508": 8520,
 "3570311|3017382": 6799,
 "3570311|2440476": 7359,
 "3570311|433561": 10218,
 "3570311|272103": 9738,
 "3570311|223816": 11119,
 "3570311|241170": 13008,
 "3570311|2658434": 7264,
 "3570311|3570311": 0,
 "3570311|2139685": 15065,
 "3570311|921929": 11872,
 "3570311|2420477": 5598,
 "3570311|3723988": 1293,
 "3570311|4030656": 10346,
 "2139685|4034749": 1875,
 "2139685|49518": 14592,
 "2139685|203312": 15218,
 "2139685|2361809": 18371,
 "2139685|2363686": 17913,
 "2139685|2960313": 16351,
 "2139685|2233387": 16795,
 "2139685|2802361": 16357,
 "2139685|2395170": 17344,
 "2139685|935317": 11116,
 "2139685|1024031": 12525,
 "2139685|2245662": 19330,
 "2139685|239880": 15919,
 "2139685|2260494": 16001,
 "2139685|2134431": 632,
 "2139685|2453866": 18891,
 "2139685|2287781": 18277,
 "2139685|3381670": 15446,
 "2139685|6251999": 11822,
 "2139685|3579143": 15055,
 "2139685|2993457": 16797,
 "2139685|3424932": 15294,
 "2139685|2400553": 16321,
 "2139685|1062947": 12037,
 "2139685|3175395": 16605,
 "2139685|2434508": 16494,
 "2139685|3017382": 16845,
 "2139685|2440476": 17656,
 "2139685|433561": 14506,
 "2139685|272103": 14923,
 "2139685|223816": 13903,
 "2139685|241170": 11907,
 "2139685|2658434": 16508,
 "2139685|3570311": 15065,
 "2139685|2139685": 0,
 "2139685|921929": 12764,
 "2139685|2420477": 18724,
 "2139685|3723988": 14012,
 "2139685|4030656": 4726,
 "921929|4034749": 14634,
 "921929|49518": 1838,
 "921929|203312": 2524,
 "921929|2361809": 5630,
 "921929|2363686": 5220,
 "921929|2960313": 7746,
 "921929|2233387": 4032,
 "921929|2802361": 7881,
 "921929|2395170": 4632,
 "921929|935317": 1675,
 "921929|1024031": 239,
 "921929|2245662": 7008,
 "921929|239880": 3207,
 "921929|2260494": 3296,
 "921929|2134431": 13139,
 "921929|2453866": 6138,
 "921929|2287781": 5820,
 "921929|3381670": 10813,
 "921929|6251999": 14442,
 "921929|3579143": 11953,
 "921929|2993457": 7160,
 "921929|3424932": 11697,
 "921929|2400553": 3708,
 "921929|1062947": 879,
 "921929|3175395": 6740,
 "921929|2434508": 4057,
 "921929|3017382": 7640,
 "921929|2440476": 5063,
 "921929|433561": 1743,
 "921929|272103": 5128,
 "921929|223816": 2615,
 "921929|241170": 1548,
 "921929|2658434": 7388,
 "921929|3570311": 11872,
 "921929|2139685": 12764,
 "921929|921929": 0,
 "921929|2420477": 6342,
 "921929|3723988": 13115,
 "921929|4030656": 16490,
 "2420477|4034749": 18693,
 "2420477|49518": 4582,
 "2420477|203312": 3821,
 "2420477|2361809": 925,
 "2420477|2363686": 1166,
 "2420477|2960313": 4674,
 "2420477|2233387": 2444,
 "2420477|2802361": 4700,
 "2420477|2395170": 1736,
 "2420477|935317": 7925,
 "2420477|1024031": 6575,
 "2420477|2245662": 724,
 "2420477|239880": 3395,
 "2420477|2260494": 3046,
 "2420477|2134431": 19338,
 "2420477|2453866": 1050,
 "2420477|2287781": 529,
 "2420477|3381670": 4843,
 "2420477|6251999": 9512,
 "2420477|3579143": 5654,
 "2420477|2993457": 4111,
 "2420477|3424932": 6008,
 "2420477|2400553": 2647,
 "2420477|1062947": 6984,
 "2420477|3175395": 4168,
 "2420477|2434508": 3146,
 "2420477|3017382": 4196,
 "2420477|2440476": 2102,
 "2420477|433561": 4637,
 "2420477|272103": 5347,
 "2420477|223816": 5713,
 "2420477|241170": 7411,
 "2420477|2658434": 4442,
 "2420477|3570311": 5598,
 "2420477|2139685": 18724,
 "2420477|921929": 6342,
 "2420477|2420477": 0,
 "2420477|3723988": 6791,
 "2420477|4030656": 15612,
 "3723988|4034749": 12169,
 "3723988|49518": 11372,
 "3723988|203312": 10593,
 "3723988|2361809": 7576,
 "3723988|2363686": 7941,
 "3723988|2960313": 7597,
 "3723988|2233387": 9194,
 "3723988|2802361": 7475,
 "3723988|2395170": 8523,
 "3723988|935317": 14604,
 "3723988|1024031": 13342,
 "3723988|2245662": 6161,
 "3723988|239880": 10120,
 "3723988|2260494": 9831,
 "3723988|2134431": 13756,
 "3723988|2453866": 7174,
 "3723988|2287781": 7306,
 "3723988|3381670": 2673,
 "3723988|6251999": 5016,
 "3723988|3579143": 1178,
 "3723988|2993457": 7762,
 "3723988|3424932": 3433,
 "3723988|2400553": 9408,
 "3723988|1062947": 13667,
 "3723988|3175395": 8210,
 "3723988|2434508": 9572,
 "3723988|3017382": 7329,
 "3723988|2440476": 8415,
 "3723988|433561": 11428,
 "3723988|272103": 10427,
 "3723988|223816": 12118,
 "3723988|241170": 14158,
 "3723988|2658434": 7783,
 "3723988|3570311": 1293,
 "3723988|2139685": 14012,
 "3723988|921929": 13115,
 "3723988|2420477": 6791,
 "3723988|3723988": 0,
 "3723988|4030656": 9369,
 "4030656|4034749": 3093,
 "4030656|49518": 17857,
 "4030656|203312": 17437,
 "4030656|2361809": 16536,
 "4030656|2363686": 16667,
 "4030656|2960313": 15849,
 "4030656|2233387": 17755,
 "4030656|2802361": 15714,
 "4030656|2395170": 17051,
 "4030656|935317": 14937,
 "4030656|1024031": 16288,
 "4030656|2245662": 15222,
 "4030656|239880": 18425,
 "4030656|2260494": 17475,
 "4030656|2134431": 4655,
 "4030656|2453866": 16378,
 "4030656|2287781": 15966,
 "4030656|3381670": 10820,
 "4030656|6251999": 9153,
 "4030656|3579143": 10346,
 "4030656|2993457": 16418,
 "4030656|3424932": 11679,
 "4030656|2400553": 17116,
 "4030656|1062947": 15611,
 "4030656|3175395": 16850,
 "4030656|2434508": 18754,
 "4030656|3017382": 15929,
 "4030656|2440476": 17656,
 "4030656|433561": 17698,
 "4030656|272103": 18167,
 "4030656|223816": 18597,
 "4030656|241170": 16344,
 "4030656|2658434": 16205,
 "4030656|3570311": 10346,
 "4030656|2139685": 4726,
 "4030656|921929": 16490,
 "4030656|2420477": 15612,
 "4030656|3723988": 9369,
 "4030656|4030656": 0
}