{
  "EntityInterface": [
    "ExternalLink",
    "UserAccount",
    "Person",
    "AccessPolicy",
    "Tagging",
    "Concept",
    "Vocabulary",
    "Scheme",
    "Collection",
    "Comment",
    "EmailAccount",
    "Phone",
    "Address",
    "Geometry",
    "Affiliation",
    "Organization",
    "Recognizer",
    "JobStatus",
    "UserGroup",
    "Location",
    "Point",
    "GroupMembership",
    "Partnership"
  ],
  "ActionInterface": [
    "Creation",
    "Update",
    "Deletion"
  ],
  "AccessPolicyTargetInterface": [
    "UserAccount",
    "UserGroup"
  ],
  "PersonInterface": [
    "Person"
  ],
  "OnlineContributionInterface": [
    "Tagging",
    "Comment"
  ],
  "ConceptInterface": [
    "Concept"
  ],
  "SkosElementInterface": [
    "Vocabulary",
    "Scheme",
    "Collection"
  ],
  "InstantInterface": [
    "Tagging",
    "Comment"
  ],
  "TemporalEntityInterface": [
    "Tagging",
    "Comment",
    "Affiliation",
    "Recognizer"
  ],
  "AccessPriviledgeInterface": [
    "ReadPriviledge",
    "WritePriviledge"
  ],
  "AgentInterface": [
    "Person",
    "Organization"
  ],
  "SpatialEntityInterface": [
    "Address",
    "Location"
  ],
  "DurationInterface": [
    "Affiliation",
    "Recognizer"
  ],
  "OrganizationInterface": [
    "Organization"
  ],
  "GroupInterface": []
}