<?xml version="1.0" encoding="utf-8"?>
<svg viewBox="0 0 500 500" xmlns="http://www.w3.org/2000/svg" xmlns:bx="https://boxy-svg.com">
  <circle class="a" cx="248.523" cy="251.331" r="245.523" style="fill: rgb(37, 52, 64);"/>
  <g>
    <title>trait</title>
    <line style="fill: rgb(245, 141, 81); stroke: rgb(245, 141, 81);" x1="224.434" y1="84.536" x2="233.038" y2="100"/>
    <line style="fill: rgb(245, 141, 81); stroke: rgb(245, 141, 81);" x1="233.495" y1="100" x2="233.551" y2="310.686"/>
    <line style="fill: rgb(245, 141, 81); stroke: rgb(245, 141, 81);" x1="407.439" y1="393.08" x2="406.599" y2="317.456" transform="matrix(-1, 0, 0, -1, 814.037994, 710.53598)"/>
    <line style="fill: rgb(245, 141, 81); stroke: rgb(245, 141, 81);" x1="407.887" y1="393.329" x2="316.786" y2="392.575"/>
    <line style="fill: rgb(245, 141, 81); stroke: rgb(245, 141, 81);" x1="316.786" y1="392.149" x2="319.003" y2="383.949"/>
    <line style="fill: rgb(245, 141, 81); stroke: rgb(245, 141, 81);" x1="318.258" y1="391.792" x2="347.127" y2="386.349"/>
    <line style="fill: rgb(245, 141, 81); stroke: rgb(245, 141, 81);" x1="316.158" y1="392.103" x2="189.405" y2="392.371"/>
    <line style="fill: rgb(245, 141, 81); stroke: rgb(245, 141, 81);" x1="148.59" y1="377.483" x2="142.489" y2="352.649"/>
    <line style="fill: rgb(245, 141, 81); stroke: rgb(245, 141, 81);" x1="151.979" y1="376.82" x2="157.975" y2="329.457"/>
    <line style="fill: rgb(245, 141, 81); stroke: rgb(245, 141, 81);" x1="142.722" y1="344.069" x2="142.401" y2="306.211"/>
    <line style="stroke-width: 0.79349px; fill: rgb(245, 141, 81); stroke: rgb(245, 141, 81);" x1="161.669" y1="402.123" x2="170.154" y2="369.849" transform="matrix(0, 1, -1, 0, 551.897499, 220.074486)"/>
    <line style="stroke-width: 0.79349px; fill: rgb(245, 141, 81); stroke: rgb(245, 141, 81);" x1="184.81" y1="362.807" x2="212.695" y2="383.844" transform="matrix(0, 1, -1, 0, 572.078003, 174.572998)"/>
    <line style="stroke-width: 0.79349px; fill: rgb(245, 141, 81); stroke: rgb(245, 141, 81);" x1="198.551" y1="397.918" x2="195.798" y2="379.334" transform="matrix(0, 1, -1, 0, 585.800507, 191.451508)"/>
    <line style="stroke-width: 0.79349px; fill: rgb(245, 141, 81); stroke: rgb(245, 141, 81);" x1="227.967" y1="380.508" x2="202.938" y2="366.503" transform="matrix(0, 1, -1, 0, 588.957993, 158.052994)"/>
    <line style="stroke-width: 0.79349px; fill: rgb(245, 141, 81); stroke: rgb(245, 141, 81);" x1="216.381" y1="391.628" x2="213.326" y2="378.046" transform="matrix(0, 1, -1, 0, 599.690491, 169.98349)"/>
    <line style="stroke-width: 0.79349px; fill: rgb(245, 141, 81); stroke: rgb(245, 141, 81);" x1="189.735" y1="377.104" x2="176.761" y2="381.547" transform="matrix(0, 1, -1, 0, 562.573502, 196.077499)"/>
    <line style="fill: rgb(245, 141, 81); stroke: rgb(245, 141, 81);" x1="142.87" y1="300" x2="143.161" y2="283.724"/>
    <line style="fill: rgb(245, 141, 81); stroke: rgb(245, 141, 81);" x1="142.932" y1="279.212" x2="143.267" y2="241.914"/>
    <line style="fill: rgb(245, 141, 81); stroke: rgb(245, 141, 81);" x1="261.952" y1="392.1" x2="279.121" y2="384.625"/>
    <line style="fill: rgb(245, 141, 81); stroke: rgb(245, 141, 81);" x1="264.48" y1="391.723" x2="265.329" y2="361.365"/>
    <line style="fill: rgb(245, 141, 81); stroke: rgb(245, 141, 81);" x1="400" y1="384.068" x2="370.141" y2="355.305"/>
    <line style="fill: rgb(245, 141, 81); stroke: rgb(245, 141, 81);" x1="226.563" y1="252.843" x2="233.909" y2="233.961"/>
    <line style="fill: rgb(245, 141, 81); stroke: rgb(245, 141, 81);" x1="223.701" y1="140.083" x2="233.784" y2="159.472"/>
    <line style="fill: rgb(245, 141, 81); stroke: rgb(245, 141, 81);" x1="143.861" y1="84.882" x2="220.953" y2="83.669"/>
    <line style="fill: rgb(245, 141, 81); stroke: rgb(245, 141, 81);" x1="400" y1="308.3650756263445" x2="407.4937671368358" y2="319.5430038535544"/>
    <line style="fill: rgb(245, 141, 81); stroke: rgb(245, 141, 81);" x1="400" y1="385.6825195040318" x2="406.9258249547029" y2="393.1725282300562"/>
    <line style="stroke: rgb(245, 141, 81);" x1="-7.042" y1="340.86" x2="-10.63" y2="341.052"/>
    <line style="stroke: rgb(245, 141, 81);" x1="141.864" y1="236.839" x2="146.847" y2="215.771"/>
    <line style="stroke: rgb(245, 141, 81);" x1="147.204" y1="212.77" x2="146.037" y2="200"/>
    <line style="stroke: rgb(245, 141, 81);" x1="143.437" y1="187.948" x2="141.823" y2="85.587"/>
    <line style="stroke: rgb(245, 141, 81);" x1="142.245" y1="113.214" x2="167.482" y2="111.881"/>
    <line style="stroke: rgb(245, 141, 81);" x1="167.653" y1="111.966" x2="168.291" y2="146.504"/>
    <line style="stroke: rgb(245, 141, 81);" x1="169.269" y1="146.043" x2="190.113" y2="117.525"/>
    <line style="stroke: rgb(245, 141, 81);" x1="144.293" y1="163.975" x2="162.745" y2="150.284"/>
    <line style="stroke: rgb(245, 141, 81);" x1="142.423" y1="139.941" x2="166.235" y2="144.164"/>
    <line style="stroke: rgb(245, 141, 81);" x1="167.277" y1="145.769" x2="181.54" y2="161.8"/>
    <line style="stroke: rgb(245, 141, 81);" x1="192.375" y1="118.115" x2="191.591" y2="325.008"/>
    <line style="stroke: rgb(245, 141, 81);" x1="152.726" y1="248.365" x2="190.77" y2="213.7"/>
    <line style="stroke: rgb(245, 141, 81);" x1="147.841" y1="215.405" x2="189.367" y2="211.743"/>
    <line style="stroke: rgb(245, 141, 81);" x1="150.401" y1="200" x2="191.443" y2="207.873"/>
    <line style="stroke: rgb(245, 141, 81);" x1="219.169" y1="141.344" x2="200" y2="158.678"/>
    <line style="stroke: rgb(245, 141, 81);" x1="221.46" y1="82.811" x2="222.409" y2="140.201"/>
    <line style="stroke: rgb(245, 141, 81);" x1="144.474" y1="86.445" x2="221.783" y2="138.35"/>
    <line style="stroke: rgb(245, 141, 81);" x1="222.352" y1="138.717" x2="224.784" y2="327.43"/>
    <line style="stroke: rgb(245, 141, 81);" x1="224.421" y1="327.783" x2="188.842" y2="276.691"/>
    <line style="stroke: rgb(245, 141, 81);" x1="141.261" y1="240.198" x2="185.172" y2="272.286"/>
    <line style="stroke: rgb(245, 141, 81);" x1="142.423" y1="281.463" x2="184.943" y2="275.719"/>
    <line style="stroke: rgb(245, 141, 81);" x1="194.156" y1="274.527" x2="223.407" y2="254.397"/>
    <line style="stroke: rgb(245, 141, 81);" x1="195.077" y1="213.507" x2="221.244" y2="250.914"/>
    <line style="stroke: rgb(245, 141, 81);" x1="162.13" y1="320.991" x2="143.67" y2="303.96"/>
    <line style="stroke: rgb(245, 141, 81);" x1="144.139" y1="346.953" x2="182.764" y2="280.164"/>
    <line style="stroke: rgb(245, 141, 81);" x1="161.844" y1="323.269" x2="191.185" y2="324.504"/>
    <line style="stroke: rgb(245, 141, 81);" x1="190.247" y1="326.295" x2="207.169" y2="310.934"/>
    <line style="stroke: rgb(245, 141, 81);" x1="191.69" y1="326.089" x2="224.132" y2="329.536"/>
    <line style="stroke: rgb(245, 141, 81);" x1="146.075" y1="349.373" x2="175.404" y2="367.157"/>
    <line style="stroke: rgb(245, 141, 81);" x1="190.217" y1="324.342" x2="180.032" y2="367.074"/>
    <line style="stroke: rgb(245, 141, 81);" x1="178.514" y1="372.164" x2="208.628" y2="357.179"/>
    <line style="stroke: rgb(245, 141, 81);" x1="208.116" y1="358.032" x2="224.61" y2="360.409"/>
    <line style="stroke: rgb(245, 141, 81);" x1="224.189" y1="381.525" x2="223.907" y2="329.077"/>
    <line style="stroke: rgb(245, 141, 81);" x1="225.137" y1="361.765" x2="266.634" y2="356.066"/>
    <line style="stroke: rgb(245, 141, 81);" x1="269.639" y1="357.381" x2="283.034" y2="318.213"/>
    <line style="stroke: rgb(245, 141, 81);" x1="318.463" y1="310.57" x2="338.102" y2="330.724"/>
    <line style="stroke: rgb(245, 141, 81);" x1="347.293" y1="310.344" x2="329.488" y2="355.205"/>
    <line style="stroke: rgb(245, 141, 81);" x1="346.7" y1="309.282" x2="400" y2="308.341"/>
    <line style="stroke: rgb(245, 141, 81);" x1="400" y1="309.018" x2="376.715" y2="332.617"/>
    <line style="stroke: rgb(245, 141, 81);" x1="345.122" y1="308.522" x2="376.572" y2="332.77"/>
    <line style="stroke: rgb(245, 141, 81);" x1="376.657" y1="332.941" x2="371.515" y2="354.294"/>
    <line style="stroke: rgb(245, 141, 81);" x1="327.899" y1="359.759" x2="373.267" y2="354.418"/>
    <line style="stroke: rgb(245, 141, 81);" x1="223.062" y1="382.077" x2="403.461" y2="384.98"/>
    <line style="stroke: rgb(245, 141, 81);" x1="400" y1="311.001" x2="400" y2="387.543"/>
    <line style="stroke: rgb(245, 141, 81);" x1="276.918" y1="360.515" x2="314.228" y2="359.028"/>
    <line style="stroke: rgb(245, 141, 81);" x1="224.788" y1="328.752" x2="251.893" y2="337.024"/>
    <line style="stroke: rgb(245, 141, 81);" x1="191.85" y1="116.444" x2="220.648" y2="84.413"/>
    <line style="stroke: rgb(245, 141, 81);" x1="234.619" y1="311.116" x2="318.681" y2="310.176"/>
    <line style="stroke: rgb(245, 141, 81);" x1="235.089" y1="312.451" x2="250.911" y2="336.255"/>
    <line style="stroke: rgb(245, 141, 81);" x1="224.84" y1="327.801" x2="234.255" y2="312.948"/>
    <line style="fill: rgb(245, 141, 81); stroke: rgb(245, 141, 81);" x1="323.85476326281355" y1="366.22124829321234" x2="320.58968928349213" y2="379.07103226934044"/>
  </g>
  <g>
    <g id="g-62" transform="matrix(0, 1.461974, 1.562637, 0, 368.202087, 360.000153)">
      <path d="m 0,0 c 0.292,-0.524 0.036,-0.955 -0.563,-0.955 h -5.792 c -0.6,0 -0.855,0.431 -0.567,0.955 l 2.938,5.348 c 0.289,0.527 0.76,0.527 1.049,0 z" style="fill:#f1e5d9;fill-opacity:1;fill-rule:nonzero;stroke:none" id="path-69"/>
    </g>
    <g id="g1260" transform="matrix(1.562637, 0, 0, -1.461974, 228.976089, 253.083344)">
      <path d="m 0,0 c 0,1.416 -1.144,2.563 -2.56,2.563 -1.41,0 -2.56,-1.147 -2.56,-2.563 0,-1.41 1.15,-2.557 2.56,-2.557 C -1.144,-2.557 0,-1.41 0,0" style="fill:#d3d6d3;fill-opacity:1;fill-rule:nonzero;stroke:none" id="path1262"/>
    </g>
    <g id="g1284" transform="matrix(1.562637, 0, 0, -1.461974, 291.049408, 383.027832)">
      <path d="m 0,0 c 0,2.429 -1.974,4.406 -4.406,4.406 -2.435,0 -4.407,-1.977 -4.407,-4.406 0,-2.435 1.972,-4.403 4.407,-4.403 C -1.974,-4.403 0,-2.435 0,0" style="fill:#d3d6d3;fill-opacity:1;fill-rule:nonzero;stroke:none" id="path1286"/>
    </g>
    <g id="g-57" transform="matrix(0, 1.461974, 1.562637, 0, 401.405121, 313.23114)">
      <path d="M -0.175 -2.784 C -0.175 -3.22 -0.533 -3.578 -0.969 -3.578 L -4.606 -3.578 C -5.045 -3.578 -5.4 -3.22 -5.4 -2.784 L -5.4 0.856 C -5.4 1.292 -5.045 1.65 -4.606 1.65 L -0.969 1.65 C -0.533 1.65 -0.175 1.292 -0.175 0.856 Z" style="fill:#a5a0ab;fill-opacity:1;fill-rule:nonzero;stroke:none" id="path-64"/>
    </g>
    <g id="g-49" transform="matrix(0, 1.461974, 1.562637, 0, 269.087616, 368.386444)">
      <path d="m 0,0 c 0,4.104 -3.326,7.433 -7.427,7.433 -4.107,0 -7.43,-3.329 -7.43,-7.433 0,-4.101 3.323,-7.427 7.43,-7.427 C -3.326,-7.427 0,-4.101 0,0" style="fill:#d3d6d3;fill-opacity:1;fill-rule:nonzero;stroke:none" id="path-56"/>
    </g>
    <g id="g1332" transform="matrix(1.562637, 0, 0, -1.461974, 190.807007, 390.240692)">
      <path d="M -0.109 -1.167 C -0.109 -1.608 -0.464 -1.966 -0.903 -1.966 L -4.543 -1.966 C -4.979 -1.966 -5.337 -1.608 -5.337 -1.167 L -5.337 2.47 C -5.337 2.906 -4.979 3.264 -4.543 3.264 L -0.903 3.264 C -0.464 3.264 -0.109 2.906 -0.109 2.47 Z" style="fill:#a5a0ab;fill-opacity:1;fill-rule:nonzero;stroke:none" id="path1334"/>
    </g>
    <g transform="matrix(1.171978, 0, 0, 1.096481, -10.386733, -30.483767)" style="">
      <g id="g1024" transform="matrix(1.333333, 0, 0, -1.333333, 199.314453, 380.001587)"/>
      <g id="g1028" transform="matrix(1.333333, 0, 0, -1.333333, 171.04686, 325.472382)"/>
      <g id="g1036" transform="matrix(1.333333, 0, 0, -1.333333, 167.396454, 382.045166)"/>
      <g id="g1164" transform="matrix(1.333333, 0, 0, -1.333333, 183.90889, 220.113815)">
        <path d="m 0,0 c 0,4.104 -3.326,7.433 -7.427,7.433 -4.107,0 -7.43,-3.329 -7.43,-7.433 0,-4.101 3.323,-7.427 7.43,-7.427 C -3.326,-7.427 0,-4.101 0,0" style="fill:#d3d6d3;fill-opacity:1;fill-rule:nonzero;stroke:none" id="path1166"/>
      </g>
      <g id="g1244" transform="matrix(1.333333, 0, 0, -1.333333, 154.084717, 129.34082)">
        <path d="m 0,0 c 0,0.983 -0.797,1.786 -1.78,1.786 -0.986,0 -1.782,-0.803 -1.782,-1.786 0,-0.982 0.796,-1.782 1.782,-1.782 0.983,0 1.78,0.8 1.78,1.782" style="fill:#d3d6d3;fill-opacity:1;fill-rule:nonzero;stroke:none" id="path1246"/>
      </g>
      <g id="g1248" transform="matrix(1.333333, 0, 0, -1.333333, 137.344452, 224.258179)">
        <path d="m 0,0 c 0,0.986 -0.799,1.783 -1.782,1.783 -0.981,0 -1.78,-0.797 -1.78,-1.783 0,-0.983 0.799,-1.78 1.78,-1.78 C -0.799,-1.78 0,-0.983 0,0" style="fill:#d3d6d3;fill-opacity:1;fill-rule:nonzero;stroke:none" id="path1250"/>
      </g>
      <g id="g1252" transform="matrix(1.333333, 0, 0, -1.333333, 174.223389, 324.49118)">
        <path d="m 0,0 c 0,0.983 -0.797,1.78 -1.78,1.78 -0.983,0 -1.78,-0.797 -1.78,-1.78 0,-0.983 0.797,-1.783 1.78,-1.783 0.983,0 1.78,0.8 1.78,1.783" style="fill:#d3d6d3;fill-opacity:1;fill-rule:nonzero;stroke:none" id="path1254"/>
      </g>
      <g id="g1256" transform="matrix(1.333333, 0, 0, -1.333333, 188.190186, 380.398102)">
        <path d="m 0,0 c 0,0.983 -0.799,1.783 -1.782,1.783 -0.983,0 -1.78,-0.8 -1.78,-1.783 0,-0.985 0.797,-1.785 1.78,-1.785 C -0.799,-1.785 0,-0.985 0,0" style="fill:#d3d6d3;fill-opacity:1;fill-rule:nonzero;stroke:none" id="path1258"/>
      </g>
      <g id="g1268" transform="matrix(1.333333, 0, 0, -1.333333, 134.404999, 285.446899)">
        <path d="m 0,0 c 0,1.413 -1.146,2.56 -2.56,2.56 -1.41,0 -2.557,-1.147 -2.557,-2.56 0,-1.414 1.147,-2.56 2.557,-2.56 C -1.146,-2.56 0,-1.414 0,0" style="fill:#d3d6d3;fill-opacity:1;fill-rule:nonzero;stroke:none" id="path1270"/>
      </g>
      <g id="g1272" transform="matrix(1.333333, 0, 0, -1.333333, 134.312592, 178.68335)">
        <path d="m 0,0 c 0,1.482 -1.205,2.69 -2.69,2.69 -1.483,0 -2.688,-1.208 -2.688,-2.69 0,-1.483 1.205,-2.688 2.688,-2.688 C -1.205,-2.688 0,-1.483 0,0" style="fill:#d3d6d3;fill-opacity:1;fill-rule:nonzero;stroke:none" id="path1274"/>
      </g>
      <g id="g1276" transform="matrix(1.333333, 0, 0, -1.333333, 201.19873, 103.907257)">
        <path d="m 0,0 c 0,1.482 -1.205,2.69 -2.69,2.69 -1.483,0 -2.688,-1.208 -2.688,-2.69 0,-1.485 1.205,-2.685 2.688,-2.685 1.485,0 2.69,1.2 2.69,2.685" style="fill:#d3d6d3;fill-opacity:1;fill-rule:nonzero;stroke:none" id="path1278"/>
      </g>
      <g id="g1296" transform="matrix(1.333333, 0, 0, -1.333333, 166.711655, 365.086914)">
        <path d="m 0,0 c 0,2.341 -1.902,4.243 -4.248,4.243 -2.335,0 -4.239,-1.902 -4.239,-4.243 0,-2.346 1.904,-4.242 4.239,-4.242 C -1.902,-4.242 0,-2.346 0,0" style="fill:#d3d6d3;fill-opacity:1;fill-rule:nonzero;stroke:none" id="path1298"/>
      </g>
      <g id="g1304" transform="matrix(1.333333, 0, 0, -1.333333, 184.817795, 182.496414)">
        <path d="m 0,0 c 0,-1.33 -1.085,-2.416 -2.415,-2.416 h -11.064 c -1.331,0 -2.416,1.086 -2.416,2.416 v 11.067 c 0,1.327 1.085,2.412 2.416,2.412 H -2.415 C -1.085,13.479 0,12.394 0,11.067 Z" style="fill:#a5a0ab;fill-opacity:1;fill-rule:nonzero;stroke:none" id="path1306"/>
      </g>
      <g id="g1336" transform="matrix(1.333333, 0, 0, -1.333333, 134.123657, 107.706703)">
        <path d="m 0,0 c 0,-0.436 -0.358,-0.794 -0.794,-0.794 h -3.637 c -0.439,0 -0.794,0.358 -0.794,0.794 v 3.64 c 0,0.436 0.355,0.794 0.794,0.794 h 3.637 C -0.358,4.434 0,4.076 0,3.64 Z" style="fill:#a5a0ab;fill-opacity:1;fill-rule:nonzero;stroke:none" id="path1338"/>
      </g>
      <g id="g1356" transform="matrix(1.333333, 0, 0, -1.333333, 149.261108, 325.19104)">
        <path d="M 0,0 C 0,-0.583 -0.478,-1.055 -1.058,-1.055 H -5.9 c -0.58,0 -1.055,0.472 -1.055,1.055 V 4.842 C -6.955,5.42 -6.48,5.9 -5.9,5.9 h 4.842 C -0.478,5.9 0,5.42 0,4.842 Z" style="fill:#a5a0ab;fill-opacity:1;fill-rule:nonzero;stroke:none" id="path1358"/>
      </g>
      <g id="g1392" transform="matrix(1.333333, 0, 0, -1.333333, 133.028061, 153.588272)">
        <path d="m 0,0 c 0.12,0.114 0.12,0.306 0,0.419 l -0.444,0.45 c -0.117,0.111 -0.306,0.111 -0.422,0 l -0.68,-0.683 c -0.117,-0.117 -0.308,-0.117 -0.422,0 l -0.683,0.683 c -0.114,0.111 -0.306,0.111 -0.42,0 L -3.518,0.419 C -3.634,0.306 -3.634,0.114 -3.518,0 l 0.681,-0.68 c 0.116,-0.12 0.116,-0.308 0,-0.425 l -0.681,-0.677 c -0.116,-0.123 -0.116,-0.306 0,-0.428 l 0.447,-0.441 c 0.114,-0.12 0.306,-0.12 0.42,0 l 0.683,0.68 c 0.114,0.117 0.305,0.117 0.422,0 l 0.68,-0.68 c 0.116,-0.12 0.305,-0.12 0.422,0 L 0,-2.21 c 0.12,0.122 0.12,0.305 0,0.428 l -0.68,0.677 c -0.117,0.117 -0.117,0.305 0,0.425 z" style="fill-opacity: 1; fill-rule: nonzero; stroke: none; fill: rgb(213, 207, 207);" id="path1394"/>
      </g>
      <g id="g1436" transform="matrix(1.333333, 0, 0, -1.333333, 135.630188, 242.771225)">
        <path d="M 0,0 C 0.239,0.242 0.239,0.636 0,0.877 L -0.936,1.81 c -0.244,0.239 -0.635,0.239 -0.879,0 L -3.24,0.389 c -0.241,-0.242 -0.635,-0.242 -0.877,0 L -5.542,1.81 c -0.241,0.239 -0.638,0.239 -0.882,0 L -7.354,0.877 C -7.596,0.636 -7.596,0.242 -7.354,0 l 1.424,-1.427 c 0.244,-0.242 0.244,-0.639 0,-0.878 l -1.424,-1.424 c -0.242,-0.241 -0.242,-0.639 0,-0.886 l 0.93,-0.927 c 0.244,-0.241 0.641,-0.241 0.882,0 l 1.425,1.424 c 0.242,0.242 0.636,0.242 0.877,0 l 1.425,-1.424 c 0.244,-0.241 0.635,-0.241 0.879,0 L 0,-4.615 c 0.239,0.247 0.239,0.645 0,0.886 l -1.427,1.424 c -0.241,0.239 -0.241,0.636 0,0.878 z" style="fill:#ffffff;fill-opacity:1;fill-rule:nonzero;stroke:none" id="path1438"/>
      </g>
      <g id="g1440" transform="matrix(1.333333, 0, 0, -1.333333, 135.430328, 342.971069)">
        <path d="M 0,0 C 0.242,0.238 0.242,0.636 0,0.877 L -0.933,1.81 c -0.238,0.242 -0.635,0.242 -0.88,0 L -3.234,0.386 c -0.245,-0.242 -0.639,-0.242 -0.881,0 L -5.539,1.81 c -0.241,0.242 -0.641,0.242 -0.88,0 L -7.352,0.877 C -7.593,0.636 -7.593,0.238 -7.352,0 l 1.424,-1.427 c 0.242,-0.239 0.242,-0.639 0,-0.881 l -1.424,-1.421 c -0.241,-0.244 -0.241,-0.641 0,-0.883 l 0.933,-0.93 c 0.239,-0.242 0.639,-0.242 0.88,0 l 1.424,1.419 c 0.242,0.244 0.636,0.244 0.881,0 l 1.421,-1.419 c 0.245,-0.239 0.642,-0.239 0.88,0 L 0,-4.612 c 0.242,0.242 0.242,0.639 0,0.883 l -1.421,1.421 c -0.245,0.242 -0.245,0.642 0,0.881 z" style="fill-opacity: 1; fill-rule: nonzero; stroke: none; fill: rgb(223, 217, 217);" id="path1442"/>
      </g>
      <g id="g1456" transform="matrix(1.333333, 0, 0, -1.333333, 143.763657, 209.61293)">
        <path d="m 0,0 c 0.667,-1.213 0.078,-2.21 -1.308,-2.21 h -13.374 c -1.385,0 -1.971,0.997 -1.305,2.21 l 6.783,12.341 c 0.666,1.214 1.755,1.214 2.421,0 z" style="fill:#f1e5d9;fill-opacity:1;fill-rule:nonzero;stroke:none" id="path1458"/>
      </g>
      <g id="g1464" transform="matrix(1.021673, 0, 0, -0.987779, 184.989349, 283.95697)" style="">
        <path d="m 0,0 c 1.205,-2.199 0.142,-3.995 -2.366,-3.995 h -24.216 c -2.507,0 -3.573,1.796 -2.365,3.995 l 12.283,22.353 c 1.205,2.191 3.179,2.191 4.387,0 z" style="fill:#f1e5d9;fill-opacity:1;fill-rule:nonzero;stroke:none" id="path1466"/>
      </g>
      <g id="g1476" transform="matrix(1.333333, 0, 0, -1.333333, 176.77739, 136.037476)">
        <path d="m 0,0 c 0.292,-0.524 0.036,-0.955 -0.563,-0.955 h -5.792 c -0.6,0 -0.855,0.431 -0.567,0.955 l 2.938,5.348 c 0.289,0.527 0.76,0.527 1.049,0 z" style="fill:#f1e5d9;fill-opacity:1;fill-rule:nonzero;stroke:none" id="path1478"/>
      </g>
      <g id="g1500" transform="matrix(1.333333, 0, 0, -1.333333, 139.772858, 376.047852)">
        <path d="m 0,0 c 0.189,-0.353 0.022,-0.639 -0.383,-0.639 h -3.879 c -0.4,0 -0.571,0.286 -0.38,0.639 l 1.968,3.579 c 0.195,0.355 0.511,0.355 0.706,0 z" style="fill:#f1e5d9;fill-opacity:1;fill-rule:nonzero;stroke:none" id="path1502"/>
      </g>
      <g id="g1504" transform="matrix(1.333333, 0, 0, -1.333333, 141.227936, 254.835602)">
        <path d="m 0,0 c 0.13,-0.228 0.017,-0.419 -0.244,-0.419 h -2.532 c -0.267,0 -0.375,0.191 -0.25,0.419 l 1.285,2.34 c 0.125,0.234 0.33,0.234 0.458,0 z" style="fill:#f1e5d9;fill-opacity:1;fill-rule:nonzero;stroke:none" id="path1506"/>
      </g>
      <g id="g1508" transform="matrix(1.333333, 0, 0, -1.333333, 132.713531, 306.663055)">
        <path d="m 0,0 c 0.125,-0.233 0.011,-0.419 -0.25,-0.419 h -2.535 c -0.261,0 -0.372,0.186 -0.247,0.419 l 1.282,2.338 c 0.128,0.23 0.337,0.23 0.461,0 z" style="fill:#f1e5d9;fill-opacity:1;fill-rule:nonzero;stroke:none" id="path1510"/>
      </g>
      <g id="g1532" transform="matrix(1.333333, 0, 0, -1.333333, 132.187531, 131.324539)">
        <path d="m 0,0 c 0.122,-0.225 0.017,-0.408 -0.239,-0.408 h -2.457 c -0.255,0 -0.364,0.183 -0.242,0.408 l 1.247,2.268 c 0.123,0.222 0.322,0.222 0.444,0 z" style="fill:#f1e5d9;fill-opacity:1;fill-rule:nonzero;stroke:none" id="path1534"/>
      </g>
      <g id="g1452" transform="matrix(1.333333, 0, 0, -1.333333, 160.888718, 156.164413)">
        <path d="m 0,0 c 0.419,0.419 0.419,1.107 0,1.524 l -1.622,1.624 c -0.419,0.417 -1.11,0.417 -1.529,0 L -5.628,0.672 c -0.419,-0.417 -1.108,-0.417 -1.533,0 l -2.473,2.476 c -0.419,0.417 -1.108,0.417 -1.53,0 l -1.619,-1.624 c -0.425,-0.417 -0.425,-1.105 0,-1.524 l 2.477,-2.482 c 0.419,-0.42 0.419,-1.108 0,-1.533 l -2.477,-2.471 c -0.425,-0.422 -0.425,-1.108 0,-1.538 l 1.619,-1.613 c 0.422,-0.422 1.111,-0.422 1.533,0 l 2.47,2.473 c 0.425,0.423 1.114,0.423 1.533,0 l 2.474,-2.473 c 0.422,-0.417 1.111,-0.417 1.532,0 L 0,-8.024 c 0.419,0.43 0.419,1.116 0,1.538 l -2.477,2.471 c -0.419,0.425 -0.419,1.113 0,1.533 z" style="fill-opacity: 1; fill-rule: nonzero; stroke: none; fill: rgb(232, 223, 200);" id="path1454"/>
      </g>
      <g id="g-39" transform="matrix(0, 1.333333, 1.333333, 0, 164.247696, 337.163727)"/>
      <g id="g-40" transform="matrix(0, 1.333333, 1.333333, 0, 173.857666, 310.028259)"/>
      <g id="g-41" transform="matrix(0, 1.333333, 1.333333, 0, 199.978729, 379.49118)"/>
      <g id="g-43" transform="matrix(0, 1.333333, 1.333333, 0, 167.797821, 338.707306)"/>
      <g id="g-44" transform="matrix(0, 1.333333, 1.333333, 0, 168.127167, 338.318665)"/>
      <g id="g-45" transform="matrix(0, 1.333333, 1.333333, 0, 199.993134, 379.976257)"/>
      <g id="g-46" transform="matrix(0, 1.333333, 1.333333, 0, 205.013245, 318.81665)"/>
      <g id="g-50" transform="matrix(0, 1.333333, 1.333333, 0, 329.730713, 333.431976)">
        <path d="m 0,0 c 0,0.983 -0.797,1.786 -1.78,1.786 -0.986,0 -1.782,-0.803 -1.782,-1.786 0,-0.982 0.796,-1.782 1.782,-1.782 0.983,0 1.78,0.8 1.78,1.782" style="fill:#d3d6d3;fill-opacity:1;fill-rule:nonzero;stroke:none" id="path-57"/>
      </g>
      <g id="g-51" transform="matrix(0, 1.333333, 1.333333, 0, 222.711166, 337.931732)">
        <path d="m 0,0 c 0,0.986 -0.799,1.783 -1.782,1.783 -0.981,0 -1.78,-0.797 -1.78,-1.783 0,-0.983 0.799,-1.78 1.78,-1.78 C -0.799,-1.78 0,-0.983 0,0" style="fill:#d3d6d3;fill-opacity:1;fill-rule:nonzero;stroke:none" id="path-58"/>
      </g>
      <g id="g-53" transform="matrix(0, 1.333333, 1.333333, 0, 173.624634, 313.752258)"/>
      <g id="g-54" transform="matrix(0, 1.333333, 1.333333, 0, 280.388184, 313.659851)">
        <path d="m 0,0 c 0,1.482 -1.205,2.69 -2.69,2.69 -1.483,0 -2.688,-1.208 -2.688,-2.69 0,-1.483 1.205,-2.688 2.688,-2.688 C -1.205,-2.688 0,-1.483 0,0" style="fill:#d3d6d3;fill-opacity:1;fill-rule:nonzero;stroke:none" id="path-61"/>
      </g>
      <g id="g-55" transform="matrix(0, 1.333333, 1.333333, 0, 350.172333, 382.698761)">
        <path d="m 0,0 c 0,1.482 -1.205,2.69 -2.69,2.69 -1.483,0 -2.688,-1.208 -2.688,-2.69 0,-1.485 1.205,-2.685 2.688,-2.685 1.485,0 2.69,1.2 2.69,2.685" style="fill:#d3d6d3;fill-opacity:1;fill-rule:nonzero;stroke:none" id="path-62"/>
      </g>
      <g id="g-56" transform="matrix(0, 1.333333, 1.333333, 0, 276.575134, 364.16507)">
        <path d="m 0,0 c 0,-1.33 -1.085,-2.416 -2.415,-2.416 h -11.064 c -1.331,0 -2.416,1.086 -2.416,2.416 v 11.067 c 0,1.327 1.085,2.412 2.416,2.412 H -2.415 C -1.085,13.479 0,12.394 0,11.067 Z" style="fill:#a5a0ab;fill-opacity:1;fill-rule:nonzero;stroke:none" id="path-63"/>
      </g>
      <g id="g-58" transform="matrix(0, 1.333333, 1.333333, 0, 305.483246, 312.375336)">
        <path d="m 0,0 c 0.12,0.114 0.12,0.306 0,0.419 l -0.444,0.45 c -0.117,0.111 -0.306,0.111 -0.422,0 l -0.68,-0.683 c -0.117,-0.117 -0.308,-0.117 -0.422,0 l -0.683,0.683 c -0.114,0.111 -0.306,0.111 -0.42,0 L -3.518,0.419 C -3.634,0.306 -3.634,0.114 -3.518,0 l 0.681,-0.68 c 0.116,-0.12 0.116,-0.308 0,-0.425 l -0.681,-0.677 c -0.116,-0.123 -0.116,-0.306 0,-0.428 l 0.447,-0.441 c 0.114,-0.12 0.306,-0.12 0.42,0 l 0.683,0.68 c 0.114,0.117 0.305,0.117 0.422,0 l 0.68,-0.68 c 0.116,-0.12 0.305,-0.12 0.422,0 L 0,-2.21 c 0.12,0.122 0.12,0.305 0,0.428 l -0.68,0.677 c -0.117,0.117 -0.117,0.305 0,0.425 z" style="fill-opacity: 1; fill-rule: nonzero; stroke: none; fill: rgb(239, 220, 198);" id="path-65"/>
      </g>
      <g id="g-60" transform="matrix(0, 1.333333, 1.333333, 0, 247.171402, 323.086548)">
        <path d="m 0,0 c 0.667,-1.213 0.078,-2.21 -1.308,-2.21 h -13.374 c -1.385,0 -1.971,0.997 -1.305,2.21 l 6.783,12.341 c 0.666,1.214 1.755,1.214 2.421,0 z" style="fill:#f1e5d9;fill-opacity:1;fill-rule:nonzero;stroke:none" id="path-67"/>
      </g>
      <g id="g-61" transform="matrix(0, 1.333333, 1.333333, 0, 163.877182, 358.190399)"/>
      <g id="g-63" transform="matrix(0, 1.333333, 1.333333, 0, 204.235931, 320.575195)"/>
      <g id="g-64" transform="matrix(0, 1.333333, 1.333333, 0, 327.747009, 311.53479)">
        <path d="m 0,0 c 0.122,-0.225 0.017,-0.408 -0.239,-0.408 h -2.457 c -0.255,0 -0.364,0.183 -0.242,0.408 l 1.247,2.268 c 0.123,0.222 0.322,0.222 0.444,0 z" style="fill:#f1e5d9;fill-opacity:1;fill-rule:nonzero;stroke:none" id="path-71"/>
      </g>
      <g id="g-65" transform="matrix(0, 1.032178, 1.062768, 0, 301.857544, 338.413177)" style="">
        <path d="m 0,0 c 0.419,0.419 0.419,1.107 0,1.524 l -1.622,1.624 c -0.419,0.417 -1.11,0.417 -1.529,0 L -5.628,0.672 c -0.419,-0.417 -1.108,-0.417 -1.533,0 l -2.473,2.476 c -0.419,0.417 -1.108,0.417 -1.53,0 l -1.619,-1.624 c -0.425,-0.417 -0.425,-1.105 0,-1.524 l 2.477,-2.482 c 0.419,-0.42 0.419,-1.108 0,-1.533 l -2.477,-2.471 c -0.425,-0.422 -0.425,-1.108 0,-1.538 l 1.619,-1.613 c 0.422,-0.422 1.111,-0.422 1.533,0 l 2.47,2.473 c 0.425,0.423 1.114,0.423 1.533,0 l 2.474,-2.473 c 0.422,-0.417 1.111,-0.417 1.532,0 L 0,-8.024 c 0.419,0.43 0.419,1.116 0,1.538 l -2.477,2.471 c -0.419,0.425 -0.419,1.113 0,1.533 z" style="fill-opacity: 1; fill-rule: nonzero; stroke: none; fill: rgb(245, 223, 198);" id="path-72"/>
      </g>
      <g id="g1432" transform="matrix(1.333333, 0, 0, -1.333333, 205.189514, 324.539459)">
        <path d="m 0,0 c 0.245,0.242 0.245,0.636 0,0.875 l -0.93,0.933 c -0.244,0.244 -0.636,0.244 -0.88,0 L -3.234,0.386 c -0.242,-0.241 -0.639,-0.241 -0.883,0 l -1.422,1.422 c -0.239,0.244 -0.638,0.244 -0.88,0 L -7.349,0.875 C -7.593,0.636 -7.593,0.242 -7.349,0 l 1.424,-1.43 c 0.242,-0.241 0.242,-0.638 0,-0.88 l -1.424,-1.424 c -0.242,-0.242 -0.242,-0.639 0,-0.886 l 0.93,-0.924 c 0.242,-0.245 0.641,-0.245 0.88,0 l 1.422,1.424 c 0.244,0.241 0.641,0.241 0.883,0 l 1.424,-1.424 c 0.244,-0.245 0.636,-0.245 0.88,0 L 0,-4.62 c 0.245,0.247 0.245,0.644 0,0.886 l -1.424,1.424 c -0.239,0.242 -0.239,0.639 0,0.88 z" style="fill-opacity: 1; fill-rule: nonzero; stroke: none; fill: rgb(236, 214, 178);" id="path1434"/>
      </g>
      <g id="g1484" transform="matrix(1.333333, 0, 0, -1.333333, 190.400452, 355.909882)">
        <path d="m 0,0 c 0.23,-0.414 0.031,-0.752 -0.441,-0.752 h -4.557 c -0.469,0 -0.669,0.338 -0.441,0.752 l 2.307,4.201 c 0.228,0.411 0.603,0.411 0.825,0 z" style="fill:#f1e5d9;fill-opacity:1;fill-rule:nonzero;stroke:none" id="path1486"/>
      </g>
      <g id="g-52" transform="matrix(0, 1.333333, 1.333333, 0, 199.118454, 380.475922)">
        <path d="m 0,0 c 0,1.416 -1.144,2.563 -2.56,2.563 -1.41,0 -2.56,-1.147 -2.56,-2.563 0,-1.41 1.15,-2.557 2.56,-2.557 C -1.144,-2.557 0,-1.41 0,0" style="fill:#d3d6d3;fill-opacity:1;fill-rule:nonzero;stroke:none" id="path-59"/>
      </g>
      <g id="g1328" transform="matrix(1.333333, 0, 0, -1.333333, 189.408188, 312.945068)">
        <path d="m 0,0 c 0,-0.436 -0.355,-0.792 -0.794,-0.792 h -3.637 c -0.439,0 -0.794,0.356 -0.794,0.792 v 3.64 c 0,0.436 0.355,0.794 0.794,0.794 h 3.637 C -0.355,4.434 0,4.076 0,3.64 Z" style="fill:#a5a0ab;fill-opacity:1;fill-rule:nonzero;stroke:none" id="path1330"/>
      </g>
      <g id="g1368" transform="matrix(0.968923, 0, 0, -1.057762, 203.368866, 358.860138)" style="">
        <path d="m 0,0 c 0,-0.58 -0.475,-1.058 -1.055,-1.058 h -4.84 c -0.583,0 -1.058,0.478 -1.058,1.058 v 4.845 c 0,0.577 0.475,1.055 1.058,1.055 h 4.84 C -0.475,5.9 0,5.422 0,4.845 Z" style="fill:#a5a0ab;fill-opacity:1;fill-rule:nonzero;stroke:none" id="path1370"/>
      </g>
      <path d="M 133.419 248.379 C 133.419 248.96 132.946 249.435 132.361 249.435 L 127.511 249.435 C 126.926 249.435 126.453 248.96 126.453 248.379 L 126.453 243.526 C 126.453 242.944 126.926 242.467 127.511 242.467 L 132.361 242.467 C 132.946 242.467 133.419 242.944 133.419 243.526 Z" style="fill: rgb(165, 160, 171); fill-opacity: 1; fill-rule: nonzero; stroke: none;" id="path-40"/>
      <g id="g-59" transform="matrix(0, 1.333333, 1.333333, 0, 212.51767, 317.449249)">
        <path d="M 0,0 C 0.239,0.242 0.239,0.636 0,0.877 L -0.936,1.81 c -0.244,0.239 -0.635,0.239 -0.879,0 L -3.24,0.389 c -0.241,-0.242 -0.635,-0.242 -0.877,0 L -5.542,1.81 c -0.241,0.239 -0.638,0.239 -0.882,0 L -7.354,0.877 C -7.596,0.636 -7.596,0.242 -7.354,0 l 1.424,-1.427 c 0.244,-0.242 0.244,-0.639 0,-0.878 l -1.424,-1.424 c -0.242,-0.241 -0.242,-0.639 0,-0.886 l 0.93,-0.927 c 0.244,-0.241 0.641,-0.241 0.882,0 l 1.425,1.424 c 0.242,0.242 0.636,0.242 0.877,0 l 1.425,-1.424 c 0.244,-0.241 0.635,-0.241 0.879,0 L 0,-4.615 c 0.239,0.247 0.239,0.645 0,0.886 l -1.427,1.424 c -0.241,0.239 -0.241,0.636 0,0.878 z" style="fill-opacity: 1; fill-rule: nonzero; stroke: none; fill: rgb(240, 224, 201);" id="path-66"/>
      </g>
      <g id="g-1" transform="matrix(0, 1.333333, 1.333333, 0, 307.161896, 380.868927)" bx:origin="9.68 -5.827">
        <path d="m 0,0 c 0,0.983 -0.797,1.786 -1.78,1.786 -0.986,0 -1.782,-0.803 -1.782,-1.786 0,-0.982 0.796,-1.782 1.782,-1.782 0.983,0 1.78,0.8 1.78,1.782" style="fill:#d3d6d3;fill-opacity:1;fill-rule:nonzero;stroke:none" id="path-1"/>
      </g>
      <g id="g-2" transform="matrix(1.333333, 0, 0, -1.333333, 284.548065, 378.09079)">
        <path d="m 0,0 c 0,-0.436 -0.355,-0.792 -0.794,-0.792 h -3.637 c -0.439,0 -0.794,0.356 -0.794,0.792 v 3.64 c 0,0.436 0.355,0.794 0.794,0.794 h 3.637 C -0.355,4.434 0,4.076 0,3.64 Z" style="fill:#a5a0ab;fill-opacity:1;fill-rule:nonzero;stroke:none" id="path-2"/>
      </g>
      <g id="g-3" transform="matrix(1.333333, 0, 0, -1.333333, 202.059631, 158.372681)">
        <path d="m 0,0 c 0,-0.436 -0.355,-0.792 -0.794,-0.792 h -3.637 c -0.439,0 -0.794,0.356 -0.794,0.792 v 3.64 c 0,0.436 0.355,0.794 0.794,0.794 h 3.637 C -0.355,4.434 0,4.076 0,3.64 Z" style="fill:#a5a0ab;fill-opacity:1;fill-rule:nonzero;stroke:none" id="path-3"/>
      </g>
    </g>
  </g>
</svg>