<?xml version="1.0" encoding="utf-8"?>
<svg viewBox="0 0 216 32.4" style="enable-background:new 0 0 216 32.4;" xmlns="http://www.w3.org/2000/svg">
  <defs>
    <style type="text/css">
	.st0{fill:#E6E6E6;}
	.st1{fill:#4D4D4D;}
	.st2{font-family:'Lato-Regular';}
	.st3{font-size:12px;}
</style>
  </defs>
  <g style="stroke-width: 8.91463; vector-effect: non-scaling-stroke;" transform="matrix(0.872938, 0, 0, 0.872938, 2.163126, 2.128705)">
    <g transform="matrix(1, 0, 0, 1, 1.084149, 0)">
      <path class="st0" d="M 207.3 0 C 206.6 0 205.9 0.2 205.3 0.6 C 204.7 1 204.3 1.5 204.1 2.1 L 204.1 2.2 L 199.2 18.4 L 195.3 2.2 C 195.1 1.5 194.7 0.9 194 0.6 C 193.3 0.2 192.5 0 191.7 0 L 182.5 0 L 193.7 32.3 L 203.5 32.3 L 216 0 L 207.3 0 Z" style="stroke-width: 4px; stroke: rgb(186, 188, 182);"/>
      <path class="st0" d="M 207.3 0 C 206.6 0 205.9 0.2 205.3 0.6 C 204.7 1 204.3 1.5 204.1 2.1 L 204.1 2.2 L 199.2 18.4 L 195.3 2.2 C 195.1 1.5 194.7 0.9 194 0.6 C 193.3 0.2 192.5 0 191.7 0 L 182.5 0 L 193.7 32.3 L 203.5 32.3 L 216 0 L 207.3 0 Z"/>
    </g>
    <g>
      <path class="st0" d="M 179.8 3.5 L 175.3 18.3 L 170.4 2.1 C 170.2 1.4 169.7 0.9 169.1 0.6 L 168.9 0.5 C 168.3 0.2 167.6 0 166.9 0.1 L 162.4 0.1 C 161.7 0.1 161 0.2 160.4 0.5 L 160.2 0.6 C 159.6 0.9 159.1 1.5 158.9 2.1 L 154.1 18.2 L 150.3 2.2 C 150.1 1.5 149.7 0.9 149 0.6 C 148.3 0.2 147.5 0 146.7 0 L 0 0 L 0 32.4 L 154 32.4 L 154 32.3 L 157.1 32.3 L 157.5 32.3 L 157.5 32.3 C 157.9 32.2 158.2 32.1 158.6 31.8 C 159.1 31.4 159.4 30.9 159.6 30.3 L 164.8 13.9 L 170 30.3 C 170.2 30.9 170.5 31.4 171 31.8 C 171.1 31.9 171.2 31.9 171.3 32 L 171.3 32 C 171.6 32.1 171.8 32.2 172.1 32.3 L 172.1 32.3 L 172.3 32.3 L 179.7 32.3 L 183.9 21.6 C 184.7 19.6 184.7 17.4 184 15.4 L 179.8 3.5 Z" style="stroke-width: 4px; fill: rgb(89, 82, 82); stroke: rgb(186, 188, 182);"/>
      <path class="st0" d="M 179.8 3.5 L 175.3 18.3 L 170.4 2.1 C 170.2 1.4 169.7 0.9 169.1 0.6 L 168.9 0.5 C 168.3 0.2 167.6 0 166.9 0.1 L 162.4 0.1 C 161.7 0.1 161 0.2 160.4 0.5 L 160.2 0.6 C 159.6 0.9 159.1 1.5 158.9 2.1 L 154.1 18.2 L 150.3 2.2 C 150.1 1.5 149.7 0.9 149 0.6 C 148.3 0.2 147.5 0 146.7 0 L 0 0 L 0 32.4 L 154 32.4 L 154 32.3 L 157.1 32.3 L 157.5 32.3 L 157.5 32.3 C 157.9 32.2 158.2 32.1 158.6 31.8 C 159.1 31.4 159.4 30.9 159.6 30.3 L 164.8 13.9 L 170 30.3 C 170.2 30.9 170.5 31.4 171 31.8 C 171.1 31.9 171.2 31.9 171.3 32 L 171.3 32 C 171.6 32.1 171.8 32.2 172.1 32.3 L 172.1 32.3 L 172.3 32.3 L 179.7 32.3 L 183.9 21.6 C 184.7 19.6 184.7 17.4 184 15.4 L 179.8 3.5 Z"/>
    </g>
    <text class="st1 st2 st3" style="fill: rgb(0, 0, 0); font-size: 13px; white-space: pre;" x="22.96" y="21.66">© Mnemotix 2022</text>
  </g>
</svg>