<?xml version="1.0" encoding="utf-8"?>
<svg viewBox="0 0 216 32.4" style="enable-background:new 0 0 216 32.4;" xmlns="http://www.w3.org/2000/svg">
  <defs>
    <style type="text/css">
	.st0{fill:#E6E6E6;}
	.st1{fill:#4D4D4D;}
	.st2{font-family:'Lato-Regular';}
	.st3{font-size:12px;}
</style>
  </defs>
  <g style="stroke-width: 8.91463; vector-effect: non-scaling-stroke;" transform="matrix(0.872938, 0, 0, 0.872938, 2.163126, 2.128705)">
    <g/>
    <text class="st1 st2 st3" style="fill: rgb(0, 0, 0); font-size: 13px; white-space: pre;" x="39.413" y="20.036">© Mnemotix</text>
  </g>
</svg>