<?xml version="1.0" encoding="UTF-8" standalone="no"?>
<svg
   xmlns:dc="http://purl.org/dc/elements/1.1/"
   xmlns:cc="http://creativecommons.org/ns#"
   xmlns:rdf="http://www.w3.org/1999/02/22-rdf-syntax-ns#"
   xmlns:svg="http://www.w3.org/2000/svg"
   xmlns="http://www.w3.org/2000/svg"
   viewBox="0 0 170.66667 251.036"
   height="251.036"
   width="170.66667"
   xml:space="preserve"
   id="svg2"
   version="1.1"><metadata
     id="metadata8"><rdf:RDF><cc:Work
         rdf:about=""><dc:format>image/svg+xml</dc:format><dc:type
           rdf:resource="http://purl.org/dc/dcmitype/StillImage" /></cc:Work></rdf:RDF></metadata><defs
     id="defs6"><clipPath
       id="clipPath18"
       clipPathUnits="userSpaceOnUse"><path
         id="path16"
         d="M 0,188.277 H 128 V 0 H 0 Z" /></clipPath></defs><g
     transform="matrix(1.3333333,0,0,-1.3333333,0,251.036)"
     id="g10"><g
       id="g12"><g
         clip-path="url(#clipPath18)"
         id="g14"><g
           transform="translate(63.9998,96.7066)"
           id="g20"><path
             id="path22"
             style="fill:#8200a0;fill-opacity:1;fill-rule:nonzero;stroke:none"
             d="M 0,0 C -15.931,0 -28.845,12.914 -28.845,28.845 -28.845,44.776 -15.931,57.69 0,57.69 15.931,57.69 28.846,44.776 28.846,28.845 28.846,12.914 15.931,0 0,0 m 0,91.57 c -35.346,0 -64,-28.653 -64,-64 0,-35.346 64,-124.928 64,-124.928 0,0 64,89.582 64,124.928 0,35.347 -28.653,64 -64,64" /></g></g></g></g></svg>