<?xml version="1.0" encoding="UTF-8" standalone="no"?>
<svg
   xmlns:dc="http://purl.org/dc/elements/1.1/"
   xmlns:cc="http://creativecommons.org/ns#"
   xmlns:rdf="http://www.w3.org/1999/02/22-rdf-syntax-ns#"
   xmlns:svg="http://www.w3.org/2000/svg"
   xmlns="http://www.w3.org/2000/svg"
   viewBox="0 0 175.92 170.66667"
   height="170.66667"
   width="175.92"
   xml:space="preserve"
   id="svg2"
   version="1.1"><metadata
     id="metadata8"><rdf:RDF><cc:Work
         rdf:about=""><dc:format>image/svg+xml</dc:format><dc:type
           rdf:resource="http://purl.org/dc/dcmitype/StillImage" /></cc:Work></rdf:RDF></metadata><defs
     id="defs6"><clipPath
       id="clipPath18"
       clipPathUnits="userSpaceOnUse"><path
         id="path16"
         d="M 0,128 H 131.94 V 0 H 0 Z" /></clipPath></defs><g
     transform="matrix(1.3333333,0,0,-1.3333333,0,170.66667)"
     id="g10"><g
       id="g12"><g
         clip-path="url(#clipPath18)"
         id="g14"><g
           transform="translate(57.4668,28.6953)"
           id="g20"><path
             id="path22"
             style="fill:#ffffff;fill-opacity:1;fill-rule:nonzero;stroke:none"
             d="m 0,0 c -23.069,0 -41.838,18.769 -41.838,41.838 0,23.069 18.769,41.838 41.838,41.838 23.069,0 41.838,-18.769 41.838,-41.838 C 41.838,18.769 23.069,0 0,0 M 74.473,-17.741 47.57,9.633 c 6.243,9.192 9.897,20.279 9.897,32.205 0,31.687 -25.78,57.467 -57.467,57.467 -31.687,0 -57.467,-25.78 -57.467,-57.467 0,-31.688 25.78,-57.467 57.467,-57.467 14.13,0 27.076,5.136 37.095,13.626 l 26.232,-26.692 z" /></g></g></g></g></svg>