<?xml version="1.0" encoding="UTF-8" standalone="no"?>
<svg
   xmlns:dc="http://purl.org/dc/elements/1.1/"
   xmlns:cc="http://creativecommons.org/ns#"
   xmlns:rdf="http://www.w3.org/1999/02/22-rdf-syntax-ns#"
   xmlns:svg="http://www.w3.org/2000/svg"
   xmlns="http://www.w3.org/2000/svg"
   viewBox="0 0 178.46533 170.66667"
   height="170.66667"
   width="178.46533"
   xml:space="preserve"
   id="svg2"
   version="1.1"><metadata
     id="metadata8"><rdf:RDF><cc:Work
         rdf:about=""><dc:format>image/svg+xml</dc:format><dc:type
           rdf:resource="http://purl.org/dc/dcmitype/StillImage" /></cc:Work></rdf:RDF></metadata><defs
     id="defs6"><clipPath
       id="clipPath18"
       clipPathUnits="userSpaceOnUse"><path
         id="path16"
         d="M 0,128 H 133.849 V 0 H 0 Z" /></clipPath></defs><g
     transform="matrix(1.3333333,0,0,-1.3333333,0,170.66667)"
     id="g10"><g
       id="g12"><g
         clip-path="url(#clipPath18)"
         id="g14"><g
           transform="translate(63.999,112.1768)"
           id="g20"><path
             id="path22"
             style="fill:#ff6923;fill-opacity:1;fill-rule:nonzero;stroke:none"
             d="m 0,0 c -26.564,0 -48.176,-21.612 -48.176,-48.177 0,-26.565 21.612,-48.177 48.176,-48.177 8.708,0 17.233,2.344 24.656,6.777 l 5.109,3.05 5.829,-1.179 c 1.919,-0.389 4.271,-0.896 7.045,-1.519 -0.796,2.055 -1.427,3.818 -1.888,5.28 l -2.009,6.363 3.276,5.814 c 0.792,1.406 1.514,2.856 2.149,4.31 2.661,6.086 4.009,12.571 4.009,19.281 C 48.176,-21.612 26.564,0 0,0 m 0,-112.177 c -35.289,0 -63.999,28.711 -63.999,64 0,35.29 28.71,64 63.999,64 35.289,0 63.999,-28.71 63.999,-64 0,-8.905 -1.794,-17.523 -5.332,-25.615 -0.819,-1.879 -1.751,-3.754 -2.769,-5.573 1.152,-3.586 3.684,-9.756 7.334,-17.872 l 6.618,-14.712 -15.684,3.774 c -9.549,2.299 -16.991,3.999 -21.543,4.927 -9.84,-5.843 -21.116,-8.929 -32.623,-8.929" /></g><g
           transform="translate(39.5137,71.1128)"
           id="g24"><path
             id="path26"
             style="fill:#8200a0;fill-opacity:1;fill-rule:nonzero;stroke:none"
             d="m 0,0 c -3.922,0 -7.113,-3.19 -7.113,-7.113 0,-3.923 3.191,-7.113 7.113,-7.113 3.922,0 7.113,3.19 7.113,7.113 C 7.113,-3.19 3.922,0 0,0" /></g><g
           transform="translate(63.999,71.1128)"
           id="g28"><path
             id="path30"
             style="fill:#8200a0;fill-opacity:1;fill-rule:nonzero;stroke:none"
             d="m 0,0 c -3.922,0 -7.113,-3.19 -7.113,-7.113 0,-3.923 3.191,-7.113 7.113,-7.113 3.923,0 7.113,3.19 7.113,7.113 C 7.113,-3.19 3.923,0 0,0" /></g><g
           transform="translate(88.4844,71.1128)"
           id="g32"><path
             id="path34"
             style="fill:#8200a0;fill-opacity:1;fill-rule:nonzero;stroke:none"
             d="m 0,0 c -3.922,0 -7.112,-3.19 -7.112,-7.113 0,-3.923 3.19,-7.113 7.112,-7.113 3.923,0 7.114,3.19 7.114,7.113 C 7.114,-3.19 3.923,0 0,0" /></g></g></g></g></svg>