<?xml version="1.0" encoding="UTF-8" standalone="no"?>
<svg
   xmlns:dc="http://purl.org/dc/elements/1.1/"
   xmlns:cc="http://creativecommons.org/ns#"
   xmlns:rdf="http://www.w3.org/1999/02/22-rdf-syntax-ns#"
   xmlns:svg="http://www.w3.org/2000/svg"
   xmlns="http://www.w3.org/2000/svg"
   xmlns:sodipodi="http://sodipodi.sourceforge.net/DTD/sodipodi-0.dtd"
   xmlns:inkscape="http://www.inkscape.org/namespaces/inkscape"
   viewBox="0 0 774.69332 260.33066"
   height="260.33066"
   width="774.6933"
   xml:space="preserve"
   id="svg2"
   version="1.1"
   sodipodi:docname="ddf_logo_white.svg"
   inkscape:version="0.92.3 (2405546, 2018-03-11)"><sodipodi:namedview
     pagecolor="#ffffff"
     bordercolor="#666666"
     borderopacity="1"
     objecttolerance="10"
     gridtolerance="10"
     guidetolerance="10"
     inkscape:pageopacity="0"
     inkscape:pageshadow="2"
     inkscape:window-width="1920"
     inkscape:window-height="1005"
     id="namedview26"
     showgrid="false"
     inkscape:zoom="0.30218083"
     inkscape:cx="387.34598"
     inkscape:cy="130.16534"
     inkscape:window-x="0"
     inkscape:window-y="0"
     inkscape:window-maximized="1"
     inkscape:current-layer="svg2" /><metadata
     id="metadata8"><rdf:RDF><cc:Work
         rdf:about=""><dc:format>image/svg+xml</dc:format><dc:type
           rdf:resource="http://purl.org/dc/dcmitype/StillImage" /></cc:Work></rdf:RDF></metadata><defs
     id="defs6"><clipPath
       id="clipPath24"
       clipPathUnits="userSpaceOnUse"><path
         id="path22"
         d="M 0,585.742 H 971.515 V 0 H 0 Z"
         inkscape:connector-curvature="0" /></clipPath></defs><g
     transform="matrix(1.3333333,0,0,-1.3333333,-260.33066,520.65999)"
     id="g10"><path
       id="path12"
       style="fill:#ffffff;fill-opacity:1;fill-rule:nonzero;stroke:none"
       d="m 255.087,195.247 h -59.839 v 29.919 h 59.839 z"
       inkscape:connector-curvature="0" /><path
       id="path14"
       style="fill:#ffffff;fill-opacity:1;fill-rule:nonzero;stroke:none"
       d="m 255.087,360.455 h -59.839 v 29.919 h 59.839 z"
       inkscape:connector-curvature="0" /><path
       id="path16"
       style="fill:#ffffff;fill-opacity:1;fill-rule:nonzero;stroke:none"
       d="m 195.248,390.375 h 29.919 V 195.248 h -29.919 z"
       inkscape:connector-curvature="0" /><g
       id="g18"><g
         clip-path="url(#clipPath24)"
         id="g20"><g
           transform="translate(280.8888,387.6923)"
           id="g26"><path
             id="path28"
             style="fill:#ffffff;fill-opacity:1;fill-rule:nonzero;stroke:none"
             d="m 0,0 v -30.351 c 39.289,-5.878 49.464,-26.707 50.199,-52.902 H 80.052 C 78.506,-22.174 33.992,-4.193 0,0"
             inkscape:connector-curvature="0" /></g><g
           transform="translate(331.088,278.5004)"
           id="g30"><path
             id="path32"
             style="fill:#ffffff;fill-opacity:1;fill-rule:nonzero;stroke:none"
             d="m 0,0 c -0.734,-26.195 -10.91,-47.024 -50.199,-52.903 v -30.35 C -16.207,-79.06 28.307,-61.079 29.853,0 Z"
             inkscape:connector-curvature="0" /></g><path
           id="path34"
           style="fill:#ffffff;fill-opacity:1;fill-rule:nonzero;stroke:none"
           d="m 410.744,251.105 h 29.919 v 139.389 h -29.919 z"
           inkscape:connector-curvature="0" /><path
           id="path36"
           style="fill:#ffffff;fill-opacity:1;fill-rule:nonzero;stroke:none"
           d="m 440.663,225.167 h -29.919 v -29.919 h 29.919 z"
           inkscape:connector-curvature="0" /><path
           id="path38"
           style="fill:#ffffff;fill-opacity:1;fill-rule:nonzero;stroke:none"
           d="m 609.053,195.247 h 59.839 v 29.919 h -59.839 z"
           inkscape:connector-curvature="0" /><path
           id="path40"
           style="fill:#ffffff;fill-opacity:1;fill-rule:nonzero;stroke:none"
           d="m 609.053,360.455 h 59.839 v 29.919 h -59.839 z"
           inkscape:connector-curvature="0" /><path
           id="path42"
           style="fill:#ffffff;fill-opacity:1;fill-rule:nonzero;stroke:none"
           d="M 668.892,390.375 H 638.973 V 195.248 h 29.919 z"
           inkscape:connector-curvature="0" /><path
           id="path44"
           style="fill:#ffffff;fill-opacity:1;fill-rule:nonzero;stroke:none"
           d="M 776.268,390.495 H 694.83 v -29.919 h 81.438 z"
           inkscape:connector-curvature="0" /><path
           id="path46"
           style="fill:#ffffff;fill-opacity:1;fill-rule:nonzero;stroke:none"
           d="M 776.268,307.488 H 694.83 v -29.919 h 81.438 z"
           inkscape:connector-curvature="0" /><g
           transform="translate(475.0675,195.3124)"
           id="g48"><path
             id="path50"
             style="fill:#ffffff;fill-opacity:1;fill-rule:nonzero;stroke:none"
             d="M 0,0 C -2.508,0 -4.655,0.044 -6.377,0.083 -7.229,0.1 -7.934,0.117 -8.466,0.117 v 29.555 c 0.697,0 1.615,-0.017 2.728,-0.041 C 5.096,29.39 38.083,28.682 57.897,48.074 68.961,58.9 74.568,75.052 74.568,96.08 c 0,22.089 -5.817,39.031 -17.286,50.359 -19.831,19.581 -52.664,19.186 -63.419,19.028 l -2.329,-0.021 v 29.555 l 1.955,0.018 c 13.836,0.216 55.939,0.704 84.556,-27.553 17.303,-17.083 26.078,-41.103 26.078,-71.386 0,-29.277 -8.6,-52.534 -25.556,-69.129 C 53.417,2.34 17.784,0 0,0"
             inkscape:connector-curvature="0" /></g></g></g></g></svg>