<?xml version="1.0" encoding="UTF-8" standalone="no"?>
<svg
   xmlns:dc="http://purl.org/dc/elements/1.1/"
   xmlns:cc="http://creativecommons.org/ns#"
   xmlns:rdf="http://www.w3.org/1999/02/22-rdf-syntax-ns#"
   xmlns:svg="http://www.w3.org/2000/svg"
   xmlns="http://www.w3.org/2000/svg"
   viewBox="0 0 170.66667 170.66667"
   height="170.66667"
   width="170.66667"
   xml:space="preserve"
   id="svg2"
   version="1.1"><metadata
     id="metadata8"><rdf:RDF><cc:Work
         rdf:about=""><dc:format>image/svg+xml</dc:format><dc:type
           rdf:resource="http://purl.org/dc/dcmitype/StillImage" /></cc:Work></rdf:RDF></metadata><defs
     id="defs6"><clipPath
       id="clipPath18"
       clipPathUnits="userSpaceOnUse"><path
         id="path16"
         d="M 0,128 H 128 V 0 H 0 Z" /></clipPath></defs><g
     transform="matrix(1.3333333,0,0,-1.3333333,0,170.66667)"
     id="g10"><g
       id="g12"><g
         clip-path="url(#clipPath18)"
         id="g14"><g
           transform="translate(63.9998,105.3311)"
           id="g20"><path
             id="path22"
             style="fill:#8200a0;fill-opacity:1;fill-rule:nonzero;stroke:none"
             d="m 0,0 c -22.757,0 -41.271,-18.515 -41.271,-41.271 0,-22.757 18.514,-41.272 41.271,-41.272 22.757,0 41.271,18.515 41.271,41.272 C 41.271,-18.515 22.757,0 0,0 m 0,-97.484 c -30.996,0 -56.213,25.216 -56.213,56.213 0,30.996 25.217,56.213 56.213,56.213 30.996,0 56.213,-25.217 56.213,-56.213 0,-30.997 -25.217,-56.213 -56.213,-56.213" /></g><path
           id="path24"
           style="fill:#8200a0;fill-opacity:1;fill-rule:nonzero;stroke:none"
           d="M 71.471,95.583 H 56.53 V 128 h 14.941 z" /><path
           id="path26"
           style="fill:#8200a0;fill-opacity:1;fill-rule:nonzero;stroke:none"
           d="M 71.471,0 H 56.53 v 32.417 h 14.941 z" /><path
           id="path28"
           style="fill:#8200a0;fill-opacity:1;fill-rule:nonzero;stroke:none"
           d="M 128,56.529 H 95.583 V 71.47 H 128 Z" /><path
           id="path30"
           style="fill:#8200a0;fill-opacity:1;fill-rule:nonzero;stroke:none"
           d="M 32.418,56.529 H 0 V 71.47 h 32.418 z" /></g></g></g></svg>