<?xml version="1.0" encoding="UTF-8" standalone="no"?>
<svg
   xmlns:dc="http://purl.org/dc/elements/1.1/"
   xmlns:cc="http://creativecommons.org/ns#"
   xmlns:rdf="http://www.w3.org/1999/02/22-rdf-syntax-ns#"
   xmlns:svg="http://www.w3.org/2000/svg"
   xmlns="http://www.w3.org/2000/svg"
   viewBox="0 0 243.03999 170.66667"
   height="170.66667"
   width="243.03999"
   xml:space="preserve"
   id="svg2"
   version="1.1"><metadata
     id="metadata8"><rdf:RDF><cc:Work
         rdf:about=""><dc:format>image/svg+xml</dc:format><dc:type
           rdf:resource="http://purl.org/dc/dcmitype/StillImage" /></cc:Work></rdf:RDF></metadata><defs
     id="defs6"><clipPath
       id="clipPath30"
       clipPathUnits="userSpaceOnUse"><path
         id="path28"
         d="M 0,128 H 182.28 V 0 H 0 Z" /></clipPath></defs><g
     transform="matrix(1.3333333,0,0,-1.3333333,0,170.66667)"
     id="g10"><path
       id="path12"
       style="fill:#8200a0;fill-opacity:1;fill-rule:nonzero;stroke:none"
       d="m 143.159,0 h 39.12 v 19.561 h -39.12 z" /><path
       id="path14"
       style="fill:#8200a0;fill-opacity:1;fill-rule:nonzero;stroke:none"
       d="m 143.159,108.009 h 39.12 v 19.561 h -39.12 z" /><path
       id="path16"
       style="fill:#8200a0;fill-opacity:1;fill-rule:nonzero;stroke:none"
       d="M 162.719,0 H 182.28 V 127.57 H 162.719 Z" /><path
       id="path18"
       style="fill:#8200a0;fill-opacity:1;fill-rule:nonzero;stroke:none"
       d="M 0,0 H 39.121 V 19.561 H 0 Z" /><path
       id="path20"
       style="fill:#8200a0;fill-opacity:1;fill-rule:nonzero;stroke:none"
       d="M 0,108.009 H 39.121 V 127.57 H 0 Z" /><path
       id="path22"
       style="fill:#8200a0;fill-opacity:1;fill-rule:nonzero;stroke:none"
       d="M 0,0 H 19.561 V 127.57 H 0 Z" /><g
       id="g24"><g
         clip-path="url(#clipPath30)"
         id="g26"><path
           id="path32"
           style="fill:#8200a0;fill-opacity:1;fill-rule:nonzero;stroke:none"
           d="M 69.663,25.197 H 89.304 V 0.78 H 69.663 Z m -0.354,16.81 c 0,5.779 0.944,10.971 2.831,15.571 1.886,4.6 5.779,8.609 11.678,12.032 1.77,1.061 3.951,2.27 6.548,3.627 2.593,1.355 5.131,2.978 7.608,4.866 2.477,1.885 4.57,4.097 6.281,6.635 1.709,2.535 2.566,5.455 2.566,8.759 0,2.477 -0.473,4.658 -1.416,6.546 -0.945,1.886 -2.184,3.479 -3.715,4.778 -1.535,1.297 -3.335,2.27 -5.397,2.92 -2.066,0.646 -4.158,0.973 -6.281,0.973 -2.597,0 -4.956,-0.443 -7.078,-1.327 -2.124,-0.885 -4.042,-2.008 -5.751,-3.362 -1.712,-1.358 -3.246,-2.892 -4.6,-4.601 -1.358,-1.711 -2.507,-3.334 -3.45,-4.865 l -15.394,10.616 c 1.531,3.655 3.566,6.9 6.105,9.732 2.535,2.83 5.423,5.219 8.669,7.166 3.243,1.946 6.751,3.42 10.529,4.423 3.773,1.001 7.666,1.504 11.678,1.504 4.481,0 8.905,-0.649 13.269,-1.946 4.363,-1.3 8.286,-3.362 11.768,-6.193 3.477,-2.831 6.308,-6.459 8.493,-10.882 2.18,-4.423 3.273,-9.704 3.273,-15.836 0,-3.777 -0.442,-7.108 -1.328,-9.997 -0.884,-2.892 -2.153,-5.516 -3.804,-7.874 -1.653,-2.361 -3.599,-4.484 -5.838,-6.37 -2.243,-1.888 -4.778,-3.715 -7.609,-5.485 -2.361,-1.416 -4.72,-2.773 -7.077,-4.07 -2.361,-1.299 -4.513,-2.743 -6.459,-4.335 -1.946,-1.592 -3.539,-3.422 -4.777,-5.485 -1.239,-2.065 -1.859,-4.573 -1.859,-7.52 z" /></g></g></g></svg>