<?xml version="1.0" encoding="UTF-8" standalone="no"?>
<svg
   xmlns:dc="http://purl.org/dc/elements/1.1/"
   xmlns:cc="http://creativecommons.org/ns#"
   xmlns:rdf="http://www.w3.org/1999/02/22-rdf-syntax-ns#"
   xmlns:svg="http://www.w3.org/2000/svg"
   xmlns="http://www.w3.org/2000/svg"
   viewBox="0 0 170.66667 146.248"
   height="146.248"
   width="170.66667"
   xml:space="preserve"
   id="svg2"
   version="1.1"><metadata
     id="metadata8"><rdf:RDF><cc:Work
         rdf:about=""><dc:format>image/svg+xml</dc:format><dc:type
           rdf:resource="http://purl.org/dc/dcmitype/StillImage" /></cc:Work></rdf:RDF></metadata><defs
     id="defs6" /><g
     transform="matrix(1.3333333,0,0,-1.3333333,0,146.248)"
     id="g10"><path
       id="path12"
       style="fill:#8200a0;fill-opacity:1;fill-rule:nonzero;stroke:none"
       d="m 0,93.781 h 128 v 15.906 H 0 Z" /><path
       id="path14"
       style="fill:#8200a0;fill-opacity:1;fill-rule:nonzero;stroke:none"
       d="M 0,47.233 H 128 V 63.138 H 0 Z" /><path
       id="path16"
       style="fill:#8200a0;fill-opacity:1;fill-rule:nonzero;stroke:none"
       d="M 0,0 H 128 V 15.905 H 0 Z" /></g></svg>