<?xml version="1.0" encoding="utf-8"?>
<svg height="59.999985mm" viewBox="0 0 320 59.999986" width="320mm" xmlns="http://www.w3.org/2000/svg">
  <clipPath id="a">
    <path d="m-61.300262-169.71394h320v60h-320z"/>
  </clipPath>
  <g clip-path="url(#a)" fill="#ffb400" transform="translate(61.30026 169.71393)">
    <circle cx="99.029755" cy="73.616074" r="243.33" stroke-width=".264583" style="fill: rgb(130, 0, 160);"/>
  </g>
</svg>