<?xml version="1.0" encoding="utf-8"?>
<svg viewBox="0 0 17.5 17.5" xmlns="http://www.w3.org/2000/svg">
  <path id="Shape" d="M8.75,17.5A8.75,8.75,0,1,1,17.5,8.75,8.76,8.76,0,0,1,8.75,17.5ZM4.49,7.664v2.18H7.664V13.01h2.18V9.843H13.01V7.664H9.843V4.49H7.664V7.664Z" fill="#8200a0"/>
</svg>