{
  "Featured": {
    "Id": "1",
    "Title": "The Irishman",
    "CoverImage": "FeaturedCoverImage.png",
    "TitleImage": "FeaturedTitleImage.png",
    "Date": "2021-10-24T12:16:50.894556",
    "ReleaseYear": "2021",
    "MpaRating": "18+",
    "Category": "Movie",
    "Duration": "1h 24m",
    "Description": "Info About it"
  },
  "TendingNow": [
    {
      "Id": "1",
      "Title": "Title 1",
      "CoverImage": "https_specials-1.png",
      "TitleImage": "FeaturedTitleImage.png",
      "Date": "2022-10-24T12:16:50.894556",
      "ReleaseYear": "2023",
      "MpaRating": "18+",
      "Category": "Movie",
      "Duration": "1h 34m",
      "VideoUrl": "https://sample-videos.com/video123/mp4/720/big_buck_bunny_720p_1mb.mp4",
      "Description": "Info About it"
    },
    {
      "Id": "2",
      "Title": "Title 2",
      "CoverImage": "https_specials-2.png",
      "TitleImage": "FeaturedTitleImage.png",
      "Date": "2021-10-12T12:16:50.894556",
      "ReleaseYear": "2024",
      "MpaRating": "18+",
      "Category": "TV Show",
      "Duration": "1h 27m",
      "VideoUrl": "https://sample-videos.com/video123/mp4/720/big_buck_bunny_720p_1mb.mp4",
      "Description": "Info About it"
    },
    {
      "Id": "3",
      "Title": "Title 3",
      "CoverImage": "https_specials-3.png",
      "TitleImage": "FeaturedTitleImage.png",
      "Date": "2021-10-11T12:16:50.894556",
      "ReleaseYear": "2025",
      "MpaRating": "18+",
      "Category": "Movie",
      "Duration": "1h 54m",
      "VideoUrl": "https://sample-videos.com/video123/mp4/720/big_buck_bunny_720p_1mb.mp4",
      "Description": "Info About it"
    },
    {
      "Id": "4",
      "Title": "Title 4",
      "CoverImage": "https_specials-4.png",
      "TitleImage": "FeaturedTitleImage.png",
      "Date": "2021-10-10T12:16:50.894556",
      "ReleaseYear": "2026",
      "MpaRating": "18+",
      "Category": "Movie",
      "Duration": "2h 24m",
      "VideoUrl": "https://sample-videos.com/video123/mp4/720/big_buck_bunny_720p_1mb.mp4",
      "Description": "Info About it"
    },
    {
      "Id": "5",
      "Title": "Title 5",
      "CoverImage": "https_specials-5.png",
      "TitleImage": "FeaturedTitleImage.png",
      "Date": "2021-10-15T12:16:50.894556",
      "ReleaseYear": "2021",
      "MpaRating": "18+",
      "Category": "TV Show",
      "Duration": "2h 54m",
      "VideoUrl": "https://sample-videos.com/video123/mp4/720/big_buck_bunny_720p_1mb.mp4",
      "Description": "Info About it"
    },
    {
      "Id": "6",
      "Title": "Title 6",
      "CoverImage": "https_specials-6.png",
      "TitleImage": "FeaturedTitleImage.png",
      "Date": "2021-10-22T12:16:50.894556",
      "ReleaseYear": "2021",
      "MpaRating": "18+",
      "Category": "TV Show",
      "Duration": "1h 34m",
      "VideoUrl": "https://sample-videos.com/video123/mp4/720/big_buck_bunny_720p_1mb.mp4",
      "Description": "Info About it"
    },
    {
      "Id": "7",
      "Title": "Title 7",
      "CoverImage": "https_specials-7.png",
      "TitleImage": "FeaturedTitleImage.png",
      "Date": "2021-11-22T12:16:50.894556",
      "ReleaseYear": "2021",
      "MpaRating": "18+",
      "Category": "Movie",
      "Duration": "1h 24m",
      "VideoUrl": "https://sample-videos.com/video123/mp4/720/big_buck_bunny_720p_1mb.mp4",
      "Description": "Info About it"
    },
    {
      "Id": "8",
      "Title": "Title 8",
      "CoverImage": "https_specials-8.png",
      "TitleImage": "FeaturedTitleImage.png",
      "Date": "2021-07-14T12:16:50.894556",
      "ReleaseYear": "2021",
      "MpaRating": "18+",
      "Category": "TV Show",
      "Duration": "1h 24m",
      "VideoUrl": "https://sample-videos.com/video123/mp4/720/big_buck_bunny_720p_1mb.mp4",
      "Description": "Info About it"
    },
    {
      "Id": "9",
      "Title": "Title 9",
      "CoverImage": "https_specials-1.png",
      "TitleImage": "FeaturedTitleImage.png",
      "Date": "2021-04-03T12:16:50.894556",
      "ReleaseYear": "2021",
      "MpaRating": "18+",
      "Category": "Movie",
      "Duration": "1h 24m",
      "VideoUrl": "https://sample-videos.com/video123/mp4/720/big_buck_bunny_720p_1mb.mp4",
      "Description": "Info About it"
    },
    {
      "Id": "10",
      "Title": "Title 10",
      "CoverImage": "https_specials-2.png",
      "TitleImage": "FeaturedTitleImage.png",
      "Date": "2021-11-23T12:16:50.894556",
      "ReleaseYear": "2021",
      "MpaRating": "18+",
      "Category": "Movie",
      "Duration": "1h 24m",
      "VideoUrl": "https://sample-videos.com/video123/mp4/720/big_buck_bunny_720p_1mb.mp4",
      "Description": "Info About it"
    },
    {
      "Id": "11",
      "Title": "Title 11",
      "CoverImage": "https_specials-3.png",
      "TitleImage": "FeaturedTitleImage.png",
      "Date": "2021-11-04T12:16:50.894556",
      "ReleaseYear": "2021",
      "MpaRating": "18+",
      "Category": "TV Show",
      "Duration": "1h 24m",
      "VideoUrl": "https://sample-videos.com/video123/mp4/720/big_buck_bunny_720p_1mb.mp4",
      "Description": "Info About it"
    },
    {
      "Id": "12",
      "Title": "Title 12",
      "CoverImage": "https_specials-4.png",
      "TitleImage": "FeaturedTitleImage.png",
      "Date": "2021-03-03T12:16:50.894556",
      "ReleaseYear": "2021",
      "MpaRating": "18+",
      "Category": "Movie",
      "Duration": "1h 24m",
      "VideoUrl": "https://sample-videos.com/video123/mp4/720/big_buck_bunny_720p_1mb.mp4",
      "Description": "Info About it"
    },
    {
      "Id": "13",
      "Title": "Title 13",
      "CoverImage": "https_specials-5.png",
      "TitleImage": "FeaturedTitleImage.png",
      "Date": "2021-12-30T12:16:50.894556",
      "ReleaseYear": "2021",
      "MpaRating": "18+",
      "Category": "Movie",
      "Duration": "1h 24m",
      "VideoUrl": "https://sample-videos.com/video123/mp4/720/big_buck_bunny_720p_1mb.mp4",
      "Description": "Info About it"
    },
    {
      "Id": "14",
      "Title": "Title 14",
      "CoverImage": "https_specials-6.png",
      "TitleImage": "FeaturedTitleImage.png",
      "Date": "2021-07-10T12:16:50.894556",
      "ReleaseYear": "2021",
      "MpaRating": "18+",
      "Category": "Movie",
      "Duration": "1h 24m",
      "VideoUrl": "https://sample-videos.com/video123/mp4/720/big_buck_bunny_720p_1mb.mp4",
      "Description": "Info About it"
    },
    {
      "Id": "15",
      "Title": "Title 15",
      "CoverImage": "https_specials-7.png",
      "TitleImage": "FeaturedTitleImage.png",
      "Date": "2021-05-14T12:16:50.894556",
      "ReleaseYear": "2021",
      "MpaRating": "18+",
      "Category": "Movie",
      "Duration": "1h 24m",
      "VideoUrl": "https://sample-videos.com/video123/mp4/720/big_buck_bunny_720p_1mb.mp4",
      "Description": "Info About it"
    },
    {
      "Id": "16",
      "Title": "Title 16",
      "CoverImage": "https_specials-8.png",
      "TitleImage": "FeaturedTitleImage.png",
      "Date": "2021-03-25T12:16:50.894556",
      "ReleaseYear": "2021",
      "MpaRating": "18+",
      "Category": "Movie",
      "Duration": "1h 29m",
      "VideoUrl": "https://sample-videos.com/video123/mp4/720/big_buck_bunny_720p_1mb.mp4",
      "Description": "Info About it"
    },
    {
      "Id": "17",
      "Title": "Title 17",
      "CoverImage": "https_specials-1.png",
      "TitleImage": "FeaturedTitleImage.png",
      "Date": "2021-08-24T12:16:50.894556",
      "ReleaseYear": "2021",
      "MpaRating": "18+",
      "Category": "TV Show",
      "Duration": "1h 24m",
      "VideoUrl": "https://sample-videos.com/video123/mp4/720/big_buck_bunny_720p_1mb.mp4",
      "Description": "Info About it"
    },
    {
      "Id": "18",
      "Title": "Title 18",
      "CoverImage": "https_specials-2.png",
      "TitleImage": "FeaturedTitleImage.png",
      "Date": "2021-07-21T12:16:50.894556",
      "ReleaseYear": "2021",
      "MpaRating": "18+",
      "Category": "TV Show",
      "Duration": "1h 24m",
      "VideoUrl": "https://sample-videos.com/video123/mp4/720/big_buck_bunny_720p_1mb.mp4",
      "Description": "Info About it"
    }
  ]
}
