/dev/mem <- MMU

chmod 777 << execution 1 write 1 read 1 

mmap() donne addresse virtuelle a partir de addresse physique

page_size = 2^12 = 4096 == bytes de donnees 64-12 = bytes d'adresses
page_size = 0----10--(12)--0
page_size-1=     01--(12)--1 <= bytes de poids forts `a 0
~page_size-1=1---10--(12)--0

led0 :: GPIO42

devmem @ taille : read
devmem @ taille val : write

TOOLCHAIN
buildroot : /output/host/usr/bin -> aarch64-linux-gcc 




