1,1392422
2,1392485
3,1392098
4,1387643
5,1396088
6,1395800
7,1390391
8,1400271
9,1392491
10,1394546
11,1397703
12,1396262
13,1394398
14,1388701
15,1386095
16,1398224
17,1391462
18,1399082
19,1394110
20,1397411
21,1388692
22,1389659
23,1395947
24,1395198
25,1390216
26,1395227
27,1393830
28,1397734
29,1395337
30,1393846
31,1397397
32,1394688
33,1399215
34,1396270
35,1392432
36,1393737
37,1393575
38,1403931
39,1399173
40,1399497
41,1393372
42,1392522
43,1394377
44,1401868
45,1396361
46,1398205
47,1393574
48,1395734
49,1393172
