Time,Flow Measured (uL/min),Flow setpoint(uL/min),Continuous Phase Pressure (mbar),Dispersed Phase Pressure (mbar
0.5028340816497803,-0.0670037493109703,0,30,600
0.9978077411651611,0.5854630470275879,0,30,600
1.5015215873718262,-35.476505279541016,0,30,600
1.9970064163208008,-69.68730163574219,0,30,600
2.5038347244262695,-58.056495666503906,0,30,600
2.9995510578155518,-28.9484806060791,0,30,600
3.4961960315704346,-27.942556381225586,0,30,600
4.000482797622681,-13.480328559875488,0,30,600
4.498091697692871,-5.6913557052612305,0,30,600
5.001644134521484,-2.4813926219940186,0,30,600
5.5098302364349365,-1.0960350036621094,0,30,600
5.9974024295806885,-0.6405777931213379,0,30,600
6.49772572517395,-0.07363248616456985,0,30,600
7.00929856300354,-0.19041843712329865,0,30,600
7.502662420272827,-0.20443163812160492,0,30,600
8.006126165390015,0.31237414479255676,0,30,600
8.503668785095215,-0.1050162985920906,0,30,600
8.996737718582153,0.008026966825127602,0,30,600
9.500542640686035,0.5682170391082764,0,30,600
10.009568214416504,0.10317282378673553,0,30,600
10.503401756286621,0.8056091070175171,0,30,600
11.000993967056274,-2.5709493160247803,0,30,600
11.496550798416138,-1.242659568786621,0,30,600
12.006828784942627,-1.1875673532485962,350,2500,600
12.997055530548096,1.3767980337142944,300,2500,600
13.99793291091919,145.21714782714844,300,2500,600
15.005420684814453,255.153564453125,300,2500,600
15.998746156692505,378.6064453125,300,2434,600
16.99995470046997,383.99169921875,300,2219,600
17.995561361312866,361.15240478515625,300,2248,600
19.010135173797607,345.5927429199219,300,2237,600
19.99700164794922,345.1751708984375,300,2200,600
21.004385232925415,345.1060791015625,300,2140,600
22.016976594924927,341.44464111328125,300,2094,600
23.03848624229431,338.2574768066406,300,2059,600
24.039051294326782,335.3135681152344,300,2024,600
25.040491580963135,306.0617370605469,300,1991,600
26.059792280197144,298.5887756347656,300,2040,600
27.063055753707886,300.2812194824219,300,2028,600
28.068134546279907,300.4004211425781,300,2016,600
29.068459033966064,296.6615905761719,300,2017,600
30.06397557258606,296.48284912109375,300,2028,600
31.061683177947998,297.0478515625,300,2029,600
32.0616672039032,297.7951965332031,300,2030,600
33.05980658531189,298.37286376953125,300,2031,600
34.06503748893738,299.2277526855469,300,2033,600
35.06468987464905,299.5703125,300,2032,600
36.05770826339722,299.83856201171875,300,2033,600
37.0639111995697,299.9784851074219,300,2033,600
38.06158137321472,300.1916809082031,300,2033,600
39.068930864334106,299.7833251953125,300,2032,600
40.06375575065613,299.5402526855469,300,2034,600
41.070799589157104,300.5412902832031,300,2034,600
42.067004680633545,300.2419128417969,300,2031,600
43.06493902206421,298.44720458984375,300,2033,600
44.05777049064636,300.4710388183594,300,2038,600
45.06876230239868,300.7160949707031,300,2031,600
46.06281304359436,299.9031982421875,300,2032,600
47.06889772415161,299.4610595703125,300,2034,600
48.08015990257263,300.1553649902344,300,2035,600
49.078531980514526,300.16009521484375,300,2033,600
50.07409071922302,300.7691650390625,300,2033,600
51.080804109573364,301.014892578125,300,2031,600
52.08829641342163,299.56048583984375,300,2030,600
53.08318305015564,299.09979248046875,300,2034,600
54.07655215263367,300.1300354003906,300,2034,600
55.08078980445862,299.9696044921875,300,2032,600
56.08176136016846,299.9725646972656,300,2033,600
57.08000636100769,300.6025085449219,300,2033,600
58.08092546463013,300.4964294433594,300,2031,600
59.078564405441284,299.8071594238281,300,2031,600
60.082226514816284,300.27545166015625,300,2033,600
61.07774591445923,299.6109924316406,300,2031,600
62.08552312850952,300.0950622558594,300,2033,600
63.08148145675659,299.8960266113281,300,2031,600
64.09272313117981,299.92767333984375,300,2032,600
65.10872530937195,299.7790222167969,300,2032,600
66.11160945892334,299.758544921875,300,2033,600
67.11727809906006,300.1111755371094,300,2033,600
68.11273217201233,300.1237487792969,300,2032,600
69.10572385787964,299.8988342285156,300,2032,600
70.11748623847961,299.7888488769531,300,2033,600
71.10500049591064,300.1387634277344,300,2033,600
72.10865426063538,299.8522644042969,300,2032,600
73.11652946472168,299.7479553222656,300,2033,600
74.11073064804077,299.3835144042969,300,2033,600
75.11971521377563,299.5124816894531,300,2035,600
76.11991381645203,298.9927673339844,300,2034,600
77.12176036834717,299.7654724121094,300,2037,600
78.13075399398804,299.8697204589844,300,2035,600
79.1319055557251,299.8489074707031,300,2035,600
80.12459397315979,299.59088134765625,300,2036,600
81.13361859321594,299.5603332519531,300,2037,600
82.13473153114319,299.7586975097656,300,2037,600
83.15173244476318,299.2246398925781,300,2037,600
84.15570092201233,300.091064453125,300,2039,600
85.16406178474426,299.5194091796875,300,2036,600
86.15812611579895,299.5216369628906,300,2039,600
87.15891623497009,300.0092468261719,300,2039,600
88.1653265953064,300.0685729980469,300,2038,600
89.15823650360107,299.9197998046875,300,2038,600
90.16215562820435,300.1800842285156,300,2039,600
91.15506601333618,300.0717468261719,300,2038,600
92.16151189804077,300.2166442871094,300,2038,600
93.15323448181152,301.3179626464844,300,2038,600
94.15674638748169,301.3687744140625,300,2034,600
95.15979981422424,298.38250732421875,300,2034,600
96.16162538528442,298.7659912109375,300,2041,600
97.15389657020569,299.8810729980469,300,2039,600
98.16575026512146,299.618408203125,300,2037,600
99.16395282745361,299.726806640625,300,2039,600
100.15257143974304,300.2989501953125,300,2039,600
101.15746641159058,299.66162109375,300,2038,600
102.15299415588379,299.5753479003906,300,2040,600
103.54736351966858,300.78564453125,300,2040,550
105.15740895271301,316.8255310058594,300,2037,500
106.15293455123901,318.5622863769531,300,1989,500
107.16691827774048,315.4942321777344,300,1982,500
108.1788899898529,310.0778503417969,300,1975,500
109.17691230773926,307.16265869140625,300,1972,500
110.169762134552,305.1569519042969,300,1966,500
111.17098021507263,304.27667236328125,300,1961,500
112.17495536804199,302.9212951660156,300,1957,500
113.17308640480042,302.66912841796875,300,1956,500
114.17382216453552,303.22833251953125,300,1952,500
115.17565846443176,300.8008728027344,300,1948,500
116.17676663398743,301.1145935058594,300,1952,500
117.17798519134521,300.7549133300781,300,1948,500
118.17876696586609,300.8790283203125,300,1948,500
119.43575596809387,300.8737487792969,300,1947,450
120.70557022094727,312.3742980957031,300,1946,400
121.68782782554626,318.61907958984375,300,1910,400
122.69197058677673,313.7246398925781,300,1891,400
123.69657373428345,309.22381591796875,300,1893,400
124.68377232551575,308.80902099609375,300,1888,400
125.68979096412659,307.04510498046875,300,1876,400
126.69181895256042,305.8360900878906,300,1872,400
127.69500732421875,303.6844787597656,300,1867,400
128.69771909713745,303.8749084472656,300,1866,400
129.69503474235535,303.92120361328125,300,1860,400
130.68273377418518,301.48345947265625,300,1856,400
131.69488859176636,301.9027404785156,300,1859,400
132.69057989120483,301.5666809082031,300,1854,400
133.68601870536804,301.2643127441406,300,1854,400
134.69282007217407,299.7842712402344,300,1853,400
135.6967875957489,300.0149841308594,300,1855,400
136.6897838115692,300.033447265625,300,1853,400
137.69299364089966,300.3087158203125,300,1854,400
138.68784594535828,299.884521484375,300,1853,400
139.68500328063965,300.1273498535156,300,1854,400
140.88689637184143,301.0779724121094,300,1853,390
141.68623065948486,301.19354248046875,300,1850,390
142.69411420822144,302.0270080566406,300,1850,390
143.6927728652954,300.7584228515625,300,1846,390
144.69816780090332,301.0982666015625,300,1849,390
145.7110550403595,300.8468322753906,300,1846,390
146.70872044563293,300.3706970214844,300,1846,390
147.70460748672485,300.4590759277344,300,1846,390
148.70318055152893,299.6867370605469,300,1845,390
149.70679640769958,300.107666015625,300,1847,390
150.7138385772705,300.0985412597656,300,1845,390
151.74081683158875,299.91937255859375,300,1846,390
152.73166298866272,300.48687744140625,300,1846,390
153.73580026626587,299.8452453613281,300,1844,390
154.73287630081177,300.275390625,300,1846,390
155.729807138443,299.7829284667969,300,1845,390
156.7388677597046,300.1441345214844,300,1846,390
157.73211073875427,300.07568359375,300,1845,390
158.74189162254333,300.1560974121094,300,1845,390
159.73468112945557,300.02496337890625,300,1845,390
160.73828744888306,300.23919677734375,300,1845,390
161.97679710388184,300.4148864746094,300,1844,380
162.73681163787842,301.2446594238281,300,1844,380
163.73325204849243,300.88140869140625,300,1841,380
164.7419672012329,301.22314453125,300,1842,380
165.73340272903442,301.1372985839844,300,1840,380
166.742573261261,300.58526611328125,300,1839,380
167.743723154068,300.01800537109375,300,1839,380
168.74500489234924,300.34466552734375,300,1840,380
169.7456111907959,300.0794677734375,300,1838,380
170.75768899917603,299.544921875,300,1839,380
171.74662280082703,299.76263427734375,300,1840,380
172.75169920921326,299.9380187988281,300,1840,380
173.75658559799194,299.66766357421875,300,1840,380
174.74600410461426,299.7330322265625,300,1841,380
175.7588222026825,299.79876708984375,300,1841,380
176.7548213005066,300.12841796875,300,1841,380
177.75568270683289,299.96612548828125,300,1840,380
178.74504971504211,299.981689453125,300,1841,380
179.74683284759521,300.0998229980469,300,1840,380
180.76068902015686,299.6697082519531,300,1840,380
181.77282547950745,299.59759521484375,300,1841,380
182.76267385482788,299.86566162109375,300,1842,380
183.7756905555725,300.13330078125,300,1841,380
184.76572632789612,299.8018493652344,300,1841,380
185.76169323921204,299.98248291015625,300,1842,380
186.7682135105133,299.837158203125,300,1841,380
187.76401352882385,300.04107666015625,300,1842,380
188.76967811584473,300.51788330078125,300,1841,380
189.7660870552063,300.3876647949219,300,1840,380
190.76184558868408,298.97296142578125,300,1840,380
191.76077389717102,299.73724365234375,300,1844,380
192.7698311805725,300.3612365722656,300,1841,380
193.76261281967163,299.8882751464844,300,1840,380
194.77185559272766,299.9067077636719,300,1842,380
195.77284908294678,300.2134704589844,300,1842,380
196.78165531158447,300.4037780761719,300,1841,380
197.79161405563354,299.955078125,300,1840,380
198.776859998703,299.7623291015625,300,1842,380
199.78561806678772,299.6983337402344,300,1842,380
200.78536176681519,299.9885559082031,300,1842,380
201.7776336669922,299.9885559082031,300,1841,380
202.78307580947876,299.9316101074219,300,1842,380
203.78061246871948,300.1661376953125,300,1842,380
204.77753567695618,300.0169982910156,300,1841,380
205.77679562568665,300.4990539550781,300,1842,380
206.79628014564514,299.8604431152344,300,1840,380
207.80058002471924,299.704833984375,300,1842,380
208.79321599006653,299.5163269042969,300,1842,380
209.8031930923462,299.6034851074219,300,1843,380
210.79251909255981,299.9763488769531,300,1843,380
211.79686164855957,299.6690368652344,300,1842,380
212.80306267738342,299.5351257324219,300,1843,380
213.79883909225464,299.15966796875,300,1844,380
214.80486154556274,298.9641418457031,300,1845,380
215.79348397254944,299.9703369140625,300,1846,380
216.80122017860413,299.3978576660156,300,1844,380
217.8018922805786,299.5482482910156,300,1847,380
218.8099856376648,299.521240234375,300,1846,380
219.82144403457642,299.6539001464844,300,1847,380
220.80963850021362,299.4646301269531,300,1847,380
221.82287049293518,299.5943298339844,300,1848,380
222.82763171195984,299.48968505859375,300,1848,380
223.84939455986023,299.4446105957031,300,1849,380
224.85864162445068,299.5262756347656,300,1850,380
225.85487294197083,299.43646240234375,300,1850,380
226.85524892807007,298.88763427734375,300,1851,380
227.8553557395935,298.9052734375,300,1853,380
228.857036113739,299.344970703125,300,1853,380
229.86319589614868,300.4733581542969,300,1853,380
230.8645248413086,300.3031311035156,300,1851,380
231.85729551315308,299.85736083984375,300,1852,380
232.8548924922943,300.2432861328125,300,1853,380
233.86773657798767,299.6596374511719,300,1851,380
234.8608796596527,300.04583740234375,300,1853,380
235.86881041526794,299.9627685546875,300,1852,380
236.86188054084778,299.5176696777344,300,1852,380
237.8588788509369,299.3345642089844,300,1854,380
238.86801719665527,299.4037170410156,300,1854,380
239.85567378997803,299.36334228515625,300,1855,380
240.85601925849915,299.5924987792969,300,1855,380
242.15088367462158,300.2115173339844,300,1855,385
242.89003729820251,299.55108642578125,300,1854,385
243.85589575767517,299.07794189453125,300,1857,385
244.854346036911,299.0399169921875,300,1858,385
245.86683797836304,299.6630554199219,300,1858,385
246.85922574996948,300.4598083496094,300,1857,385
247.86689281463623,301.0961608886719,300,1856,385
248.85801553726196,301.14447021484375,300,1854,385
249.8693883419037,300.67828369140625,300,1854,385
250.8572289943695,300.5577087402344,300,1854,385
251.88032507896423,300.3079833984375,300,1853,385
252.88047647476196,300.0455322265625,300,1853,385
253.87352991104126,300.15252685546875,300,1854,385
254.88238430023193,300.22235107421875,300,1853,385
255.87493300437927,300.67633056640625,300,1853,385
256.8764069080353,300.3619079589844,300,1851,385
257.88484954833984,299.95684814453125,300,1852,385
258.8782558441162,299.6410827636719,300,1852,385
259.880943775177,299.74383544921875,300,1853,385
260.87335562705994,299.9797058105469,300,1853,385
262.2829005718231,299.92315673828125,300,1853,390
263.3789749145508,299.66162109375,300,1853,390
264.3839063644409,299.0691223144531,300,1854,390
265.3807728290558,298.947265625,300,1856,390
266.3823935985565,299.0508117675781,300,1856,390
267.3703052997589,299.1639404296875,300,1857,390
268.40112257003784,299.0154113769531,300,1858,390
269.39411306381226,299.316650390625,300,1859,390
270.386931180954,299.4606018066406,300,1859,390
271.3966886997223,299.7241516113281,300,1859,390
272.3892664909363,299.3565979003906,300,1859,390
273.3906018733978,299.42303466796875,300,1861,390
274.3999161720276,299.62664794921875,300,1861,390
275.4113690853119,299.8883972167969,300,1861,390
276.40178322792053,299.56634521484375,300,1861,390
277.41042852401733,299.5985107421875,300,1862,390
278.4114019870758,299.8653564453125,300,1862,390
279.40763878822327,299.37432861328125,300,1862,390
280.4069209098816,299.7361145019531,300,1864,390
281.4152338504791,299.2256164550781,300,1863,390
282.40587520599365,299.5933532714844,300,1865,390
283.41536116600037,299.01885986328125,300,1864,390
284.4163794517517,299.4587097167969,300,1867,390
285.4167516231537,299.4390563964844,300,1866,390
286.4204189777374,299.7367248535156,300,1867,390
287.4219341278076,299.7171936035156,300,1866,390
288.42492938041687,299.5633544921875,300,1867,390
289.4179437160492,299.4651184082031,300,1868,390
290.4250259399414,299.6951599121094,300,1868,390
291.42628383636475,299.2108154296875,300,1868,390
292.4218246936798,298.9458923339844,300,1870,390
293.42293643951416,299.4577941894531,300,1871,390
294.42500376701355,298.7197570800781,300,1870,390
295.43934774398804,298.7095947265625,300,1874,390
296.44395875930786,300.16424560546875,300,1874,390
297.4469919204712,300.08526611328125,300,1871,390
298.4370129108429,299.6520080566406,300,1873,390
299.4423851966858,299.2301330566406,300,1874,390
300.4334819316864,299.38885498046875,300,1875,390
301.43596148490906,299.45404052734375,300,1875,390
302.4439322948456,299.1429748535156,300,1876,390
303.4378354549408,299.16845703125,300,1877,390
304.4385151863098,298.978515625,300,1878,390
305.4483640193939,299.5943908691406,300,1879,390
306.44900918006897,299.20220947265625,300,1878,390
307.4609956741333,299.7723693847656,300,1880,390
308.4482316970825,299.36944580078125,300,1879,390
309.4541938304901,299.3497619628906,300,1881,390
310.46072363853455,299.4862060546875,300,1881,390
311.45579624176025,298.7324523925781,300,1881,390
312.4619882106781,299.7112121582031,300,1884,390
313.4553289413452,299.3653869628906,300,1882,390
314.4537932872772,299.64117431640625,300,1884,390
315.44878339767456,299.3828125,300,1884,390
316.45578694343567,299.75201416015625,300,1885,390
317.45098900794983,299.62786865234375,300,1884,390
318.4491410255432,299.3773498535156,300,1885,390
319.46087527275085,299.742431640625,300,1886,390
320.449166059494,299.1416015625,300,1886,390
321.4631338119507,300.0514221191406,300,1888,390
322.4591226577759,300.125244140625,300,1886,390
323.44995069503784,300.7505798339844,300,1886,390
324.46787214279175,300.1171569824219,300,1884,390
325.471626996994,300.11517333984375,300,1886,390
326.46503949165344,299.8881530761719,300,1885,390
327.48490500450134,299.9411926269531,300,1886,390
328.50200867652893,300.11749267578125,300,1886,390
329.4951682090759,300.0360107421875,300,1885,390
330.49877285957336,299.95703125,300,1885,390
331.49702072143555,299.6332702636719,300,1886,390
332.502742767334,300.5838623046875,300,1886,390
333.49501967430115,300.73358154296875,300,1884,390
334.5081841945648,300.3095703125,300,1884,390
335.5084283351898,300.2286376953125,300,1884,390
336.499130487442,300.3774719238281,300,1884,390
337.50260066986084,300.0511779785156,300,1883,390
338.5101697444916,299.90423583984375,300,1884,390
339.50497698783875,300.8117370605469,300,1884,390
340.49748611450195,300.34112548828125,300,1881,390
341.5065188407898,300.0683898925781,300,1883,390
342.5097939968109,300.2253723144531,300,1883,390
343.50298404693604,300.1573791503906,300,1882,390
344.4994397163391,299.8896179199219,300,1882,390
345.500794172287,299.9719543457031,300,1882,390
346.50986433029175,299.958740234375,300,1882,390
347.5042333602905,300.4329833984375,300,1882,390
348.51033091545105,300.0000915527344,300,1881,390
349.49699354171753,300.458251953125,300,1882,390
350.51301550865173,300.2143249511719,300,1880,390
351.5230062007904,299.4611511230469,300,1881,390
352.5227265357971,299.2752380371094,300,1883,390
353.51686811447144,299.1624755859375,300,1883,390
354.52408266067505,299.1993713378906,300,1884,390
355.51137685775757,299.3995666503906,300,1885,390
356.5174951553345,299.2391052246094,300,1885,390
357.52099561691284,299.98077392578125,300,1886,390
358.51929903030396,300.7492370605469,300,1885,390
359.51783537864685,300.1402587890625,300,1883,390
360.5172095298767,301.06317138671875,300,1885,390
361.537499666214,300.9287109375,300,1881,390
362.5362010002136,300.1784362792969,300,1882,390
363.53700613975525,300.15478515625,300,1883,390
364.5363471508026,300.4167175292969,300,1882,390
365.52985644340515,300.26666259765625,300,1881,390
366.53682684898376,300.1109313964844,300,1881,390
367.54135847091675,300.21258544921875,300,1881,390
368.53802275657654,300.43133544921875,300,1881,390
369.53406715393066,299.955078125,300,1880,390
370.5401282310486,299.5806884765625,300,1881,390
371.5298008918762,300.15118408203125,300,1882,390
372.5307834148407,300.1811218261719,300,1880,390
373.53936076164246,300.0440979003906,300,1881,390
374.5317316055298,300.21417236328125,300,1881,390
375.5320174694061,300.6429138183594,300,1880,390
376.54103326797485,300.2196044921875,300,1879,390
377.5338716506958,299.89056396484375,300,1880,390
378.53242111206055,299.9247741699219,300,1880,390
379.53590154647827,299.69500732421875,300,1880,390
380.53238105773926,297.82781982421875,300,1881,390
381.55503487586975,299.7599792480469,300,1886,390
382.55487632751465,300.36273193359375,300,1881,390
383.5650143623352,299.9098815917969,300,1881,390
384.5716700553894,299.0185241699219,300,1883,390
385.5671226978302,299.85467529296875,300,1885,390
386.5728352069855,299.8081359863281,300,1883,390
387.5620265007019,299.6567687988281,300,1884,390
388.5590305328369,299.5306091308594,300,1884,390
389.5711877346039,299.9139404296875,300,1885,390
390.57245564460754,299.6656494140625,300,1884,390
391.5890462398529,300.1364440917969,300,1885,390
392.60503578186035,299.59368896484375,300,1884,390
393.60780215263367,299.6849670410156,300,1886,390
394.60646748542786,299.9307861328125,300,1886,390
395.61808681488037,299.8219299316406,300,1885,390
396.6100380420685,299.7432556152344,300,1886,390
397.60440135002136,299.8750915527344,300,1886,390
398.6200349330902,299.86199951171875,300,1886,390
399.62303590774536,299.9305114746094,300,1886,390
400.6361527442932,299.3038024902344,300,1886,390
401.6404318809509,299.4315490722656,300,1888,390
402.64977264404297,300.2632141113281,300,1888,390
403.6382806301117,300.00225830078125,300,1886,390
404.65104269981384,299.7565612792969,300,1888,390
405.63854026794434,299.573974609375,300,1888,390
406.6465744972229,299.5950927734375,300,1889,390
407.6501648426056,300.3262634277344,300,1889,390
408.65281534194946,300.19580078125,300,1887,390
409.6650507450104,300.0180969238281,300,1888,390
410.6528081893921,300.0211486816406,300,1888,390
411.66604495048523,299.85455322265625,300,1888,390
412.661301612854,300.102294921875,300,1888,390
413.66311407089233,299.9117126464844,300,1888,390
414.65196442604065,299.8916320800781,300,1888,390
415.654598236084,299.18768310546875,300,1888,390
416.66051268577576,299.44482421875,300,1890,390
417.66705226898193,299.8359069824219,300,1890,390
418.6710524559021,299.8498840332031,300,1889,390
419.66706013679504,299.7347106933594,300,1890,390
420.6895682811737,299.7041015625,300,1890,390
421.6851260662079,299.5598449707031,300,1891,390
422.68536138534546,299.8049011230469,300,1891,390
423.6960484981537,298.963623046875,300,1891,390
424.6860761642456,300.044189453125,300,1894,390
425.68809700012207,300.15692138671875,300,1891,390
426.6825315952301,300.1499938964844,300,1892,390
427.69381642341614,299.9337158203125,300,1891,390
428.69135761260986,299.5701904296875,300,1892,390
429.697785615921,299.6009826660156,300,1893,390
430.69106364250183,299.7024841308594,300,1893,390
431.690221786499,299.83111572265625,300,1893,390
432.702068567276,299.5097961425781,300,1893,390
433.7072501182556,299.6679992675781,300,1894,390
434.7010750770569,299.6607360839844,300,1894,390
435.7091426849365,299.2469177246094,300,1895,390
436.705069065094,299.8323669433594,300,1896,390
437.70106768608093,299.87384033203125,300,1895,390
438.71107625961304,299.3890380859375,300,1895,390
439.70084404945374,299.01190185546875,300,1897,390
440.69943594932556,299.421630859375,300,1898,390
441.70718026161194,299.970703125,300,1898,390
442.7068090438843,299.46783447265625,300,1897,390
443.70240926742554,299.7412109375,300,1899,390
444.7030758857727,299.4420166015625,300,1898,390
445.71449184417725,299.7868347167969,300,1900,390
446.72304463386536,299.7014465332031,300,1899,390
447.7270133495331,299.82794189453125,300,1900,390
448.7325351238251,299.7559509277344,300,1900,390
449.73901295661926,299.8974304199219,300,1900,390
450.7390458583832,299.4980773925781,300,1900,390
451.73994994163513,299.682373046875,300,1901,390
452.73136830329895,299.6136779785156,300,1901,390
453.7421715259552,299.3601989746094,300,1901,390
454.73662185668945,299.49652099609375,300,1903,390
455.740198135376,299.7412109375,300,1903,390
456.7353732585907,299.74945068359375,300,1902,390
457.7314214706421,299.87847900390625,300,1903,390
458.7383472919464,299.52294921875,300,1903,390
459.75744557380676,299.7981262207031,300,1904,390
460.7588460445404,299.83837890625,300,1903,390
461.7542757987976,299.0912780761719,300,1904,390
462.7615797519684,299.49188232421875,300,1906,390
463.7709982395172,299.1820068359375,300,1905,390
464.7713384628296,299.42425537109375,300,1907,390
465.7744297981262,299.4727783203125,300,1907,390
466.7690417766571,299.8052062988281,300,1907,390
467.76776337623596,299.0342712402344,300,1907,390
468.7758755683899,300.03131103515625,300,1910,390
469.7702808380127,299.8965148925781,300,1907,390
470.7643644809723,299.3640441894531,300,1908,390
471.7693591117859,299.6857604980469,300,1910,390
472.77904415130615,299.6827087402344,300,1909,390
473.78910398483276,299.9746398925781,300,1910,390
474.7851822376251,299.82342529296875,300,1909,390
475.7843234539032,299.9093933105469,300,1910,390
476.783109664917,300.06854248046875,300,1910,390
477.79189944267273,300.1646728515625,300,1909,390
478.7922842502594,300.460693359375,300,1909,390
479.79611229896545,300.0840148925781,300,1908,390
480.8002498149872,300.3896484375,300,1909,390
481.8121063709259,299.8953552246094,300,1908,390
482.8101351261139,299.4549560546875,300,1909,390
483.8171145915985,299.8564147949219,300,1910,390
484.815039396286,299.61474609375,300,1909,390
485.81711626052856,300.0396728515625,300,1910,390
486.82290959358215,304.1347961425781,300,1909,390
487.8112897872925,299.791748046875,300,1897,390
488.8089599609375,298.57720947265625,300,1910,390
489.80748414993286,299.37750244140625,300,1910,390
490.8083539009094,299.07843017578125,300,1908,390
491.80802035331726,300.3858337402344,300,1910,390
492.8168845176697,300.2686462402344,300,1907,390
493.81812620162964,299.70343017578125,300,1908,390
494.8143410682678,300.59014892578125,300,1909,390
495.8119840621948,297.76104736328125,300,1906,390
496.8369972705841,300.3949279785156,300,1915,390
497.83636116981506,300.82000732421875,300,1907,390
498.82307624816895,300.95404052734375,300,1908,390
499.8341348171234,300.5508728027344,300,1907,390
500.824419260025,300.6837463378906,300,1907,390
501.8332042694092,299.7386169433594,300,1906,390
502.8329291343689,300.2419738769531,300,1908,390
503.8289668560028,299.71405029296875,300,1906,390
504.83718276023865,299.9460144042969,300,1908,390
505.82915449142456,299.96685791015625,300,1907,390
506.83590173721313,299.8461608886719,300,1907,390
507.8388409614563,299.85797119140625,300,1908,390
508.8451371192932,300.06988525390625,300,1908,390
509.84415650367737,299.8742980957031,300,1907,390
510.83916544914246,300.209228515625,300,1908,390
511.84412455558777,300.0072326660156,300,1907,390
512.8519446849823,300.15655517578125,300,1907,390
513.8539071083069,299.7403259277344,300,1907,390
514.8541643619537,299.8561096191406,300,1908,390
515.8391687870026,299.4059143066406,300,1908,390
516.8460924625397,300.31634521484375,300,1909,390
517.8586361408234,300.0772705078125,300,1907,390
518.8756673336029,300.4376525878906,300,1908,390
519.8841788768768,299.9354248046875,300,1906,390
520.8851537704468,299.9094543457031,300,1908,390
521.886157989502,299.8813171386719,300,1908,390
522.887166261673,300.1029357910156,300,1908,390
523.8893730640411,299.827392578125,300,1907,390
524.9083256721497,299.7885437011719,300,1908,390
525.9077014923096,299.7006530761719,300,1908,390
526.9042139053345,299.0692443847656,300,1908,390
527.9011518955231,299.3450012207031,300,1911,390
528.9044451713562,300.07745361328125,300,1910,390
529.9167041778564,300.2718811035156,300,1909,390
530.9060800075531,299.981689453125,300,1909,390
531.9123063087463,299.21063232421875,300,1910,390
532.9090900421143,299.4801940917969,300,1912,390
533.9053421020508,299.88116455078125,300,1911,390
534.9032251834869,306.2374267578125,300,1911,0
535.9050590991974,278.231689453125,0,0,0
536.4138307571411,207.9727783203125,0,0,0
536.9149401187897,153.63571166992188,0,0,0
537.4141669273376,109.33692932128906,0,0,0
537.9016819000244,74.18106079101562,0,0,0
538.408399105072,44.59421920776367,0,0,0
538.9081411361694,24.5211124420166,0,0,0
539.40163397789,12.092997550964355,0,0,0
539.9052090644836,4.441653728485107,0,0,0
540.4023356437683,1.5502749681472778,0,0,0
540.9034826755524,1.1037366390228271,0,0,0
541.41139793396,0.3694422245025635,0,0,0
541.9229438304901,0.512109100818634,0,0,0
542.4243745803833,1.026941180229187,0,0,0
542.9243333339691,0.9028701782226562,0,0,0
543.4293174743652,0.2759428024291992,0,0,0
543.9249973297119,0.5494167804718018,0,0,0
544.4169936180115,0.4760723114013672,0,0,0
544.924941778183,0.6326896548271179,0,0,0
545.4253363609314,0.4749522805213928,0,0,0
545.9291031360626,0.7141129970550537,0,0,0
546.4244101047516,0.9935413599014282,0,0,0
546.9199874401093,0.7383446097373962,0,0,0
547.4263482093811,0.39992937445640564,0,0,0
547.9298980236053,1.1065762042999268,0,0,0
548.4242310523987,0.4860687255859375,0,0,0
548.932183265686,0.5100647807121277,0,0,0
549.4275588989258,0.3319288492202759,0,0,0
549.9321556091309,1.0603253841400146,0,0,0
550.4248056411743,0.793160617351532,0,0,0
550.9249448776245,0.6583696603775024,0,0,0
551.428524017334,0.8999314308166504,0,0,0
551.9262001514435,0.778691291809082,0,0,0
552.4298856258392,0.695469319820404,0,0,0
552.9196510314941,0.5379468202590942,0,0,0
553.4311971664429,0.7574642300605774,0,0,0
553.9206092357635,0.5618225932121277,0,0,0
554.4299440383911,0.5353647470474243,0,0,0
554.9209938049316,0.23437249660491943,0,0,0
555.432585477829,0.04146619886159897,0,0,0
555.9471175670624,0.7003427743911743,0,0,0
556.4396088123322,-1.268608570098877,0,0,0
556.9399538040161,0.4268006980419159,0,0,0
557.4433476924896,1.318302869796753,0,0,0
557.932954788208,0.6932045221328735,0,0,0
558.4421367645264,0.36571571230888367,0,0,0
558.9346852302551,0.6763874888420105,0,0,0
559.4382646083832,0.5129584074020386,0,0,0
559.9356033802032,0.5149217247962952,0,0,0
560.4420223236084,0.6670827865600586,0,0,0
560.9370682239532,0.48860403895378113,0,0,0
561.440434217453,1.0194141864776611,0,0,0
561.938188791275,0.9479033946990967,0,0,0
562.4469709396362,1.4914493560791016,0,0,0
562.938672542572,1.3506789207458496,0,0,0
563.4421937465668,0.1275220662355423,0,0,0
563.9385507106781,0.5083638429641724,0,0,0
564.4350109100342,0.9424116015434265,0,0,0
564.9462110996246,0.5457517504692078,0,0,0
565.4363250732422,0.7965280413627625,0,0,0
565.9478998184204,0.5988010168075562,0,0,0
566.4343404769897,0.41490527987480164,0,0,0
566.9380979537964,0.6467718482017517,0,0,0
567.43394780159,0.5390200018882751,0,0,0
567.9375619888306,0.6520705819129944,0,0,0
568.447832107544,0.6001388430595398,0,0,0
568.9354274272919,0.5227067470550537,0,0,0
569.4442694187164,0.611357569694519,0,0,0
569.9400842189789,0.8155781030654907,0,0,0
570.4400968551636,0.35007426142692566,0,0,0
570.9353892803192,0.49138858914375305,0,0,0
571.4358153343201,0.5514881014823914,0,0,0
571.9393763542175,0.7006627917289734,0,0,0
572.4422602653503,0.9602822065353394,0,0,0
572.9431641101837,0.9378567337989807,0,0,0
573.4377601146698,1.0991640090942383,0,0,0
573.9333186149597,1.0692352056503296,0,0,0
574.4450948238373,0.6353703141212463,0,0,0
574.9404895305634,0.5743632316589355,0,0,0
575.4479722976685,0.5852515697479248,0,0,0
575.9352355003357,0.7109377384185791,0,0,0
576.4463856220245,0.6473044753074646,0,0,0
576.9339520931244,0.7772389054298401,0,0,0
577.4337375164032,0.5805739164352417,0,0,0
577.937313079834,0.5754180550575256,0,0,0
578.437203168869,0.3848473131656647,0,0,0
578.938206911087,0.7120221853256226,0,0,0
579.4428679943085,0.7219668030738831,0,0,0
579.9426636695862,0.6403437852859497,0,0,0
580.4355974197388,0.5775912404060364,0,0,0
580.9330906867981,1.0553282499313354,0,0,0
581.4444291591644,0.296853631734848,0,0,0
581.9431433677673,0.3950114846229553,0,0,0
582.435797214508,0.30309173464775085,0,0,0
582.9357059001923,0.29520314931869507,0,0,0
583.4392356872559,0.4573829770088196,0,0,0
583.9362106323242,0.8702755570411682,0,0,0
584.4362571239471,0.8290318250656128,0,0,0
584.9450867176056,0.8630237579345703,0,0,0
585.4404571056366,0.5538631677627563,0,0,0
585.9337010383606,0.44185736775398254,0,0,0
586.4368484020233,0.909147322177887,0,0,0
