Time,Flow Measured (uL/min),Flow setpoint(uL/min),Continuous Phase Pressure (mbar),Dispersed Phase Pressure (mbar
0.5015051364898682,0.6241632699966431,0,30,30
0.9988205432891846,1.0313564538955688,0,30,30
1.5096533298492432,1.1878950595855713,0,30,30
2.0134053230285645,0.8914157748222351,0,30,30
2.4990944862365723,0.828565239906311,0,30,30
2.9983768463134766,0.9322999715805054,0,30,30
3.5198659896850586,0.7240439057350159,0,30,30
4.023458242416382,0.8159649968147278,0,30,30
4.529218673706055,0.7039620280265808,0,30,30
5.024560213088989,0.725896418094635,0,30,30
5.514459848403931,0.6940619945526123,0,30,30
6.0180442333221436,0.9323250651359558,0,30,30
6.5153968334198,0.33904120326042175,0,30,30
7.018795967102051,0.9472708702087402,0,30,30
7.516096830368042,1.0047805309295654,0,30,30
8.027701377868652,0.6942163109779358,0,30,30
8.525890827178955,1.0966628789901733,0,30,30
9.021402597427368,0.7240896224975586,0,30,30
9.51829719543457,1.0520925521850586,0,30,30
10.022147417068481,0.7823861837387085,0,30,30
10.524871349334717,0.4229637384414673,0,30,30
11.02043342590332,0.8658934831619263,0,30,30
11.528765439987183,0.27771398425102234,0,30,30
12.02438235282898,0.8973751068115234,0,30,30
12.514729022979736,0.9361348152160645,0,30,30
13.018393516540527,0.9571604132652283,0,30,30
13.529635667800903,1.5828630924224854,0,30,30
14.041384220123291,-0.5296142101287842,0,30,30
14.537415266036987,-1.3308593034744263,0,30,30
15.03738784790039,-0.47618842124938965,0,30,30
15.540805578231812,-3.6527769565582275,0,30,30
16.044391870498657,1.178312063217163,0,30,30
16.552387952804565,1.427832841873169,0,30,30
17.046221256256104,0.8971816301345825,0,30,30
17.55908751487732,0.8484684228897095,0,30,30
18.063822746276855,0.7188062071800232,0,30,30
18.56450605392456,1.1377285718917847,0,30,30
19.08058786392212,1.21436607837677,0,30,30
19.6003999710083,0.5790324807167053,0,30,30
20.092461585998535,0.8060020804405212,0,30,30
20.593639135360718,1.0463374853134155,0,30,30
21.10655641555786,0.6936986446380615,0,30,30
21.59426259994507,0.5471738576889038,0,30,30
22.107545852661133,0.9907940030097961,0,30,30
22.608607053756714,0.9072409868240356,0,30,30
23.108726024627686,0.30601418018341064,0,30,30
23.620395183563232,0.49547523260116577,0,30,30
24.117860555648804,0.19006842374801636,0,30,30
24.62638807296753,0.8362285494804382,0,30,30
25.127713680267334,0.6822770237922668,0,30,30
25.639416933059692,0.9604060649871826,0,30,30
26.16063404083252,0.636239767074585,0,30,30
26.66127300262451,1.4607182741165161,0,30,30
27.170073747634888,0.4667346477508545,0,30,30
27.681583881378174,0.6674394011497498,0,30,30
28.181651830673218,0.6311156153678894,0,30,30
28.67468237876892,1.0744683742523193,0,30,30
29.179378509521484,0.579642653465271,0,30,30
29.674967527389526,0.6933117508888245,0,30,30
30.188408613204956,0.872994065284729,0,30,30
30.704412698745728,0.6855389475822449,0,30,30
31.213666439056396,0.43824508786201477,0,30,30
31.701416969299316,1.0289973020553589,0,30,30
32.21384072303772,0.8929494023323059,0,30,30
32.71465826034546,0.656683623790741,0,30,30
33.223867416381836,0.8097965717315674,0,30,30
33.7274169921875,0.5480546951293945,0,30,30
34.223406076431274,0.983247697353363,0,30,30
34.72589063644409,0.7960962057113647,0,30,30
35.22940683364868,1.0316143035888672,0,30,30
35.72946786880493,1.1215356588363647,0,30,30
36.21705961227417,1.0071958303451538,0,30,30
36.72704577445984,0.8929007649421692,0,30,30
37.22254300117493,0.9325186014175415,0,30,30
37.725189447402954,0.9534992575645447,0,30,30
38.22854995727539,10.305190086364746,0,30,30
38.72280955314636,2.378070116043091,0,30,30
39.22640872001648,0.41324010491371155,0,30,30
39.72640800476074,-0.14323905110359192,0,30,30
40.22180771827698,0.6737642288208008,0,30,30
40.71940994262695,0.8286552429199219,0,30,30
41.21857142448425,1.0840853452682495,0,30,30
41.720006465911865,0.8389953374862671,0,30,30
42.223586320877075,0.44119811058044434,0,30,30
42.72099304199219,0.835134744644165,0,30,30
43.22453165054321,0.946315586566925,0,30,30
43.71879315376282,0.5061572194099426,0,30,30
44.23041844367981,0.821893036365509,0,30,30
44.71808218955994,0.7211031913757324,0,30,30
45.22305202484131,0.9503536224365234,0,30,30
45.72330975532532,0.43319541215896606,0,30,30
46.21815752983093,1.1524560451507568,50,2500,30
47.23166036605835,16.58319091796875,150,2500,30
48.23042273521423,567.2533569335938,250,2500,30
49.23139762878418,1044.3760986328125,300,1414,30
50.21923232078552,945.9371948242188,300,266,30
51.222739696502686,407.89556884765625,300,294,30
52.23141837120056,159.49559020996094,300,1164,30
53.22460198402405,216.0235595703125,300,1263,30
54.22065019607544,508.4646911621094,300,986,30
55.22144532203674,480.1166076660156,300,249,30
56.230427742004395,473.2544250488281,600,1018,30
57.220948934555054,471.2876281738281,600,1130,30
58.24143052101135,491.1752014160156,600,1258,30
59.24676251411438,530.4053955078125,600,1325,30
60.24242973327637,642.2138061523438,600,1336,30
61.249011278152466,637.9376220703125,600,1111,30
62.258434772491455,584.2999267578125,600,1191,30
63.259207010269165,586.1082763671875,600,1310,30
64.25443410873413,606.9557495117188,600,1267,30
65.26403784751892,621.4628295898438,600,1220,30
66.27620840072632,614.8539428710938,600,1190,30
67.27144598960876,594.4944458007812,600,1203,30
68.28154230117798,589.3734741210938,600,1242,30
69.28480505943298,592.9359130859375,600,1243,30
70.2972481250763,600.7120361328125,600,1238,30
71.30229473114014,606.164794921875,600,1225,30
72.30731201171875,603.6487426757812,600,1216,30
73.31681442260742,598.703369140625,600,1223,30
74.34438061714172,599.831787109375,600,1232,30
75.35521245002747,604.1287841796875,600,1225,30
76.3440773487091,603.244384765625,600,1213,30
77.34769129753113,598.2172241210938,600,1216,30
78.37940883636475,598.1976928710938,600,1227,30
79.38124227523804,600.5735473632812,600,1224,30
80.38761138916016,600.0197143554688,600,1218,30
81.3968813419342,600.3790893554688,600,1222,30
82.39834809303284,599.6170654296875,600,1220,30
83.41543555259705,599.4395751953125,600,1222,30
84.41932845115662,599.1436157226562,600,1223,30
85.4114453792572,598.7911987304688,600,1224,30
86.4176504611969,599.019287109375,600,1225,30
87.41067051887512,600.5709838867188,600,1226,30
88.42892670631409,599.5401000976562,600,1222,30
89.42245817184448,599.4993896484375,600,1226,30
90.42842030525208,600.4165649414062,600,1226,30
91.43152451515198,600.2718505859375,600,1224,30
92.43369102478027,599.8123779296875,600,1224,30
93.42160105705261,599.32421875,600,1225,30
94.42982172966003,599.5360107421875,600,1227,30
95.42005443572998,599.8330688476562,600,1226,30
96.42627835273743,601.3314208984375,600,1226,30
97.44235348701477,600.7902221679688,600,1222,30
98.4395854473114,600.192138671875,600,1224,30
99.44148635864258,537.6324462890625,0,0,30
99.94302892684937,333.4220275878906,0,0,0
100.43627500534058,183.95603942871094,0,0,0
0.20887017250061035,83.18272399902344,0,0,0
0.7158949375152588,26.89339256286621,0,0,0
1.2253262996673584,4.981197834014893,0,0,0
1.7253386974334717,1.195533275604248,0,0,0
2.2392308712005615,0.053691547363996506,0,0,0
2.7291481494903564,0.4485437572002411,0,0,0
3.2381234169006348,-0.0246327705681324,0,0,0
3.73349928855896,-0.06376578658819199,0,0,0
4.233375787734985,0.1175917387008667,0,0,0
4.731039762496948,0.2656315863132477,0,0,0
5.228178262710571,0.0953734740614891,0,0,0
6.090260744094849,1.5475491285324097,0,1500,0
6.2741053104400635,5.88862943649292,0,1500,0
6.739974737167358,14.833937644958496,0,1500,0
7.24399471282959,35.65336227416992,0,1500,0
7.739582061767578,343.546875,0,1500,0
8.259173393249512,676.5443725585938,0,1500,0
8.762949466705322,698.14013671875,0,1500,0
9.262977361679077,695.6124267578125,0,1500,0
9.764379978179932,725.3355102539062,0,1500,0
10.268291234970093,729.8753662109375,0,1500,0
10.755846500396729,734.9673461914062,0,1500,0
11.26134181022644,733.8907470703125,0,1500,0
11.769990682601929,733.580322265625,0,1500,0
12.270337104797363,732.6929321289062,0,1500,0
12.75796103477478,732.7390747070312,0,1500,0
13.263941287994385,732.4131469726562,0,1500,0
13.759235382080078,731.9589233398438,0,1500,0
14.256655216217041,732.0625610351562,0,1500,0
14.768230438232422,731.9395141601562,0,1500,0
15.25762128829956,731.47412109375,0,1500,0
15.761171102523804,731.3580932617188,0,1500,0
16.26007890701294,731.3690795898438,0,1500,0
16.771463871002197,727.8232421875,0,1500,0
17.28528928756714,726.0013427734375,0,1500,0
17.778989553451538,730.2764892578125,0,1500,0
18.27350163459778,729.388671875,0,1500,0
18.793163299560547,732.6390991210938,0,1500,0
19.297603845596313,732.4409790039062,0,1500,0
19.791941165924072,731.8926391601562,0,1500,0
20.2955002784729,732.2837524414062,0,1500,0
20.79140830039978,731.4415283203125,0,1500,0
21.302979946136475,731.6612548828125,0,1500,0
21.813876390457153,731.3564453125,0,1500,0
22.309275150299072,732.0513305664062,0,1500,0
22.81346869468689,732.6848754882812,0,1500,0
23.317172050476074,732.5040283203125,0,1500,0
23.824766397476196,732.8516845703125,0,1500,0
24.336155652999878,732.8485107421875,0,1500,0
24.836376190185547,732.638671875,0,1500,0
25.33995270729065,732.6649169921875,0,1500,0
25.83427882194519,733.1892700195312,0,1500,0
26.353858470916748,732.7957153320312,0,1500,0
26.86961054801941,732.42041015625,0,1500,0
27.365199327468872,732.4196166992188,0,1500,0
27.86774182319641,734.4194946289062,0,1500,0
28.37940502166748,735.4591064453125,0,1500,0
28.881632328033447,735.7885131835938,0,1500,0
29.393177270889282,735.8901977539062,0,1500,0
29.895031929016113,735.2512817382812,0,1500,0
30.38245177268982,736.3689575195312,0,1500,0
30.891160488128662,736.0862426757812,0,1500,0
31.387942790985107,736.2162475585938,0,1500,0
31.896681308746338,735.8128662109375,0,1500,0
32.40027332305908,736.7337646484375,0,1500,0
32.917664766311646,736.7120971679688,0,1500,0
33.41317367553711,733.2044067382812,0,1500,0
33.92691206932068,734.1708374023438,0,1500,0
34.44219446182251,734.4613647460938,0,1500,0
34.94397950172424,733.694580078125,0,1500,0
35.463348388671875,733.816650390625,0,1500,0
35.960315227508545,733.6621704101562,0,1500,0
36.4720618724823,733.977783203125,0,1500,0
36.970975160598755,733.7327880859375,0,1500,0
37.466453552246094,733.73974609375,0,1500,0
37.97122597694397,733.5364990234375,0,1500,0
38.458979845047,733.0509643554688,0,1500,0
38.971575021743774,733.787841796875,0,1500,0
39.45916390419006,733.7360229492188,0,1500,0
39.967589139938354,733.3941040039062,0,1500,0
40.47694683074951,733.35693359375,0,1500,0
40.99629783630371,732.9161987304688,0,1500,0
41.493935108184814,733.5235595703125,0,1500,0
42.011383295059204,733.4008178710938,0,1500,0
42.512977838516235,732.680908203125,0,1500,0
43.02485227584839,733.70703125,0,1500,0
43.54402184486389,733.5300903320312,0,1500,0
44.052325963974,733.558349609375,0,1500,0
44.561023235321045,733.3314819335938,0,1500,0
45.06438398361206,733.6377563476562,0,1500,0
45.56970191001892,733.3916015625,0,1500,0
46.06975436210632,732.8666381835938,0,1500,0
46.57904767990112,732.880615234375,0,1500,0
47.08249640464783,732.74072265625,0,1500,0
47.587944984436035,733.2353515625,0,1500,0
48.09717798233032,733.2091064453125,0,1500,0
48.58908486366272,732.9277954101562,0,1500,0
49.09247279167175,733.0588989257812,0,1500,0
49.59072971343994,733.8406372070312,0,1500,0
50.095271587371826,733.2772216796875,0,1500,0
50.58404898643494,733.42138671875,0,1500,0
51.10342264175415,732.6971435546875,0,1500,0
51.60324263572693,733.0902709960938,0,1500,0
52.12040901184082,733.229248046875,0,1500,0
52.636364459991455,733.2916259765625,0,1500,0
53.1321382522583,732.6519775390625,0,1500,0
53.634177684783936,732.5831909179688,0,1500,0
54.13494038581848,732.9634399414062,0,1500,0
54.65316963195801,733.1166381835938,0,1500,0
55.164668560028076,733.106689453125,0,1500,0
55.66818404197693,732.7122802734375,0,1500,0
56.17693495750427,732.4876708984375,0,1500,0
56.67829394340515,733.4453125,0,1500,0
57.19010591506958,733.50537109375,0,1500,0
57.687599897384644,733.3362426757812,0,1500,0
58.17932891845703,733.1195678710938,0,1500,0
58.7004771232605,732.9924926757812,0,1500,0
59.196083307266235,733.321533203125,0,1500,0
59.700637102127075,732.9465942382812,0,1500,0
60.19339179992676,732.7071533203125,0,1500,0
60.69928002357483,732.2666625976562,0,1500,0
61.210968255996704,733.1776733398438,0,1500,0
61.717262744903564,733.2592163085938,0,1500,0
62.21001315116882,732.6452026367188,0,1500,0
62.713404417037964,732.6898193359375,0,1500,0
63.21518850326538,732.6987915039062,0,1500,0
63.710693359375,733.1341552734375,0,1500,0
64.22229814529419,732.9017944335938,0,1500,0
64.71811747550964,732.8055419921875,0,1500,0
65.21026968955994,733.52978515625,0,1500,0
65.71097183227539,733.3711547851562,0,1500,0
66.2239317893982,732.9326782226562,0,1500,0
66.72744703292847,732.8466186523438,0,1500,0
67.22513675689697,732.8245849609375,0,1500,0
67.72880911827087,733.4541015625,0,1500,0
68.23419332504272,733.0640258789062,0,1500,0
68.73763632774353,732.92236328125,0,1500,0
69.2275972366333,732.8428344726562,0,1500,0
69.73919010162354,732.87451171875,0,1500,0
70.23632073402405,733.476806640625,0,1500,0
70.73186755180359,732.784423828125,0,1500,0
71.22919487953186,732.9368896484375,0,1500,0
71.73270392417908,732.8759155273438,0,1500,0
72.23824524879456,733.0757446289062,0,1500,0
72.72581028938293,733.287109375,0,1500,0
73.24723696708679,733.4905395507812,0,1500,0
73.75103998184204,733.2879028320312,0,1500,0
74.24831986427307,733.6386108398438,0,1500,0
74.76004409790039,733.0869140625,0,1500,0
75.26557111740112,733.2181396484375,0,1500,0
75.76112675666809,732.9595336914062,0,1500,0
76.26939272880554,733.0175170898438,0,1500,0
76.75719141960144,733.5443725585938,0,1500,0
77.27128505706787,732.8905639648438,0,1500,0
77.7889940738678,732.7498779296875,0,1500,0
78.30020546913147,733.0377807617188,0,1500,0
78.78918981552124,733.2315063476562,0,1500,0
79.29258608818054,733.1728515625,0,1500,0
79.79302453994751,732.8562622070312,0,1500,0
80.29660439491272,732.6641845703125,0,1500,0
80.79939031600952,732.4368286132812,0,1500,0
81.28919863700867,733.0818481445312,0,1500,0
81.78780055046082,732.7638549804688,0,1500,0
82.29138207435608,732.8320922851562,0,1500,0
82.78931856155396,732.8650512695312,0,1500,0
83.29311633110046,732.8790283203125,0,1500,0
83.80839204788208,732.6975708007812,0,1500,0
84.30420637130737,733.1964721679688,0,1500,0
84.80632138252258,733.0310668945312,0,1500,0
85.31785893440247,733.3921508789062,0,1500,0
85.826092004776,733.1433715820312,0,1500,0
86.3294517993927,733.0578002929688,0,1500,0
86.82225370407104,732.6525268554688,0,1500,0
87.32578206062317,732.8886108398438,0,1500,0
87.83466172218323,733.3983154296875,0,1500,0
88.34624099731445,733.1815795898438,0,1500,0
88.83916640281677,732.7508544921875,0,1500,0
89.34255957603455,732.8339233398438,0,1500,0
89.84420990943909,733.5679931640625,0,1500,0
90.34774541854858,733.18408203125,0,1500,0
90.83449864387512,733.0697021484375,0,1500,0
91.34622073173523,732.9032592773438,0,1500,0
91.84402132034302,732.3310546875,0,1500,0
92.33937287330627,733.003173828125,0,1500,0
92.8388307094574,733.4091796875,0,1500,0
93.33445239067078,732.9359130859375,0,1500,0
93.83809852600098,732.6571655273438,0,1500,0
94.34149646759033,732.5826416015625,0,1500,0
94.84529519081116,733.3186645507812,0,1500,0
95.33454585075378,733.0413818359375,0,1500,0
95.83518600463867,733.1655883789062,0,1500,0
96.3434374332428,732.822509765625,0,1500,0
96.83923625946045,733.4056396484375,0,1500,0
97.33629131317139,733.2427368164062,0,1500,0
97.83747959136963,733.1717529296875,0,1500,0
98.34363436698914,732.5427856445312,0,1500,0
98.8392186164856,733.38037109375,0,1500,0
99.347407579422,732.906982421875,0,1500,0
99.8412127494812,732.8147583007812,0,1500,0
100.340411901474,732.7606811523438,0,1500,0
100.83596754074097,733.3485717773438,0,1500,0
101.3412275314331,732.9866333007812,0,1500,0
101.83422231674194,732.5,0,1500,0
102.3424346446991,733.4824829101562,0,1500,0
102.84620475769043,732.7708129882812,0,1500,0
103.34328150749207,733.1725463867188,0,1500,0
103.83657598495483,733.3646850585938,0,1500,0
104.33939027786255,732.8915405273438,0,1500,0
104.83516454696655,732.8322143554688,0,1500,0
105.34005403518677,732.3141479492188,0,1500,0
105.84058094024658,733.21875,0,1500,0
106.34024715423584,733.0296630859375,0,1500,0
106.83605122566223,733.0425415039062,0,1500,0
107.34800577163696,732.3817749023438,0,1500,0
107.83530306816101,733.1118774414062,0,1500,0
108.34066271781921,732.8367309570312,0,1500,0
108.83622789382935,733.0310668945312,0,1500,0
109.34944367408752,732.4727172851562,0,1500,0
109.8632869720459,732.6763916015625,0,1500,0
110.35724329948425,733.0660400390625,0,1500,0
110.84930038452148,732.6958618164062,0,1500,0
111.3606231212616,732.1471557617188,0,1500,0
111.8656075000763,732.282958984375,0,1500,0
112.37717700004578,732.9569091796875,0,1500,0
112.88024950027466,732.4874877929688,0,1500,0
113.39999890327454,732.5595092773438,0,1500,0
113.89824032783508,732.5113525390625,0,1500,0
114.4020185470581,733.0736694335938,0,1500,0
114.90607023239136,732.8317260742188,0,1500,0
115.40965414047241,732.526611328125,0,1500,0
115.90731191635132,732.2495727539062,0,1500,0
116.41089463233948,732.7234497070312,0,1500,0
116.90301251411438,732.4218139648438,0,1500,0
117.40648889541626,732.6760864257812,0,1500,0
117.9045717716217,732.2214965820312,0,1500,0
118.40824556350708,732.3949584960938,0,1500,0
118.89979267120361,732.6619873046875,0,1500,0
119.40331625938416,732.376953125,0,1500,0
119.89627170562744,732.5079956054688,0,1500,0
120.400066614151,732.1137084960938,0,1500,0
120.91370677947998,731.8875122070312,0,1500,0
121.4172854423523,732.6900024414062,0,1500,0
121.92636013031006,732.1572265625,0,1500,0
122.41396570205688,732.1244506835938,0,1500,0
122.91452431678772,732.4103393554688,0,1500,0
123.42626023292542,732.4965209960938,0,1500,0
123.92756915092468,732.5520629882812,0,1500,0
124.43911075592041,732.5181884765625,0,1500,0
124.93138599395752,732.4287719726562,0,1500,0
125.45589876174927,732.1082763671875,0,1500,0
125.96024441719055,732.310791015625,0,1500,0
126.46400451660156,732.5242309570312,0,1500,0
126.96424555778503,732.2899169921875,0,1500,0
127.45982050895691,732.0049438476562,0,1500,0
127.96066236495972,732.6720581054688,0,1500,0
128.473153591156,732.623779296875,0,1500,0
128.96871256828308,732.1889038085938,0,1500,0
129.46701550483704,732.1068115234375,0,1500,0
129.95970344543457,732.7489013671875,0,1500,0
130.47623682022095,732.6708374023438,0,1500,0
130.99562191963196,732.8326416015625,0,1500,0
131.49301886558533,732.3060302734375,0,1500,0
131.9982554912567,731.9757690429688,0,1500,0
132.4941976070404,732.5453491210938,0,1500,0
132.99770188331604,732.390380859375,0,1500,0
133.49496030807495,732.1614990234375,0,1500,0
133.9954719543457,732.0445556640625,0,1500,0
134.50425267219543,732.4649047851562,0,1500,0
134.99988198280334,732.53515625,0,1500,0
135.4964451789856,732.6347045898438,0,1500,0
135.99726343154907,732.3148803710938,0,1500,0
136.4977388381958,731.6599731445312,0,1500,0
137.00135207176208,732.798583984375,0,1500,0
137.49402236938477,732.497314453125,0,1500,0
138.00268054008484,732.8728637695312,0,1500,0
138.49208760261536,732.4168701171875,0,1500,0
138.99543738365173,732.4566040039062,0,1500,0
139.49302911758423,733.128173828125,0,1500,0
140.00743579864502,732.298583984375,0,1500,0
140.51126289367676,732.2265625,0,1500,0
141.00673985481262,732.2124633789062,0,1500,0
141.51988172531128,732.5635986328125,0,1500,0
142.00526118278503,732.6228637695312,0,1500,0
142.51653337478638,732.7254638671875,0,1500,0
143.0122663974762,732.6492919921875,0,1500,0
143.5054783821106,732.9176025390625,0,1500,0
144.01455974578857,732.5377807617188,0,1500,0
144.518128156662,732.7141723632812,0,1500,0
145.0185968875885,732.4791259765625,0,1500,0
145.50626420974731,732.0777587890625,0,1500,0
146.00868105888367,733.0890502929688,0,1500,0
146.5122470855713,732.552001953125,0,1500,0
147.0052309036255,732.5549926757812,0,1500,0
147.50873017311096,731.9013061523438,0,1500,0
148.01128387451172,733.3402709960938,0,1500,0
148.5146975517273,732.3557739257812,0,1500,0
149.00728821754456,732.0309448242188,0,1500,0
149.51870369911194,732.514892578125,0,1500,0
150.01815533638,731.9534301757812,0,1500,0
150.50553798675537,732.6205444335938,0,1500,0
151.00832295417786,732.9510498046875,0,1500,0
151.52013325691223,731.875,0,1500,0
152.0130045413971,732.2283325195312,0,1500,0
152.5083932876587,732.7096557617188,0,1500,0
153.0151641368866,733.0400390625,0,1500,0
153.5185465812683,732.8057861328125,0,1500,0
154.0213062763214,732.734130859375,0,1500,0
154.5331199169159,732.30615234375,0,1500,0
155.03760027885437,732.55078125,0,1500,0
155.5411820411682,732.74462890625,0,1500,0
156.03866624832153,732.4691162109375,0,1500,0
156.54221200942993,733.0499877929688,0,1500,0
157.05108284950256,732.80126953125,0,1500,0
157.53845405578613,732.4913330078125,0,1500,0
158.0408353805542,732.6092529296875,0,1500,0
158.53640055656433,732.3283081054688,0,1500,0
159.04928278923035,732.8461303710938,0,1500,0
159.54508662223816,732.1049194335938,0,1500,0
160.0433166027069,732.8253784179688,0,1500,0
160.54034423828125,732.8489379882812,0,1500,0
161.04423475265503,732.4447021484375,0,1500,0
161.54874753952026,732.9122924804688,0,1500,0
162.04141521453857,732.854736328125,0,1500,0
162.54530572891235,732.0595703125,0,1500,0
163.0408661365509,732.1587524414062,0,1500,0
163.54948163032532,732.7606811523438,0,1500,0
164.0512821674347,732.3399047851562,0,1500,0
164.5455641746521,732.3609619140625,0,1500,0
165.0411341190338,732.6495361328125,0,1500,0
165.54655575752258,732.4266357421875,0,1500,0
166.0382158756256,732.781494140625,0,1500,0
166.5526249408722,732.3757934570312,0,1500,0
167.05620336532593,732.6796264648438,0,1500,0
167.56410217285156,732.6314086914062,0,1500,0
168.0573582649231,732.921142578125,0,1500,0
168.56348252296448,732.4514770507812,0,1500,0
169.0672481060028,732.4031982421875,0,1500,0
169.55662512779236,732.5509643554688,0,1500,0
170.07128810882568,731.94482421875,0,1500,0
170.5825035572052,732.8922119140625,0,1500,0
171.0782928466797,732.5053100585938,0,1500,0
171.57472109794617,732.1006469726562,0,1500,0
172.06758618354797,732.1015625,0,1500,0
172.56881856918335,732.333251953125,0,1500,0
173.08016848564148,732.2040405273438,0,1500,0
173.57669639587402,732.1945190429688,0,1500,0
174.07673811912537,731.6620483398438,0,1500,0
174.57350873947144,732.4067993164062,0,1500,0
175.0692892074585,732.4907836914062,0,1500,0
175.5786828994751,732.1153564453125,0,1500,0
176.0878026485443,732.0914916992188,0,1500,0
176.59130430221558,732.0779418945312,0,1500,0
177.09263110160828,732.30810546875,0,1500,0
177.58822107315063,732.0590209960938,0,1500,0
178.09019994735718,731.6170654296875,0,1500,0
178.5857915878296,731.8146362304688,0,1500,0
179.09663486480713,731.8713989257812,0,1500,0
179.59230422973633,732.147216796875,0,1500,0
180.09210753440857,732.0651245117188,0,1500,0
180.59569931030273,731.7885131835938,0,1500,0
181.09533047676086,731.7990112304688,0,1500,0
181.59094905853271,732.3261108398438,0,1500,0
182.09143710136414,731.669677734375,0,1500,0
182.59520268440247,731.3997192382812,0,1500,0
183.08429956436157,731.62353515625,0,1500,0
183.58769273757935,731.2452392578125,0,1500,0
184.09260058403015,731.8643798828125,0,1500,0
184.5963010787964,731.7427978515625,0,1500,0
185.09376120567322,731.2079467773438,0,1500,0
185.594801902771,730.66455078125,0,1500,0
186.09830689430237,731.6077880859375,0,1500,0
186.58607721328735,731.521240234375,0,1500,0
187.09088730812073,731.558837890625,0,1500,0
187.58646869659424,731.5166015625,0,1500,0
188.09657788276672,731.090576171875,0,1500,0
188.58415055274963,731.9358520507812,0,1500,0
189.09007787704468,731.6688232421875,0,1500,0
189.60134935379028,731.6011962890625,0,1500,0
190.10670685768127,731.4515380859375,0,1500,0
190.60230684280396,732.1439819335938,0,1500,0
191.1261796951294,731.9303588867188,0,1500,0
191.62181615829468,731.7263793945312,0,1500,0
192.13089799880981,731.7136840820312,0,1500,0
192.6466462612152,731.9628295898438,0,1500,0
193.1489498615265,731.554931640625,0,1500,0
193.66136598587036,731.5841674804688,0,1500,0
194.1701045036316,731.0787353515625,0,1500,0
194.67419004440308,731.3689575195312,0,1500,0
195.1615071296692,732.1453247070312,0,1500,0
195.67194437980652,731.6448974609375,0,1500,0
196.17267966270447,731.58349609375,0,1500,0
196.66812682151794,731.614990234375,0,1500,0
197.17152047157288,731.995361328125,0,1500,0
197.6780755519867,731.6904907226562,0,1500,0
198.17831373214722,731.7920532226562,0,1500,0
198.69131708145142,731.3540649414062,0,1500,0
199.1868073940277,731.8009033203125,0,1500,0
199.69699335098267,731.8175659179688,0,1500,0
200.20419597625732,731.650146484375,0,1500,0
200.70861959457397,731.487548828125,0,1500,0
201.22420358657837,731.0845947265625,0,1500,0
201.7244894504547,731.9716796875,0,1500,0
202.23340916633606,731.545166015625,0,1500,0
202.73549008369446,731.1165161132812,0,1500,0
203.23126554489136,731.041748046875,0,1500,0
203.73651552200317,731.296875,0,1500,0
204.23750042915344,731.8023071289062,0,1500,0
204.74564957618713,731.3106689453125,0,1500,0
205.24134159088135,731.5545043945312,0,1500,0
205.75440001487732,731.25,0,1500,0
206.24769949913025,732.0252685546875,0,1500,0
206.74809384346008,731.6734619140625,0,1500,0
207.24338150024414,731.1898803710938,0,1500,0
207.74043250083923,731.2921142578125,0,1500,0
208.2412974834442,731.8297729492188,0,1500,0
208.7512309551239,731.609619140625,0,1500,0
209.24650382995605,731.4701538085938,0,1500,0
209.75135231018066,731.2677612304688,0,1500,0
210.25245070457458,730.8861083984375,0,1500,0
210.74022436141968,731.84423828125,0,1500,0
211.24015545845032,731.0755004882812,0,1500,0
211.74352979660034,731.0939331054688,0,1500,0
212.24044466018677,730.8336181640625,0,1500,0
212.74399733543396,731.502685546875,0,1500,0
213.24510288238525,731.1887817382812,0,1500,0
213.74041271209717,731.0885009765625,0,1500,0
214.24298095703125,730.7698364257812,0,1500,0
214.754558801651,731.1002807617188,0,1500,0
215.2471375465393,731.2167358398438,0,1500,0
215.74233293533325,731.337158203125,0,1500,0
216.24907183647156,730.9590454101562,0,1500,0
216.7444143295288,730.9268188476562,0,1500,0
217.24053144454956,731.2291870117188,0,1500,0
217.75233602523804,730.7810668945312,0,1500,0
218.24764609336853,731.0645141601562,0,1500,0
218.7433533668518,731.1431884765625,0,1500,0
219.24055409431458,730.8790893554688,0,1500,0
219.7441327571869,731.2369384765625,0,1500,0
220.24956369400024,731.123779296875,0,1500,0
220.7453351020813,730.9257202148438,0,1500,0
221.25070309638977,730.9368286132812,0,1500,0
221.75425052642822,730.201416015625,0,1500,0
222.2433376312256,731.0572509765625,0,1500,0
222.76285004615784,730.884033203125,0,1500,0
223.26463723182678,730.7330322265625,0,1500,0
223.78210973739624,730.425537109375,0,1500,0
224.27951979637146,731.19384765625,0,1500,0
224.77534294128418,731.3032836914062,0,1500,0
225.2795865535736,730.708984375,0,1500,0
225.77189230918884,730.8342895507812,0,1500,0
226.29568076133728,730.8099365234375,0,1500,0
226.79134321212769,730.8766479492188,0,1500,0
227.28710985183716,730.474365234375,0,1500,0
227.793518781662,730.3490600585938,0,1500,0
228.28902745246887,730.130126953125,0,1500,0
228.79662346839905,731.07080078125,0,1500,0
229.29336524009705,731.30712890625,0,1500,0
229.78985452651978,730.9267578125,0,1500,0
230.2933897972107,730.6443481445312,0,1500,0
230.79693865776062,730.8295288085938,0,1500,0
231.29255962371826,730.9025268554688,0,1500,0
231.790358543396,730.9505615234375,0,1500,0
232.3018057346344,730.6326904296875,0,1500,0
232.79949641227722,730.6260986328125,0,1500,0
233.2872862815857,730.6282958984375,0,1500,0
233.7979040145874,730.962158203125,0,1500,0
234.29347276687622,730.9152221679688,0,1500,0
234.79373145103455,730.6072387695312,0,1500,0
235.28934717178345,730.5105590820312,0,1500,0
235.79312205314636,730.8792114257812,0,1500,0
236.288902759552,730.7217407226562,0,1500,0
236.78813815116882,730.7306518554688,0,1500,0
237.29971551895142,730.3760375976562,0,1500,0
237.79181480407715,730.86328125,0,1500,0
238.29539561271667,730.57177734375,0,1500,0
238.78948092460632,730.7402954101562,0,1500,0
239.29326152801514,730.5693969726562,0,1500,0
239.78817629814148,730.6094360351562,0,1500,0
240.29953908920288,730.7681274414062,0,1500,0
240.79151725769043,730.4966430664062,0,1500,0
241.28731226921082,730.6890258789062,0,1500,0
241.79533171653748,730.5369262695312,0,1500,0
242.2882947921753,731.0658569335938,0,1500,0
242.7916431427002,730.6651000976562,0,1500,0
243.28947043418884,730.553955078125,0,1500,0
243.79114508628845,730.9339599609375,0,1500,0
244.30020403862,731.2847900390625,0,1500,0
244.78759717941284,730.8101806640625,0,1500,0
245.29383659362793,730.6248779296875,0,1500,0
245.79899072647095,730.872802734375,0,1500,0
246.28698658943176,730.1886596679688,0,1500,0
246.79059410095215,729.9505615234375,0,1500,0
247.30215430259705,730.8291015625,0,1500,0
247.8112552165985,730.1969604492188,0,1500,0
248.31921195983887,730.5068969726562,0,1500,0
248.83879709243774,729.7777099609375,0,1500,0
249.336083650589,730.6842041015625,0,1500,0
249.84428715705872,730.7486572265625,0,1500,0
250.337646484375,730.1779174804688,0,1500,0
250.83336353302002,730.0376586914062,0,1500,0
251.3392915725708,730.3797607421875,0,1500,0
251.8481638431549,730.3008422851562,0,1500,0
252.34795260429382,730.1734008789062,0,1500,0
252.85153102874756,729.8074340820312,0,1500,0
253.3568398952484,730.7689208984375,0,1500,0
253.85824418067932,730.6314697265625,0,1500,0
254.36563515663147,730.3142700195312,0,1500,0
254.87717008590698,730.2769775390625,0,1500,0
255.36687970161438,730.1282958984375,0,1500,0
255.874577999115,730.4290161132812,0,1500,0
256.3687241077423,730.298828125,0,1500,0
256.8723883628845,730.1901245117188,0,1500,0
257.3701021671295,729.8348999023438,0,1500,0
257.8711154460907,730.6105346679688,0,1500,0
258.3741412162781,730.3114013671875,0,1500,0
258.882328748703,729.9463500976562,0,1500,0
259.39390444755554,730.182373046875,0,1500,0
259.89437675476074,730.1954956054688,0,1500,0
260.3981568813324,731.7534790039062,0,1500,0
260.9164171218872,731.197021484375,0,1500,0
261.4122087955475,731.150390625,0,1500,0
261.913699388504,730.9860229492188,0,1500,0
262.41730546951294,731.8985595703125,0,1500,0
262.9263255596161,731.5145263671875,0,1500,0
263.42189598083496,731.6185913085938,0,1500,0
263.917592048645,731.0916137695312,0,1500,0
264.41337037086487,731.0173950195312,0,1500,0
264.9145619869232,731.8222045898438,0,1500,0
265.42613220214844,731.271484375,0,1500,0
265.91942286491394,731.2564697265625,0,1500,0
266.42322182655334,731.298828125,0,1500,0
266.9227135181427,731.5526733398438,0,1500,0
267.4262614250183,731.4793090820312,0,1500,0
267.9216568470001,731.5242919921875,0,1500,0
268.42519092559814,731.5233154296875,0,1500,0
268.91677355766296,732.1439819335938,0,1500,0
269.42038226127625,731.8170166015625,0,1500,0
269.914511680603,731.8746337890625,0,1500,0
270.42630553245544,731.843994140625,0,1500,0
270.9123578071594,731.3763427734375,0,1500,0
271.41575860977173,731.98486328125,0,1500,0
271.9133834838867,732.11572265625,0,1500,0
272.4167859554291,731.8052368164062,0,1500,0
272.91438579559326,731.2042846679688,0,1500,0
273.4261953830719,731.2328491210938,0,1500,0
273.92177653312683,731.860107421875,0,1500,0
274.41873836517334,731.3657836914062,0,1500,0
274.9143867492676,731.816162109375,0,1500,0
275.42738819122314,730.9407348632812,0,1500,0
275.9352786540985,731.4861450195312,0,1500,0
276.42762064933777,731.9021606445312,0,1500,0
276.9313893318176,731.6620483398438,0,1500,0
277.43821954727173,731.5580444335938,0,1500,0
277.93041825294495,731.5011596679688,0,1500,0
278.4394977092743,732.0621337890625,0,1500,0
278.92727851867676,731.8333129882812,0,1500,0
279.43469738960266,731.6861572265625,0,1500,0
279.92713165283203,731.7144165039062,0,1500,0
280.4336051940918,731.462890625,0,1500,0
280.9293851852417,731.7279663085938,0,1500,0
281.4344902038574,731.49951171875,0,1500,0
281.9358015060425,731.3805541992188,0,1500,0
282.43541407585144,731.6292114257812,0,1500,0
282.93888688087463,731.0039672851562,0,1500,0
283.4309034347534,730.1107788085938,0,1500,0
283.9394853115082,729.119384765625,0,1500,0
284.44778299331665,730.4625854492188,0,1500,0
284.95940613746643,730.1682739257812,0,1500,0
285.4666564464569,731.0305786132812,0,1500,0
285.9593152999878,732.3027954101562,0,1500,0
286.4639048576355,733.7178955078125,0,1500,0
286.95945858955383,733.9581909179688,0,1500,0
287.4728624820709,733.3180541992188,0,1500,0
287.95830273628235,730.4514770507812,0,1500,0
288.4821813106537,730.6284790039062,0,1500,0
288.99355959892273,730.2601318359375,0,1500,0
289.4914004802704,730.44580078125,0,1500,0
289.99840116500854,730.3113403320312,0,1500,0
290.49214935302734,730.7615966796875,0,1500,0
290.9955220222473,730.9921875,0,1500,0
291.4916801452637,730.844482421875,0,1500,0
291.98976826667786,730.3709106445312,0,1500,0
292.49340295791626,730.7306518554688,0,1500,0
292.990375995636,730.902099609375,0,1500,0
293.5017600059509,730.317138671875,0,1500,0
293.9953017234802,730.7666015625,0,1500,0
294.49069714546204,730.1460571289062,0,1500,0
294.99241065979004,730.677001953125,0,1500,0
295.50385904312134,730.6920776367188,0,1500,0
296.00121784210205,730.03515625,0,1500,0
296.5048007965088,730.2070922851562,0,1500,0
296.9954619407654,730.21533203125,0,1500,0
297.4910695552826,730.832763671875,0,1500,0
298.00169682502747,730.3251953125,0,1500,0
298.49728298187256,730.1272583007812,0,1500,0
298.99891233444214,729.9837646484375,0,1500,0
299.50249123573303,730.847412109375,0,1500,0
299.9986388683319,730.4718017578125,0,1500,0
300.49441385269165,730.4667358398438,0,1500,0
300.991660118103,730.3014526367188,0,1500,0
301.5594036579132,731.0823364257812,0,1500,0
302.0811116695404,730.4357299804688,0,1500,0
302.5765018463135,730.2181396484375,0,1500,0
303.0832145214081,730.139892578125,0,1500,0
303.5945692062378,729.4373779296875,0,1500,0
304.0907599925995,730.2632446289062,0,1500,0
304.5864169597626,729.923095703125,0,1500,0
305.0874960422516,730.0540771484375,0,1500,0
305.58955788612366,730.1754760742188,0,1500,0
306.09190487861633,730.1203002929688,0,1500,0
306.58998799324036,730.5043334960938,0,1500,0
307.0857951641083,730.148681640625,0,1500,0
307.585533618927,730.09619140625,0,1500,0
308.086030960083,730.078125,0,1500,0
308.5860209465027,730.1047973632812,0,1500,0
309.08957719802856,730.3092041015625,0,1500,0
309.583190202713,729.9573974609375,0,1500,0
310.09142661094666,730.2922973632812,0,1500,0
310.58342027664185,730.759765625,0,1500,0
311.09480476379395,730.3833618164062,0,1500,0
311.5855710506439,729.9751586914062,0,1500,0
312.09438705444336,729.866455078125,0,1500,0
312.5835471153259,730.2412719726562,0,1500,0
313.095335483551,730.2723999023438,0,1500,0
313.5873758792877,730.4046020507812,0,1500,0
314.0963845252991,730.3347778320312,0,1500,0
314.5906867980957,730.1818237304688,0,1500,0
315.0942370891571,731.2123413085938,0,1500,0
315.5947549343109,730.5265502929688,0,1500,0
316.08702659606934,730.4374389648438,0,1500,0
316.6327660083771,729.9661865234375,0,1500,0
317.1124498844147,730.1267700195312,0,1500,0
317.6122703552246,730.2127685546875,0,1500,0
318.16038155555725,730.3582153320312,0,1500,0
318.60801005363464,729.7412719726562,0,1500,0
319.1004800796509,730.3446044921875,0,1500,0
319.6122462749481,730.3150634765625,0,1500,0
320.12377285957336,730.3965454101562,0,1500,0
320.6354298591614,730.4439086914062,0,1500,0
321.149959564209,730.1302490234375,0,1500,0
321.65050888061523,730.1368408203125,0,1500,0
322.1588170528412,730.682861328125,0,1500,0
322.65443778038025,730.7417602539062,0,1500,0
323.17183017730713,730.1337280273438,0,1500,0
323.64867973327637,729.8595581054688,0,1500,0
324.14832758903503,729.3252563476562,0,1500,0
324.6469826698303,730.133056640625,0,1500,0
325.17047119140625,729.784423828125,0,1500,0
325.68303084373474,729.9304809570312,0,1500,0
326.1995642185211,729.7500610351562,0,1500,0
326.7151048183441,730.2261352539062,0,1500,0
327.21475195884705,730.0569458007812,0,1500,0
327.71837186813354,729.6510620117188,0,1500,0
328.2170238494873,729.4965209960938,0,1500,0
328.7237272262573,730.226806640625,0,1500,0
329.2372784614563,730.4642333984375,0,1500,0
329.74089908599854,729.56396484375,0,1500,0
330.24545550346375,729.5554809570312,0,1500,0
330.74564576148987,729.4481201171875,0,1500,0
331.24585461616516,729.507568359375,0,1500,0
331.74018239974976,729.6446533203125,0,1500,0
332.24555253982544,729.5989990234375,0,1500,0
332.7647247314453,729.2548217773438,0,1500,0
333.2821946144104,730.26318359375,0,1500,0
333.7996518611908,729.5616455078125,0,1500,0
334.28915643692017,729.7510986328125,0,1500,0
334.79140043258667,729.75390625,0,1500,0
335.2918584346771,729.1328125,0,1500,0
335.7915458679199,730.093017578125,0,1500,0
336.2948043346405,730.1541748046875,0,1500,0
336.8019664287567,729.7463989257812,0,1500,0
337.31826090812683,729.663818359375,0,1500,0
337.83768677711487,729.8133544921875,0,1500,0
338.3412857055664,729.7061767578125,0,1500,0
338.84293961524963,730.0208740234375,0,1500,0
339.34852504730225,729.2112426757812,0,1500,0
339.8506512641907,729.3071899414062,0,1500,0
340.35623717308044,729.9359130859375,0,1500,0
340.87475085258484,729.8942260742188,0,1500,0
341.3789095878601,729.2469482421875,0,1500,0
341.8648102283478,729.42333984375,0,1500,0
342.37992215156555,730.0779418945312,0,1500,0
342.8794994354248,730.2582397460938,0,1500,0
341.7249767780304,729.829833984375,0,1500,0
342.1606488227844,729.6062622070312,0,1500,0
342.6633837223053,730.5484619140625,0,1500,0
343.18213415145874,730.3671264648438,0,1500,0
343.6993067264557,730.0823974609375,0,1500,0
344.2178325653076,729.66455078125,0,1500,0
344.71841287612915,729.1611938476562,0,1500,0
345.2194583415985,730.1875,0,1500,0
345.70638155937195,730.308837890625,0,1500,0
346.2074246406555,729.9271850585938,0,1500,0
346.70863223075867,729.59130859375,0,1500,0
347.20730423927307,729.2410278320312,0,1500,0
347.72234177589417,730.1297607421875,0,1500,0
348.2408604621887,729.76513671875,0,1500,0
348.74435567855835,729.8447875976562,0,1500,0
349.2618525028229,729.6927490234375,0,1500,0
349.7654275894165,730.078125,0,1500,0
350.2663860321045,729.9640502929688,0,1500,0
350.7549571990967,729.9869995117188,0,1500,0
351.2597906589508,729.6002807617188,0,1500,0
351.76195311546326,729.7939453125,0,1500,0
352.2655358314514,730.2320556640625,0,1500,0
352.7658393383026,730.09033203125,0,1500,0
353.2561731338501,730.1808471679688,0,1500,0
353.76243472099304,729.6865234375,0,1500,0
354.2665853500366,729.954345703125,0,1500,0
354.75472259521484,730.1409912109375,0,1500,0
355.25898456573486,729.8382568359375,0,1500,0
355.7631323337555,729.7244262695312,0,1500,0
356.2545835971832,730.2164306640625,0,1500,0
356.76315116882324,730.427734375,0,1500,0
357.26560616493225,729.8541870117188,0,1500,0
357.76678943634033,730.3323364257812,0,1500,0
358.2552239894867,729.7283935546875,0,1500,0
358.76309275627136,730.116455078125,0,1500,0
359.2640743255615,729.9335327148438,0,1500,0
359.7551591396332,729.8672485351562,0,1500,0
360.2590820789337,729.76513671875,0,1500,0
360.76406621932983,729.6461181640625,0,1500,0
361.26806116104126,729.6337280273438,0,1500,0
361.7560691833496,729.8657836914062,0,1500,0
362.2726855278015,729.8265380859375,0,1500,0
362.7930941581726,729.7216796875,0,1500,0
363.3009819984436,730.22021484375,0,1500,0
363.80104804039,729.5733642578125,0,1500,0
364.31275701522827,729.8192749023438,0,1500,0
364.8170988559723,729.7156372070312,0,1500,0
365.3381886482239,729.1475219726562,0,1500,0
365.83973693847656,730.2205810546875,0,1500,0
366.33800077438354,730.0314331054688,0,1500,0
366.83573603630066,729.7090454101562,0,1500,0
367.4011423587799,729.6769409179688,0,1500,0
367.8347942829132,730.19580078125,0,1500,0
368.3328971862793,729.8101806640625,0,1500,0
368.834832906723,729.7550048828125,0,1500,0
369.3386676311493,729.5494995117188,0,1500,0
369.8310911655426,729.5326538085938,0,1500,0
370.3360548019409,730.3863525390625,0,1500,0
370.8420879840851,730.0446166992188,0,1500,0
371.3401963710785,729.4866333007812,0,1500,0
371.84190011024475,729.6720581054688,0,1500,0
372.3438837528229,730.1449584960938,0,1500,0
372.8312118053436,730.358642578125,0,1500,0
373.3511984348297,730.1914672851562,0,1500,0
373.8702027797699,729.89697265625,0,1500,0
374.3721981048584,729.7275390625,0,1500,0
374.87609577178955,730.0592041015625,0,1500,0
375.3642301559448,729.9467163085938,0,1500,0
375.88419914245605,729.5744018554688,0,1500,0
376.3891158103943,729.6533203125,0,1500,0
376.88811111450195,730.3643798828125,0,1500,0
377.3920967578888,729.8446044921875,0,1500,0
377.8787760734558,729.8706665039062,0,1500,0
378.3779172897339,729.6613159179688,0,1500,0
378.8821425437927,729.4827880859375,0,1500,0
379.38185930252075,729.5125732421875,0,1500,0
379.8878996372223,729.7921752929688,0,1500,0
380.38112568855286,729.6691284179688,0,1500,0
380.88652324676514,730.3031616210938,0,1500,0
381.39190220832825,730.1397094726562,0,1500,0
381.93286514282227,730.3477783203125,0,1500,0
382.41518115997314,730.0458374023438,0,1500,0
382.95556259155273,730.085693359375,0,1500,0
383.4230754375458,730.00048828125,0,1500,0
383.99984645843506,729.9735717773438,0,1500,0
384.4141013622284,730.2454833984375,0,1500,0
384.93311643600464,730.0671997070312,0,1500,0
385.4421007633209,730.088623046875,0,1500,0
386.0739314556122,730.1631469726562,0,1500,0
386.4640827178955,730.484619140625,0,1500,0
386.96779561042786,730.0693359375,0,1500,0
387.4596788883209,730.4432983398438,0,1500,0
387.96914863586426,730.036865234375,0,1500,0
388.4612281322479,730.666015625,0,1500,0
388.9831168651581,730.2687377929688,0,1500,0
389.48439383506775,730.271728515625,0,1500,0
389.97511315345764,730.2418823242188,0,1500,0
390.49523997306824,729.7498168945312,0,1500,0
391.0141053199768,730.6732788085938,0,1500,0
391.5171070098877,730.136474609375,0,1500,0
392.0051472187042,729.7069091796875,0,1500,0
392.5111219882965,729.8341674804688,0,1500,0
393.0137791633606,730.5433349609375,0,1500,0
393.52534675598145,730.682373046875,0,1500,0
394.0410735607147,729.9109497070312,0,1500,0
394.5411207675934,729.8287963867188,0,1500,0
395.04412722587585,729.8428344726562,0,1500,0
395.5440709590912,730.2880859375,0,1500,0
396.03811144828796,730.3794555664062,0,1500,0
396.54312229156494,730.416259765625,0,1500,0
397.0471234321594,729.8623046875,0,1500,0
397.5522344112396,730.5023193359375,0,1500,0
398.05710887908936,730.3619384765625,0,1500,0
398.55817461013794,730.1073608398438,0,1500,0
399.0771224498749,730.112548828125,0,1500,0
399.5679512023926,730.7581787109375,0,1500,0
400.072811126709,730.5032958984375,0,1500,0
400.5921382904053,729.9892578125,0,1500,0
401.09823966026306,729.53369140625,0,1500,0
401.6171164512634,729.9873046875,0,1500,0
402.12513256073,730.7614135742188,0,1500,0
402.6199531555176,730.7179565429688,0,1500,0
403.1787724494934,730.4711303710938,0,1500,0
403.63413548469543,729.9153442382812,0,1500,0
404.1341440677643,729.5615844726562,0,1500,0
404.71292424201965,730.5321655273438,0,1500,0
405.1561245918274,730.30517578125,0,1500,0
405.64624190330505,729.6577758789062,0,1500,0
406.23587918281555,729.542724609375,0,1500,0
406.6601266860962,730.3441162109375,0,1500,0
407.16521310806274,730.42041015625,0,1500,0
407.6731233596802,730.2811889648438,0,1500,0
408.17312598228455,729.6568603515625,0,1500,0
408.66512846946716,729.848388671875,0,1500,0
409.17225766181946,730.0878295898438,0,1500,0
409.65931391716003,730.1249389648438,0,1500,0
410.16323232650757,729.8645629882812,0,1500,0
410.6711275577545,729.3989868164062,0,1500,0
411.1872515678406,730.1253051757812,0,1500,0
411.6899473667145,729.741943359375,0,1500,0
412.1949429512024,729.6751708984375,0,1500,0
412.7151098251343,729.5565795898438,0,1500,0
413.2221212387085,729.8482055664062,0,1500,0
413.72911763191223,729.5287475585938,0,1500,0
414.2462933063507,729.7823486328125,0,1500,0
414.73862862586975,729.378662109375,0,1500,0
415.25613355636597,729.2552490234375,0,1500,0
415.75812911987305,729.3887329101562,0,1500,0
416.2672369480133,729.5496215820312,0,1500,0
416.76014399528503,729.2371826171875,0,1500,0
417.26411509513855,729.59765625,0,1500,0
417.7541308403015,729.0645751953125,0,1500,0
418.25899624824524,729.3678588867188,0,1500,0
418.7601327896118,729.6751708984375,0,1500,0
419.26154041290283,729.3404541015625,0,1500,0
419.76432180404663,729.3175048828125,0,1500,0
420.2571518421173,729.2387084960938,0,1500,0
420.76534724235535,730.1785278320312,0,1500,0
421.2541437149048,728.8668823242188,0,1500,0
421.779004573822,729.2628173828125,0,1500,0
422.2621796131134,728.5328979492188,0,1500,0
422.85282135009766,728.8861694335938,0,1500,0
423.2681384086609,729.001708984375,0,1500,0
423.8968529701233,728.8772583007812,0,1500,0
424.2592628002167,729.0051879882812,0,1500,0
424.76196002960205,728.697021484375,0,1500,0
425.26714038848877,729.1793212890625,0,1500,0
425.7681396007538,728.9309692382812,0,1500,0
426.2552649974823,728.8753662109375,0,1500,0
426.76124596595764,728.6157836914062,0,1500,0
427.26193261146545,729.6361694335938,0,1500,0
427.7682135105133,728.7989501953125,0,1500,0
428.2600450515747,728.7298583984375,0,1500,0
428.7662310600281,728.5526123046875,0,1500,0
429.2662386894226,729.2081298828125,0,1500,0
429.7562966346741,729.133056640625,0,1500,0
430.2599308490753,729.2277221679688,0,1500,0
430.76098704338074,729.0538940429688,0,1500,0
431.2647407054901,729.1539306640625,0,1500,0
431.7683653831482,729.320068359375,0,1500,0
432.2564399242401,728.8504638671875,0,1500,0
432.7602348327637,728.9949951171875,0,1500,0
433.26413655281067,728.93896484375,0,1500,0
433.76571249961853,728.2938232421875,0,1500,0
434.2655816078186,729.1668701171875,0,1500,0
434.8035123348236,728.8114013671875,0,1500,0
435.2534155845642,728.6150512695312,0,1500,0
435.7556803226471,729.0133056640625,0,1500,0
436.2604615688324,729.177001953125,0,1500,0
436.76630210876465,729.3329467773438,0,1500,0
437.2682554721832,728.8642578125,0,1500,0
437.7562553882599,728.674560546875,0,1500,0
438.26314783096313,728.3963623046875,0,1500,0
438.7655899524689,728.8775634765625,0,1500,0
439.2532148361206,729.4292602539062,0,1500,0
439.7586758136749,728.7683715820312,0,1500,0
440.2612829208374,728.4926147460938,0,1500,0
440.7679035663605,728.8226318359375,0,1500,0
441.25759530067444,728.6967163085938,0,1500,0
441.7641956806183,728.5747680664062,0,1500,0
442.2568895816803,728.6337280273438,0,1500,0
442.7605128288269,728.80322265625,0,1500,0
443.2790322303772,728.4419555664062,0,1500,0
443.7965602874756,728.7365112304688,0,1500,0
444.2872657775879,728.4028930664062,0,1500,0
444.7918789386749,728.6747436523438,0,1500,0
445.29949402809143,728.9313354492188,0,1500,0
445.7902019023895,729.2029418945312,0,1500,0
446.29730439186096,728.8040161132812,0,1500,0
446.787157535553,728.8033447265625,0,1500,0
447.28914976119995,728.64501953125,0,1500,0
447.7889709472656,729.202880859375,0,1500,0
448.2931571006775,728.8416137695312,0,1500,0
448.7841567993164,728.974609375,0,1500,0
449.2881805896759,728.4314575195312,0,1500,0
449.7911763191223,728.6528930664062,0,1500,0
450.29636096954346,728.8177490234375,0,1500,0
450.7879843711853,728.5336303710938,0,1500,0
451.28556418418884,728.3072509765625,0,1500,0
451.7921652793884,728.2315063476562,0,1500,0
452.2932913303375,729.0078125,0,1500,0
452.80016684532166,729.0638427734375,0,1500,0
453.3192262649536,729.6088256835938,0,1500,0
453.8362057209015,728.8955078125,0,1500,0
454.34415674209595,729.5835571289062,0,1500,0
454.8381841182709,729.1429443359375,0,1500,0
455.33936834335327,728.4732666015625,0,1500,0
455.8421747684479,728.9991455078125,0,1500,0
456.34516406059265,728.6409912109375,0,1500,0
456.8351674079895,729.2381591796875,0,1500,0
457.3391954898834,729.1280517578125,0,1500,0
457.8435969352722,729.14013671875,0,1500,0
458.335186958313,729.3142700195312,0,1500,0
458.83805227279663,729.6589965820312,0,1500,0
459.34017038345337,729.488037109375,0,1500,0
459.85617876052856,729.1268310546875,0,1500,0
460.34717893600464,728.9918212890625,0,1500,0
460.8502473831177,729.5423583984375,0,1500,0
461.357275724411,729.8692016601562,0,1500,0
461.8476457595825,729.5474243164062,0,1500,0
462.3661530017853,729.0125732421875,0,1500,0
462.8891716003418,728.9716796875,0,1500,0
463.39202880859375,729.1914672851562,0,1500,0
463.8810467720032,729.1046752929688,0,1500,0
464.3811857700348,729.1936645507812,0,1500,0
464.8835258483887,729.471435546875,0,1500,0
465.390175819397,729.254638671875,0,1500,0
465.8903920650482,730.0765991210938,0,1500,0
466.3913154602051,729.63671875,0,1500,0
466.87808752059937,729.4822387695312,0,1500,0
467.38417506217957,729.4719848632812,0,1500,0
467.8907344341278,728.8757934570312,0,1500,0
468.39518427848816,729.1835327148438,0,1500,0
468.91417717933655,729.2276611328125,0,1500,0
469.4192807674408,729.4050903320312,0,1500,0
469.9251148700714,729.2324829101562,0,1500,0
470.44589924812317,728.8447875976562,0,1500,0
470.95216059684753,729.8662109375,0,1500,0
471.4681806564331,729.8360595703125,0,1500,0
471.96117877960205,729.7784423828125,0,1500,0
472.46418023109436,729.2854614257812,0,1500,0
472.9841799736023,729.6102294921875,0,1500,0
473.4892280101776,729.3553466796875,0,1500,0
473.9943561553955,729.2932739257812,0,1500,0
474.4884932041168,729.4307861328125,0,1500,0
474.9981873035431,729.974365234375,0,1500,0
475.4992868900299,729.968505859375,0,1500,0
475.99034810066223,729.7044677734375,0,1500,0
476.50735449790955,729.6487426757812,0,1500,0
477.00965452194214,729.5293579101562,0,1500,0
477.51011300086975,729.71875,0,1500,0
478.00712513923645,729.5835571289062,0,1500,0
478.5138785839081,729.6260986328125,0,1500,0
479.01812291145325,729.2792358398438,0,1500,0
479.5062999725342,730.3895874023438,0,1500,0
480.0071859359741,729.5629272460938,0,1500,0
480.51218819618225,729.4977416992188,0,1500,0
481.0161929130554,729.3030395507812,0,1500,0
481.5041971206665,729.4738159179688,0,1500,0
482.0132267475128,730.1931762695312,0,1500,0
482.51625871658325,728.906494140625,0,1500,0
483.0062630176544,729.3907470703125,0,1500,0
483.5102994441986,729.4579467773438,0,1500,0
484.0162105560303,729.8416137695312,0,1500,0
484.5041995048523,729.8436279296875,0,1500,0
485.00898814201355,730.095703125,0,1500,0
485.51427125930786,729.62890625,0,1500,0
486.0053005218506,729.3416137695312,0,1500,0
486.50900769233704,730.1779174804688,0,1500,0
487.0131974220276,729.8912963867188,0,1500,0
487.5180609226227,730.1279907226562,0,1500,0
488.00930428504944,729.5887451171875,0,1500,0
488.51320242881775,729.2796630859375,0,1500,0
489.00422191619873,730.2151489257812,0,1500,0
489.5076024532318,729.9427490234375,0,1500,0
490.0103032588959,729.6549072265625,0,1500,0
490.5314083099365,730.020263671875,0,1500,0
491.03361225128174,730.4177856445312,0,1500,0
491.523229598999,729.8497924804688,0,1500,0
492.0311999320984,729.8382568359375,0,1500,0
492.5188834667206,729.675048828125,0,1500,0
493.0359992980957,729.5054931640625,0,1500,0
493.54430890083313,729.9435424804688,0,1500,0
494.03606963157654,730.0587768554688,0,1500,0
494.5402002334595,729.1771850585938,0,1500,0
495.042192697525,730.12646484375,0,1500,0
495.54332661628723,729.8347778320312,0,1500,0
496.0463089942932,730.080810546875,0,1500,0
496.54920387268066,729.61669921875,0,1500,0
497.03743505477905,729.6708374023438,0,1500,0
497.54349303245544,729.62548828125,0,1500,0
498.04733633995056,729.4694213867188,0,1500,0
498.5386583805084,729.69140625,0,1500,0
499.0362329483032,729.7166748046875,0,1500,0
499.5392105579376,729.5488891601562,0,1500,0
500.04736399650574,729.8014526367188,0,1500,0
500.5382969379425,729.8466796875,0,1500,0
501.0402183532715,729.909912109375,0,1500,0
501.5422270298004,729.3231201171875,0,1500,0
502.0469741821289,729.6554565429688,0,1500,0
502.5492191314697,729.81201171875,0,1500,0
503.037220954895,729.6571655273438,0,1500,0
503.5406653881073,729.5370483398438,0,1500,0
504.04304671287537,729.8014526367188,0,1500,0
504.5479009151459,729.3279418945312,0,1500,0
505.039026260376,730.0159912109375,0,1500,0
505.54322934150696,730.10205078125,0,1500,0
506.03518891334534,729.6192016601562,0,1500,0
506.53522634506226,729.7246704101562,0,1500,0
507.041974067688,729.798828125,0,1500,0
507.5453450679779,730.1472778320312,0,1500,0
508.0358428955078,729.5333862304688,0,1500,0
508.53822088241577,729.5108032226562,0,1500,0
509.04631447792053,729.1951293945312,0,1500,0
509.5352146625519,730.5607299804688,0,1500,0
510.04224610328674,729.669677734375,0,1500,0
510.5484130382538,729.8173828125,0,1500,0
511.03819251060486,730.0284423828125,0,1500,0
511.5412929058075,729.5126953125,0,1500,0
512.0442254543304,729.9290771484375,0,1500,0
512.5372431278229,729.4694213867188,0,1500,0
513.0381317138672,729.4099731445312,0,1500,0
513.5382137298584,729.8016357421875,0,1500,0
514.0427722930908,729.6163940429688,0,1500,0
514.5483782291412,730.3734130859375,0,1500,0
515.0392217636108,729.8750610351562,0,1500,0
515.5399498939514,729.8509521484375,0,1500,0
516.0502219200134,729.8784790039062,0,1500,0
516.5702168941498,730.4320678710938,0,1500,0
517.0793323516846,729.4522705078125,0,1500,0
517.5692331790924,729.6264038085938,0,1500,0
518.0722239017487,729.5189208984375,0,1500,0
518.5932519435883,729.5587768554688,0,1500,0
519.084230184555,730.0508422851562,0,1500,0
519.5863168239594,730.1468505859375,0,1500,0
520.0873303413391,729.7179565429688,0,1500,0
520.5892531871796,729.9348754882812,0,1500,0
521.0823473930359,730.1383056640625,0,1500,0
521.5890407562256,729.9295043945312,0,1500,0
522.096227645874,730.1641845703125,0,1500,0
522.5853333473206,729.5242919921875,0,1500,0
523.0922288894653,729.700927734375,0,1500,0
523.5950458049774,729.9676513671875,0,1500,0
524.081351518631,730.165283203125,0,1500,0
524.5970051288605,729.6611328125,0,1500,0
525.1143190860748,730.0958251953125,0,1500,0
525.6312429904938,729.6597290039062,0,1500,0
526.1340215206146,730.0089111328125,0,1500,0
526.638555765152,729.9287719726562,0,1500,0
527.1562597751617,729.69482421875,0,1500,0
527.6723008155823,729.8073120117188,0,1500,0
528.1603631973267,729.9158325195312,0,1500,0
528.6640486717224,729.6497802734375,0,1500,0
529.1630525588989,730.3980712890625,0,1500,0
529.6727604866028,729.5116577148438,0,1500,0
530.1662364006042,729.6138305664062,0,1500,0
530.6712653636932,729.6272583007812,0,1500,0
531.1712336540222,729.998291015625,0,1500,0
531.6632370948792,729.3307495117188,0,1500,0
532.1653256416321,729.185546875,0,1500,0
532.6712374687195,730.0142211914062,0,1500,0
533.1732232570648,729.158447265625,0,1500,0
533.6762392520905,729.578857421875,0,1500,0
534.1802837848663,729.359130859375,0,1500,0
534.7011551856995,728.9476928710938,0,1500,0
535.1932463645935,729.87158203125,0,1500,0
535.696409702301,730.0596313476562,0,1500,0
536.2152552604675,729.7166748046875,0,1500,0
536.722149848938,729.3336181640625,0,1500,0
537.2230489253998,730.206298828125,0,1500,0
537.7442398071289,729.7571411132812,0,1500,0
538.2662584781647,729.53369140625,0,1500,0
538.7562584877014,729.669921875,0,1500,0
539.2592310905457,729.3313598632812,0,1500,0
539.7613732814789,729.774658203125,0,1500,0
540.2543623447418,729.2096557617188,0,1500,0
540.7573699951172,729.2938842773438,0,1500,0
541.2622559070587,728.8553466796875,0,1500,0
541.7662572860718,730.0272216796875,0,1500,0
542.258248090744,729.9252319335938,0,1500,0
542.7642786502838,729.626220703125,0,1500,0
543.2532534599304,729.4364624023438,0,1500,0
543.7552545070648,729.4240112304688,0,1500,0
544.2582671642303,729.7249145507812,0,1500,0
544.7621684074402,729.4525146484375,0,1500,0
545.2661736011505,729.6013793945312,0,1500,0
545.7562544345856,729.4063110351562,0,1500,0
546.2592279911041,730.2594604492188,0,1500,0
546.7675909996033,729.7493286132812,0,1500,0
547.2554402351379,729.510986328125,0,1500,0
547.7592306137085,729.3998413085938,0,1500,0
548.2637400627136,729.3270263671875,0,1500,0
548.7643384933472,730.031005859375,0,1500,0
549.2582726478577,729.49853515625,0,1500,0
549.7603435516357,729.563232421875,0,1500,0
550.2622220516205,729.2576904296875,0,1500,0
550.7652907371521,729.451416015625,0,1500,0
551.253532409668,729.754150390625,0,1500,0
551.7566893100739,729.919921875,0,1500,0
552.2652368545532,729.471923828125,0,1500,0
552.7531344890594,728.6343383789062,0,1500,0
553.2558090686798,729.3327026367188,0,1500,0
553.7592988014221,729.7457275390625,0,1500,0
554.260267496109,729.541015625,0,1500,0
554.7683682441711,729.2941284179688,0,1500,0
555.2552337646484,728.8482055664062,0,1500,0
555.7623677253723,729.179931640625,0,1500,0
556.2670850753784,729.4659423828125,0,1500,0
556.7580010890961,729.2710571289062,0,1500,0
557.2613909244537,728.714599609375,0,1500,0
557.7663578987122,729.5326538085938,0,1500,0
558.2682807445526,729.1436767578125,0,1500,0
558.7559843063354,728.7623291015625,0,1500,0
559.2672753334045,729.28857421875,0,1500,0
559.753262758255,729.1183471679688,0,1500,0
560.2623171806335,729.3955688476562,0,1500,0
560.7542839050293,728.5242309570312,0,1500,0
561.2584023475647,729.1937255859375,0,1500,0
561.7672667503357,728.81201171875,0,1500,0
562.2563710212708,729.344970703125,0,1500,0
562.7572650909424,728.5184326171875,0,1500,0
563.2582669258118,728.7919311523438,0,1500,0
563.7622237205505,728.6513671875,0,1500,0
564.2613291740417,728.4616088867188,0,1500,0
564.763267993927,729.2271728515625,0,1500,0
565.2533104419708,728.8971557617188,0,1500,0
565.7591526508331,729.338134765625,0,1500,0
566.2643749713898,728.7698364257812,0,1500,0
566.754302740097,728.3765869140625,0,1500,0
567.2762942314148,729.2273559570312,0,1500,0
567.7973194122314,728.9522094726562,0,1500,0
568.2842707633972,728.8427734375,0,1500,0
568.8082919120789,728.3165893554688,0,1500,0
569.3242826461792,728.8135986328125,0,1500,0
569.8282942771912,728.5789794921875,0,1500,0
570.335232257843,728.7811889648438,0,1500,0
570.83638048172,728.3262939453125,0,1500,0
571.3444311618805,728.8358154296875,0,1500,0
571.8322739601135,729.2913208007812,0,1500,0
572.3356583118439,728.7256469726562,0,1500,0
572.8398611545563,728.9661254882812,0,1500,0
573.332293510437,728.8107299804688,0,1500,0
573.8362696170807,728.7130737304688,0,1500,0
574.3382897377014,728.4329833984375,0,1500,0
574.8393008708954,728.5980224609375,0,1500,0
575.3403191566467,728.6880493164062,0,1500,0
575.8452758789062,728.8004150390625,0,1500,0
576.3343391418457,728.592529296875,0,1500,0
576.8403692245483,728.7139282226562,0,1500,0
577.3444375991821,728.5706176757812,0,1500,0
577.8333950042725,728.8692626953125,0,1500,0
578.3373599052429,728.6796875,0,1500,0
578.84228515625,728.4723510742188,0,1500,0
579.3454217910767,728.3927612304688,0,1500,0
579.8333041667938,728.7092895507812,0,1500,0
580.3361504077911,728.1383666992188,0,1500,0
580.8412878513336,728.92333984375,0,1500,0
581.3323953151703,728.666748046875,0,1500,0
581.8403363227844,728.229736328125,0,1500,0
582.3442935943604,728.33349609375,0,1500,0
582.8323850631714,727.7600708007812,0,1500,0
583.3343350887299,728.5468139648438,0,1500,0
583.8402588367462,728.64794921875,0,1500,0
584.3452868461609,729.538330078125,0,1500,0
584.8364152908325,729.4105834960938,0,1500,0
585.3367440700531,729.8212280273438,0,1500,0
585.8432879447937,729.8377685546875,0,1500,0
586.3380906581879,730.3338623046875,0,1500,0
586.8414363861084,730.256591796875,0,1500,0
587.3433091640472,729.7957153320312,0,1500,0
587.8332812786102,730.1795654296875,0,1500,0
588.337051153183,730.31884765625,0,1500,0
588.8422951698303,729.7452392578125,0,1500,0
589.344300031662,729.3485717773438,0,1500,0
589.8322746753693,730.0652465820312,0,1500,0
590.3336334228516,730.005859375,0,1500,0
590.8393170833588,730.1487426757812,0,1500,0
591.3448357582092,729.680908203125,0,1500,0
591.8322999477386,730.0365600585938,0,1500,0
592.3372945785522,730.2183227539062,0,1500,0
592.8423693180084,730.4127807617188,0,1500,0
593.3332931995392,729.9752807617188,0,1500,0
593.8372948169708,729.8287353515625,0,1500,0
594.3400418758392,730.0789184570312,0,1500,0
594.8313083648682,730.3960571289062,0,1500,0
595.3383071422577,730.015869140625,0,1500,0
595.8452939987183,729.6561889648438,0,1500,0
596.3374066352844,729.5477905273438,0,1500,0
596.8444275856018,730.4131469726562,0,1500,0
597.3463070392609,730.5950317382812,0,1500,0
597.8323788642883,729.8983154296875,0,1500,0
598.3393008708954,729.8028564453125,0,1500,0
598.8394343852997,729.7216796875,0,1500,0
599.3442935943604,730.3692016601562,0,1500,0
599.8594088554382,730.0975952148438,0,1500,0
600.3623464107513,729.7485961914062,0,1500,0
600.8799288272858,729.6320190429688,0,1500,0
601.3848738670349,729.63720703125,0,1500,0
601.8923857212067,730.3755493164062,0,1500,0
602.3794071674347,729.5507202148438,0,1500,0
602.8853216171265,729.8187866210938,0,1500,0
603.3903138637543,729.3197631835938,0,1500,0
603.8813109397888,730.3689575195312,0,1500,0
604.3873071670532,730.1572265625,0,1500,0
604.9023683071136,730.3622436523438,0,1500,0
605.4083251953125,730.0234375,0,1500,0
605.8974351882935,729.9129028320312,0,1500,0
606.400768995285,730.124267578125,0,1500,0
606.9183170795441,730.3641357421875,0,1500,0
607.4233117103577,729.8202514648438,0,1500,0
607.9119961261749,729.8406982421875,0,1500,0
608.4163112640381,729.928955078125,0,1500,0
608.9173288345337,730.2460327148438,0,1500,0
609.4245493412018,730.4332275390625,0,1500,0
609.9269630908966,730.0872802734375,0,1500,0
610.4284288883209,730.088623046875,0,1500,0
610.9503457546234,730.3909912109375,0,1500,0
611.4413182735443,730.07373046875,0,1500,0
611.9483139514923,730.1504516601562,0,1500,0
612.4543986320496,730.2261352539062,0,1500,0
612.9414384365082,730.01318359375,0,1500,0
613.4405055046082,730.3607788085938,0,1500,0
613.9414715766907,730.0516967773438,0,1500,0
614.4593229293823,730.7192993164062,0,1500,0
614.9651300907135,730.1666870117188,0,1500,0
615.4695219993591,730.328857421875,0,1500,0
615.9701256752014,730.2622680664062,0,1500,0
616.4620640277863,729.9041748046875,0,1500,0
616.9644446372986,729.9840087890625,0,1500,0
617.4564850330353,730.0004272460938,0,1500,0
617.9592759609222,729.5689086914062,0,1500,0
618.462320804596,730.0297241210938,0,1500,0
618.9644229412079,729.624755859375,0,1500,0
619.4703197479248,729.5187377929688,0,1500,0
619.9744596481323,729.5864868164062,0,1500,0
620.4813041687012,730.2615356445312,0,1500,0
620.9853446483612,729.8048095703125,0,1500,0
621.4767875671387,729.8015747070312,0,1500,0
621.991313457489,729.7001953125,0,1500,0
622.5134029388428,730.3963012695312,0,1500,0
623.0183308124542,729.9739379882812,0,1500,0
623.5089766979218,729.5230102539062,0,1500,0
624.0113370418549,729.380126953125,0,1500,0
624.5093343257904,729.9922485351562,0,1500,0
625.0133361816406,730.3368530273438,0,1500,0
625.5323262214661,729.6807250976562,0,1500,0
626.0334346294403,729.7957763671875,0,1500,0
626.541205406189,729.8658447265625,0,1500,0
627.0407457351685,730.2689208984375,0,1500,0
627.5464296340942,729.6119384765625,0,1500,0
628.0474324226379,729.8727416992188,0,1500,0
628.549329996109,729.9325561523438,0,1500,0
629.0412952899933,729.5095825195312,0,1500,0
629.5443575382233,730.0391235351562,0,1500,0
630.0473303794861,730.1373291015625,0,1500,0
630.5381247997284,730.0037841796875,0,1500,0
631.0392851829529,729.5430908203125,0,1500,0
631.5464568138123,730.1873779296875,0,1500,0
632.0383002758026,729.9243774414062,0,1500,0
632.5424375534058,730.1251220703125,0,1500,0
633.0454881191254,729.683837890625,0,1500,0
633.5344717502594,729.7249755859375,0,1500,0
634.0413024425507,730.1141357421875,0,1500,0
634.5439095497131,730.13134765625,0,1500,0
635.0473337173462,729.8594970703125,0,1500,0
635.5484576225281,730.1802368164062,0,1500,0
636.0363235473633,729.5835571289062,0,1500,0
636.5414023399353,730.4406127929688,0,1500,0
637.0474555492401,729.7859497070312,0,1500,0
637.5391354560852,730.0454711914062,0,1500,0
638.0594732761383,729.9772338867188,0,1500,0
638.5763659477234,730.231689453125,0,1500,0
639.0813653469086,730.0679321289062,0,1500,0
639.5864400863647,730.0628662109375,0,1500,0
640.0903427600861,730.01806640625,0,1500,0
640.5954713821411,729.77099609375,0,1500,0
641.0863466262817,730.1526489257812,0,1500,0
641.5903649330139,730.3168334960938,0,1500,0
642.0963294506073,729.7317504882812,0,1500,0
642.5970804691315,729.4705200195312,0,1500,0
643.1162955760956,730.2893676757812,0,1500,0
643.6318137645721,729.6984252929688,0,1500,0
644.1345973014832,730.2357177734375,0,1500,0
644.6329295635223,729.8164672851562,0,1500,0
645.1363487243652,730.13330078125,0,1500,0
645.6393482685089,730.0938720703125,0,1500,0
646.1413640975952,730.091552734375,0,1500,0
646.6303577423096,730.2125854492188,0,1500,0
647.1335573196411,729.9197387695312,0,1500,0
647.6413478851318,729.8872680664062,0,1500,0
648.1283740997314,730.2870483398438,0,1500,0
648.6329209804535,730.524658203125,0,1500,0
649.1343734264374,730.3948974609375,0,1500,0
649.6403503417969,729.5363159179688,0,1500,0
650.1283814907074,730.3399047851562,0,1500,0
650.6343688964844,730.128173828125,0,1500,0
651.1343510150909,730.2460327148438,0,1500,0
651.6353497505188,729.6971435546875,0,1500,0
652.1344425678253,730.4064331054688,0,1500,0
652.6413543224335,730.6304321289062,0,1500,0
653.1284582614899,730.3389892578125,0,1500,0
653.6331641674042,730.1661987304688,0,1500,0
654.1313512325287,729.6845092773438,0,1500,0
654.6394786834717,730.6192626953125,0,1500,0
655.1423583030701,730.4951782226562,0,1500,0
655.630366563797,730.0625,0,1500,0
656.1343545913696,730.3001708984375,0,1500,0
656.6403572559357,729.5575561523438,0,1500,0
657.1434834003448,730.170166015625,0,1500,0
657.6623585224152,730.5265502929688,0,1500,0
658.162359714508,730.2327880859375,0,1500,0
658.6793661117554,729.9924926757812,0,1500,0
659.1833651065826,729.9827270507812,0,1500,0
659.6883583068848,730.0685424804688,0,1500,0
660.1903834342957,729.8935546875,0,1500,0
660.7073631286621,729.7691650390625,0,1500,0
661.2082965373993,729.3458862304688,0,1500,0
661.7124736309052,730.2554321289062,0,1500,0
662.2178568840027,729.9962158203125,0,1500,0
662.7073650360107,729.477783203125,0,1500,0
663.2083683013916,729.7625122070312,0,1500,0
663.7143819332123,729.4055786132812,0,1500,0
664.2133195400238,730.0875244140625,0,1500,0
664.7154417037964,730.05322265625,0,1500,0
665.2203438282013,729.7767944335938,0,1500,0
665.7084693908691,729.816162109375,0,1500,0
666.213374376297,730.257080078125,0,1500,0
666.7144861221313,730.1531372070312,0,1500,0
667.2183663845062,729.7247314453125,0,1500,0
667.7074680328369,729.6597290039062,0,1500,0
668.2124035358429,729.8968505859375,0,1500,0
668.7175068855286,729.9125366210938,0,1500,0
669.2060692310333,729.8991088867188,0,1500,0
669.7123789787292,729.5785522460938,0,1500,0
670.2194123268127,729.2266845703125,0,1500,0
670.708477973938,729.53857421875,0,1500,0
671.2139773368835,729.4595336914062,0,1500,0
671.7143762111664,729.7854614257812,0,1500,0
672.220377445221,729.6322021484375,0,1500,0
672.7133722305298,729.5733642578125,0,1500,0
673.2203743457794,729.862548828125,0,1500,0
673.7082576751709,729.5731201171875,0,1500,0
674.2084074020386,729.3483276367188,0,1500,0
674.7123761177063,729.1989135742188,0,1500,0
675.2171986103058,729.6852416992188,0,1500,0
675.7074024677277,729.5347290039062,0,1500,0
676.2102377414703,729.2289428710938,0,1500,0
676.7113919258118,729.4199829101562,0,1500,0
677.2151148319244,729.1832885742188,0,1500,0
677.7213757038116,729.2188720703125,0,1500,0
678.2095000743866,728.6167602539062,0,1500,0
678.7153723239899,729.6615600585938,0,1500,0
679.2136900424957,729.427978515625,0,1500,0
679.7171704769135,729.2252807617188,0,1500,0
680.2213833332062,729.2103271484375,0,1500,0
680.7083911895752,729.2479248046875,0,1500,0
681.2083966732025,728.9098510742188,0,1500,0
681.7143852710724,728.7131958007812,0,1500,0
682.2164874076843,728.6968994140625,0,1500,0
682.7061915397644,728.6075439453125,0,1500,0
683.2068064212799,729.114990234375,0,1500,0
683.7094323635101,729.601806640625,0,1500,0
684.2148129940033,728.8600463867188,0,1500,0
684.7165977954865,729.023193359375,0,1500,0
685.2093896865845,728.7042236328125,0,1500,0
685.713559627533,728.8934326171875,0,1500,0
686.219480752945,728.6994018554688,0,1500,0
686.7124102115631,728.4548950195312,0,1500,0
687.2163858413696,728.8148803710938,0,1500,0
687.7074196338654,728.9837036132812,0,1500,0
688.2103946208954,728.958984375,0,1500,0
688.7124845981598,728.8912963867188,0,1500,0
689.2176587581635,728.80224609375,0,1500,0
689.721476316452,728.8414306640625,0,1500,0
690.2093842029572,729.5272827148438,0,1500,0
690.714492559433,729.2055053710938,0,1500,0
691.2140147686005,728.7633056640625,0,1500,0
691.7173917293549,728.4962768554688,0,1500,0
692.2083902359009,728.7644653320312,0,1500,0
692.713495016098,729.04638671875,0,1500,0
693.2179877758026,728.978515625,0,1500,0
693.7105135917664,728.4578247070312,0,1500,0
694.2113943099976,728.5236206054688,0,1500,0
694.7103939056396,728.4364624023438,0,1500,0
695.2308988571167,729.0691528320312,0,1500,0
695.7333996295929,728.7947998046875,0,1500,0
696.2225658893585,728.6931762695312,0,1500,0
696.7305009365082,728.5969848632812,0,1500,0
697.2523820400238,729.3259887695312,0,1500,0
697.7403852939606,729.10888671875,0,1500,0
698.2434163093567,728.9061889648438,0,1500,0
698.7393138408661,729.0474853515625,0,1500,0
699.2523920536041,729.4384155273438,0,1500,0
699.7403953075409,729.4031372070312,0,1500,0
700.2484004497528,729.3204345703125,0,1500,0
700.7384159564972,729.2774047851562,0,1500,0
701.2423987388611,728.91552734375,0,1500,0
701.7485105991364,729.5635986328125,0,1500,0
702.2509281635284,729.5350952148438,0,1500,0
702.7383999824524,728.7246704101562,0,1500,0
703.2415521144867,728.8885498046875,0,1500,0
703.7445065975189,729.5442504882812,0,1500,0
704.262405872345,729.626220703125,0,1500,0
704.7684016227722,729.6932373046875,0,1500,0
705.2695603370667,729.245849609375,0,1500,0
705.77321600914,728.8859252929688,0,1500,0
706.2869732379913,729.4622192382812,0,1500,0
706.793404340744,729.2614135742188,0,1500,0
707.2994570732117,729.3272705078125,0,1500,0
707.7854037284851,729.4703369140625,0,1500,0
708.287436246872,730.0203247070312,0,1500,0
708.7904019355774,729.7320556640625,0,1500,0
709.2854907512665,729.4447631835938,0,1500,0
709.7934625148773,729.3504638671875,0,1500,0
710.2995507717133,729.244873046875,0,1500,0
710.7874064445496,729.5388793945312,0,1500,0
711.2913646697998,729.5162963867188,0,1500,0
711.7963490486145,729.7341918945312,0,1500,0
712.284414768219,729.0831298828125,0,1500,0
712.7864105701447,729.0103759765625,0,1500,0
713.288414478302,729.7858276367188,0,1500,0
713.785210609436,729.4956665039062,0,1500,0
714.2844111919403,729.384033203125,0,1500,0
714.7895410060883,729.4168701171875,0,1500,0
715.292519569397,729.1214599609375,0,1500,0
715.8134844303131,729.4590454101562,0,1500,0
716.3164160251617,729.8528442382812,0,1500,0
716.836433172226,729.4844970703125,0,1500,0
717.3444135189056,729.2295532226562,0,1500,0
717.8335189819336,729.5311279296875,0,1500,0
718.3405153751373,729.299072265625,0,1500,0
718.8325066566467,729.4967041015625,0,1500,0
719.3374116420746,729.1517333984375,0,1500,0
719.8454215526581,728.8944702148438,0,1500,0
720.3325288295746,729.5659790039062,0,1500,0
720.8353714942932,729.4605712890625,0,1500,0
721.350433588028,729.2714233398438,0,1500,0
721.8674211502075,729.2106323242188,0,1500,0
722.3844306468964,729.6192016601562,0,1500,0
722.8909158706665,729.5402221679688,0,1500,0
723.3814287185669,728.8078002929688,0,1500,0
723.8864417076111,729.4190673828125,0,1500,0
724.3914279937744,728.638427734375,0,1500,0
724.8924407958984,729.4646606445312,0,1500,0
725.3823864459991,729.4932250976562,0,1500,0
725.8854329586029,729.1647338867188,0,1500,0
726.3864071369171,728.7008056640625,0,1500,0
726.8897778987885,729.1210327148438,0,1500,0
727.3784399032593,729.03466796875,0,1500,0
727.8835506439209,729.5775756835938,0,1500,0
728.3845374584198,728.7828369140625,0,1500,0
728.8914103507996,728.6615600585938,0,1500,0
729.3803761005402,729.2899169921875,0,1500,0
729.885500907898,729.2308959960938,0,1500,0
730.3911259174347,729.0620727539062,0,1500,0
730.8814921379089,729.3307495117188,0,1500,0
731.3855488300323,728.7444458007812,0,1500,0
731.891642332077,729.3438720703125,0,1500,0
732.3784461021423,729.365478515625,0,1500,0
732.8835797309875,729.40966796875,0,1500,0
733.3854291439056,729.1818237304688,0,1500,0
733.8987982273102,729.08056640625,0,1500,0
734.4195373058319,729.0992431640625,0,1500,0
734.9094996452332,729.590576171875,0,1500,0
735.4144344329834,729.4368286132812,0,1500,0
735.9232349395752,730.15869140625,0,1500,0
736.4141323566437,729.6661987304688,0,1500,0
736.9322466850281,729.7133178710938,0,1500,0
737.4355373382568,729.6981811523438,0,1500,0
737.9534335136414,729.2515869140625,0,1500,0
738.4574353694916,729.6557006835938,0,1500,0
738.9614391326904,729.9361572265625,0,1500,0
739.4653973579407,729.322265625,0,1500,0
739.9651484489441,729.4105224609375,0,1500,0
740.4675424098969,729.3399658203125,0,1500,0
740.959579706192,729.9390258789062,0,1500,0
741.4644362926483,729.4843139648438,0,1500,0
741.9659645557404,729.7620239257812,0,1500,0
742.4704825878143,729.4279174804688,0,1500,0
742.9695327281952,730.0264282226562,0,1500,0
743.456545829773,729.6743774414062,0,1500,0
743.9645764827728,729.6253662109375,0,1500,0
744.4603123664856,729.6171264648438,0,1500,0
744.9604384899139,729.3040771484375,0,1500,0
745.4674427509308,730.1423950195312,0,1500,0
745.9594435691833,729.4614868164062,0,1500,0
746.462553024292,729.721435546875,0,1500,0
746.9614496231079,728.99609375,0,1500,0
747.4683611392975,729.8306274414062,0,1500,0
747.9584672451019,729.6141967773438,0,1500,0
748.4574434757233,729.389892578125,0,1500,0
748.9594490528107,729.9527587890625,0,1500,0
749.4634444713593,729.0914916992188,0,1500,0
749.9674525260925,729.8192138671875,0,1500,0
750.4565243721008,729.7271728515625,0,1500,0
750.9584448337555,729.22998046875,0,1500,0
751.4638760089874,729.3863525390625,0,1500,0
751.9692997932434,730.0453491210938,0,1500,0
752.4615519046783,730.01416015625,0,1500,0
752.962465763092,729.4415283203125,0,1500,0
753.466557264328,729.7141723632812,0,1500,0
753.9696803092957,728.8704223632812,0,1500,0
754.4564507007599,729.7963256835938,0,1500,0
754.9615616798401,729.6683349609375,0,1500,0
755.465452671051,729.1278686523438,0,1500,0
755.9684596061707,729.3875122070312,0,1500,0
756.4585330486298,728.7589721679688,0,1500,0
756.9644446372986,729.2314453125,0,1500,0
757.4676413536072,729.48876953125,0,1500,0
757.958165884018,729.5195922851562,0,1500,0
758.466463804245,729.0545043945312,0,1500,0
758.9708805084229,729.7254638671875,0,1500,0
759.4579389095306,729.2935791015625,0,1500,0
759.9655888080597,729.0636596679688,0,1500,0
760.469598531723,728.9197387695312,0,1500,0
760.9580717086792,729.4669189453125,0,1500,0
761.464546918869,729.6776733398438,0,1500,0
761.970561504364,729.2196044921875,0,1500,0
762.4601004123688,729.3876953125,0,1500,0
762.9654700756073,729.099853515625,0,1500,0
763.4559574127197,729.3668212890625,0,1500,0
763.9561426639557,729.4410400390625,0,1500,0
764.4625804424286,729.381591796875,0,1500,0
764.9683563709259,728.9885864257812,0,1500,0
765.4576494693756,728.8641357421875,0,1500,0
765.9595715999603,729.2737426757812,0,1500,0
766.462235212326,729.62109375,0,1500,0
766.9778292179108,729.1820068359375,0,1500,0
767.498770236969,729.1222534179688,0,1500,0
768.0060214996338,729.29736328125,0,1500,0
768.5184671878815,729.414306640625,0,1500,0
769.040411233902,729.0081176757812,0,1500,0
769.5354588031769,729.1416015625,0,1500,0
770.0463042259216,729.0206298828125,0,1500,0
770.5355780124664,729.6100463867188,0,1500,0
771.039484500885,729.691162109375,0,1500,0
771.5392093658447,729.2655029296875,0,1500,0
772.0455627441406,728.9880981445312,0,1500,0
772.545184135437,729.4111938476562,0,1500,0
773.0385694503784,729.554931640625,0,1500,0
773.5369558334351,729.5009765625,0,1500,0
774.0413572788239,729.0881958007812,0,1500,0
774.5446062088013,728.80419921875,0,1500,0
775.0484704971313,729.5033569335938,0,1500,0
775.5494890213013,729.9521484375,0,1500,0
776.0472843647003,729.2039794921875,0,1500,0
776.5342254638672,729.2314453125,0,1500,0
777.0479681491852,728.9542846679688,0,1500,0
777.5492918491364,729.9642944335938,0,1500,0
778.0484752655029,729.7318115234375,0,1500,0
778.5614714622498,729.3687133789062,0,1500,0
779.0799708366394,729.8245239257812,0,1500,0
779.5954813957214,729.5887451171875,0,1500,0
780.0815074443817,729.4508666992188,0,1500,0
780.5845804214478,729.0000610351562,0,1500,0
781.0854828357697,729.1090698242188,0,1500,0
781.5859024524689,730.1502685546875,0,1500,0
782.094583272934,729.91015625,0,1500,0
