id,temperature
1,22
2,11
3,-7
4,30
5,31
6,18
7,2
8,23
9,22
10,16
11,11
12,-7
13,18
14,29
15,8
16,9
17,29
18,1
19,-6
20,29
21,19
22,16
23,34
24,37
25,10
26,5
27,-10
28,37
29,6
30,40
31,9
32,-3
33,40
34,32
35,11
36,2
37,28
38,38
39,38
40,5
41,22
42,2
43,17
44,13
45,17
46,-1
47,16
48,10
49,-9
50,16
51,30
52,0
53,34
54,15
55,40
56,6
57,14
58,25
59,-2
60,10
61,38
62,13
63,11
64,28
65,37
66,38
67,32
68,12
69,14
70,2
71,31
72,35
73,35
74,28
75,34
76,29
77,29
78,7
79,30
80,20
81,22
82,-10
83,5
84,5
85,14
86,-8
87,0
88,38
89,39
90,13
91,11
92,18
93,-1
94,5
95,30
96,-7
97,2
98,28
99,-8
100,37
101,17
102,6
103,-9
104,40
105,31
106,25
107,38
108,-9
109,32
110,-5
111,34
112,36
113,11
114,24
115,-10
116,39
117,34
118,15
119,25
120,40
121,31
122,38
123,12
124,20
125,34
126,17
127,25
128,13
129,-6
130,26
131,-9
132,-3
133,12
134,15
135,10
136,-9
137,21
138,-7
139,-6
140,6
141,34
142,4
143,29
144,21
145,30
146,38
147,0
148,5
149,-10
150,-3
151,31
152,38
153,31
154,38
155,35
156,27
157,15
158,6
159,22
160,3
161,5
162,5
163,8
164,40
165,-5
166,21
167,29
168,9
169,-4
170,17
171,19
172,38
173,-9
174,27
175,36
176,14
177,2
178,6
179,0
180,-6
181,18
182,-6
183,39
184,-6
185,31
186,39
187,10
188,14
189,30
190,-4
191,37
192,1
193,31
194,35
195,-9
196,-8
197,30
198,20
199,35
200,34
201,15
202,4
203,4
204,-1
205,0
206,-2
207,-9
208,13
209,7
210,34
211,1
212,34
213,18
214,15
215,9
216,24
217,33
218,-3
219,11
220,-9
221,2
222,19
223,27
224,1
225,0
226,-1
227,9
228,33
229,11
230,-7
231,5
232,3
233,-3
234,22
235,-9
236,19
237,3
238,-7
239,7
240,24
241,38
242,34
243,14
244,-3
245,4
246,-1
247,-10
248,22
249,31
250,-6
251,10
252,3
253,7
254,-4
255,-10
256,22
257,30
258,4
259,-1
260,20
261,7
262,25
263,-6
264,-3
265,39
266,11
267,14
268,6
269,19
270,24
271,10
272,-7
273,39
274,28
275,23
276,30
277,37
278,15
279,26
280,-3
281,32
282,30
283,38
284,29
285,31
286,1
287,29
288,39
289,1
290,26
291,14
292,6
293,40
294,15
295,1
296,38
297,-2
298,-9
299,6
300,5
301,-2
302,8
303,-6
304,12
305,22
306,10
307,-1
308,-2
309,12
310,25
311,33
312,2
313,33
314,23
315,4
316,1
317,2
318,8
319,33
320,9
321,-8
322,11
323,-8
324,22
325,-6
326,35
327,-2
328,22
329,21
330,0
331,-8
332,0
333,5
334,38
335,39
336,38
337,35
338,35
339,36
340,5
341,-1
342,14
343,-10
344,34
345,-7
346,33
347,-5
348,22
349,34
350,38
351,32
352,25
353,13
354,-1
355,-3
356,16
357,28
358,17
359,21
360,0
361,-9
362,37
363,39
364,28
365,16
366,-2
367,-10
368,-4
369,26
370,5
371,14
372,16
373,-6
374,40
375,35
376,26
377,-1
378,-5
379,20
380,6
381,5
382,-6
383,14
384,1
385,31
386,-9
387,14
388,-3
389,-6
390,40
391,31
392,17
393,40
394,16
395,35
396,32
397,-10
398,12
399,16
400,-7
401,27
402,11
403,34
404,1
405,-6
406,23
407,23
408,9
409,-7
410,-7
411,0
412,-8
413,-9
414,-2
415,-2
416,7
417,24
418,38
419,35
420,20
421,17
422,31
423,33
424,-9
425,-4
426,4
427,1
428,27
429,2
430,15
431,-8
432,22
433,6
434,16
435,-6
436,-2
437,-3
438,15
439,-2
440,22
441,31
442,30
443,12
444,-1
445,3
446,20
447,-2
448,38
449,29
450,8
451,31
452,4
453,33
454,31
455,18
456,39
457,33
458,39
459,36
460,2
461,11
462,-8
463,-9
464,18
465,32
466,40
467,0
468,39
469,26
470,22
471,-6
472,22
473,-1
474,20
475,17
476,21
477,-3
478,-4
479,12
480,3
481,38
482,29
483,39
484,24
485,2
486,-9
487,24
488,-6
489,4
490,-3
491,5
492,-9
493,29
494,34
495,25
496,11
497,28
498,20
499,12
500,37
501,2
502,-4
503,29
504,17
505,6
506,-9
507,28
508,38
509,33
510,37
511,-7
512,18
513,37
514,36
515,-5
516,21
517,13
518,-9
519,13
520,10
521,38
522,9
523,20
524,30
525,28
526,31
527,29
528,35
529,34
530,3
531,26
532,25
533,11
534,6
535,-5
536,25
537,10
538,35
539,-7
540,7
541,34
542,-10
543,25
544,28
545,30
546,16
547,16
548,38
549,26
550,19
551,40
552,31
553,24
554,2
555,2
556,-10
557,22
558,9
559,36
560,15
561,27
562,22
563,-3
564,14
565,34
566,-8
567,-1
568,-4
569,22
570,12
571,34
572,34
573,16
574,22
575,10
576,9
577,38
578,21
579,6
580,40
581,-9
582,21
583,1
584,9
585,27
586,17
587,23
588,15
589,30
590,-8
591,-3
592,12
593,34
594,-2
595,8
596,31
597,34
598,27
599,-8
600,-1
601,23
602,-4
603,40
604,16
605,34
606,32
607,34
608,33
609,34
610,10
611,8
612,13
613,-2
614,25
615,37
616,35
617,30
618,-5
619,35
620,-8
621,25
622,17
623,-10
624,20
625,34
626,21
627,4
628,4
629,-8
630,27
631,9
632,4
633,8
634,17
635,6
636,0
637,30
638,4
639,32
640,20
641,16
642,11
643,-3
644,39
645,20
646,17
647,-3
648,19
649,5
650,17
651,25
652,15
653,38
654,30
655,32
656,23
657,36
658,31
659,10
660,-1
661,15
662,20
663,28
664,39
665,29
666,23
667,5
668,14
669,37
670,12
671,40
672,40
673,0
674,36
675,18
676,40
677,32
678,13
679,-1
680,36
681,-5
682,18
683,0
684,13
685,18
686,11
687,11
688,-7
689,5
690,29
691,12
692,34
693,28
694,13
695,17
696,21
697,19
698,9
699,-4
700,25
701,29
702,23
703,8
704,21
705,-7
706,10
707,39
708,35
709,10
710,-9
711,5
712,19
713,16
714,38
715,5
716,36
717,-3
718,-4
719,4
720,-5
721,-6
722,35
723,21
724,-6
725,1
726,-3
727,-2
728,-4
729,21
730,26
731,16
732,26
733,22
734,25
735,27
736,38
737,5
738,18
739,19
740,39
741,11
742,14
743,38
744,35
745,-4
746,29
747,-9
748,34
749,31
750,40
751,0
752,-9
753,11
754,7
755,9
756,12
757,40
758,18
759,15
760,14
761,25
762,19
763,13
764,27
765,37
766,29
767,34
768,17
769,-1
770,6
771,17
772,1
773,23
774,3
775,17
776,7
777,34
778,38
779,5
780,15
781,5
782,33
783,31
784,14
785,10
786,28
787,37
788,1
789,0
790,24
791,-6
792,14
793,-8
794,-9
795,24
796,-5
797,-10
798,1
799,-4
800,39
801,-10
802,3
803,-6
804,16
805,4
806,15
807,9
808,14
809,-7
810,20
811,7
812,34
813,38
814,32
815,10
816,17
817,27
818,32
819,5
820,8
821,33
822,40
823,20
824,34
825,18
826,28
827,6
828,23
829,6
830,19
831,-5
832,34
833,27
834,31
835,26
836,9
837,28
838,27
839,12
840,21
841,27
842,1
843,-8
844,-10
845,2
846,34
847,0
848,21
849,30
850,19
851,30
852,-9
853,18
854,25
855,-6
856,35
857,-3
858,-2
859,21
860,15
861,5
862,25
863,22
864,30
865,19
866,10
867,-3
868,17
869,39
870,10
871,-9
872,18
873,-10
874,35
875,7
876,32
877,-1
878,6
879,-7
880,33
881,39
882,21
883,13
884,-5
885,31
886,-7
887,40
888,11
889,33
890,0
891,10
892,-5
893,2
894,14
895,-4
896,4
897,-7
898,0
899,4
900,19
901,3
902,-9
903,5
904,37
905,-4
906,38
907,15
908,19
909,26
910,2
911,-3
912,24
913,24
914,30
915,21
916,34
917,5
918,13
919,33
920,33
921,-3
922,14
923,-8
924,33
925,39
926,21
927,8
928,10
929,31
930,3
931,19
932,11
933,17
934,14
935,-9
936,-8
937,24
938,8
939,30
940,1
941,30
942,8
943,17
944,-9
945,11
946,-3
947,18
948,-6
949,23
950,0
951,15
952,30
953,40
954,24
955,2
956,16
957,12
958,19
959,-5
960,-10
961,15
962,30
963,39
964,15
965,6
966,-10
967,0
968,0
969,27
970,22
971,-2
972,20
973,15
974,-3
975,38
976,-2
977,37
978,-2
979,28
980,38
981,-2
982,-10
983,-10
984,4
985,13
986,19
987,1
988,29
989,-7
990,40
991,0
992,32
993,0
994,36
995,-8
996,5
997,34
998,25
999,-5
1000,-4
