<?xml version="1.0"?>
<opencv_storage>
<stage2>
  <maxWeakCount>5</maxWeakCount>
  <stageThreshold>-9.0813255310058594e-01</stageThreshold>
  <weakClassifiers>
    <_>
      <internalNodes>
        0 -1 6136343 6.2425300711765885e-04</internalNodes>
      <leafValues>
        -6.9056606292724609e-01 3.5319149494171143e-01</leafValues></_>
    <_>
      <internalNodes>
        0 -1 2189486 -4.2008700802398380e-06</internalNodes>
      <leafValues>
        -6.2386453151702881e-01 3.5404691100120544e-01</leafValues></_>
    <_>
      <internalNodes>
        0 -1 4924330 6.3654629047960043e-04</internalNodes>
      <leafValues>
        -5.5534285306930542e-01 3.9136448502540588e-01</leafValues></_>
    <_>
      <internalNodes>
        0 -1 4020348 1.3894953764975071e-02</internalNodes>
      <leafValues>
        -2.5860089063644409e-01 8.4530884027481079e-01</leafValues></_>
    <_>
      <internalNodes>
        0 -1 7525524 -2.0904266275465488e-03</internalNodes>
      <leafValues>
        -7.0437699556350708e-01 3.9937111735343933e-01</leafValues></_></weakClassifiers></stage2>
</opencv_storage>
