{
	"$schema": "https://json.schemastore.org/jsconfig",
	"compilerOptions": {
		"target": "es2022",
		"module": "es6",
		"lib": ["dom", "es2022", "esnext"],
		"types": ["@league-of-foundry-developers/foundry-vtt-types/index-lenient"],
		"moduleResolution": "node",
		"skipLibCheck": true,
		"noImplicitAny": true,
		"noImplicitThis": true,
		"checkJs": true,
		"allowSyntheticDefaultImports": false,
		"disableReferencedProjectLoad": true,
		"experimentalDecorators": false,
		"isolatedModules": true,
		"strict": true,
		"alwaysStrict": true,
		"strictFunctionTypes": true,
		"strictBindCallApply": true,
		"strictNullChecks": true,
		"strictPropertyInitialization": true,
		"forceConsistentCasingInFileNames": true,
		"newLine": "lf"
	},
	"display": "Recommended",
	"exclude": ["node_modules", "template"],
	"typeAcquisition": {
		"enable": true,
		"include": [
			"jquery",
			"handlebars",
			"@league-of-foundry-developers/foundry-vtt-types"
		]
	}
}
