
<svg
   xmlns:dc="http://purl.org/dc/elements/1.1/"
   xmlns:cc="http://creativecommons.org/ns#"
   xmlns:rdf="http://www.w3.org/1999/02/22-rdf-syntax-ns#"
   xmlns:svg="http://www.w3.org/2000/svg"
   xmlns="http://www.w3.org/2000/svg"
   xmlns:sodipodi="http://sodipodi.sourceforge.net/DTD/sodipodi-0.dtd"
   xmlns:inkscape="http://www.inkscape.org/namespaces/inkscape"
   style="isolation:isolate"
   viewBox="0 0 257.24542 248.32878"
   width="50"
   height="50"
   version="1.1"
   id="svg34"
   sodipodi:docname="TBH_Web_logo2.svg"
   inkscape:version="0.92.2 5c3e80d, 2017-08-06">

  <g
     clip-path="url(#_clipPath_xcG8Z3hM5YphpFpGBoqwX7sDu9p7RSyd)"
     id="g32"
     transform="matrix(1.1100692,0,0,1.2031577,-222.92348,-403.33783)"
     style="display:inline">
    <g
       id="g30">
      <g
         id="g8">
        <g
           id="Group" />
      </g>
      <g
         id="g28"
         transform="matrix(0.88667975,0,0,0.87456581,36.981416,75.486674)"
         inkscape:export-xdpi="96"
         inkscape:export-ydpi="96">
        <path
           d="m 216.201,297 h 198.507 c 17.343,0 31.424,14.081 31.424,31.424 v 173.152 c 0,17.343 -14.081,31.424 -31.424,31.424 H 216.201 c -17.343,0 -31.424,-14.081 -31.424,-31.424 V 328.424 c 0,-17.343 14.081,-31.424 31.424,-31.424 z"
           style="fill:#5BA4DF;fill-opacity:0.97969544;stroke:none;stroke-miterlimit:10"
           id="path10"
           inkscape:connector-curvature="0" />
        <path
           d="m 385.154,410.307 0.019,-0.089 -23.898,0.026 z"
           id="path22"
           inkscape:connector-curvature="0"
           style="fill:#000000" />
        <g
           transform="matrix(1.769,0,0,1.769,254.669,501.942)"
           id="g26" />
      </g>
    </g>
    <g
       inkscape:groupmode="layer"
       id="layer1"
       inkscape:label="Layer 1"
       style="display:inline" />
  </g>
  <g
     inkscape:groupmode="layer"
     id="layer3"
     inkscape:label="Layer 3"
     style="display:inline">
    <ellipse
       style="display:inline;isolation:isolate;fill:#000400;stroke-width:1.41136944"
       id="path127"
       cx="130.36987"
       cy="125.38359"
       rx="102.39725"
       ry="99.657532" />
  </g>
  <g
     inkscape:groupmode="layer"
     id="layer2"
     inkscape:label="Layer 2"
     style="display:inline">
    <g
       transform="matrix(0.98427588,0,0,1.0522406,-181.87154,-312.51545)"
       style="isolation:isolate"
       id="g136">
      <path
         style="fill:#ffffff;fill-rule:evenodd"
         inkscape:connector-curvature="0"
         id="path14"
         d="m 340.314,410.267 6.17,-29.193 h 12.684 l -5.016,23.75 h 19.523 l 5.016,-23.75 h 12.642 l -6.16,29.144 z m -52.653,0.057 6.182,-29.25 h 17.658 v 0 q 9.492,0 14.341,3.378 v 0 0 q 4.85,3.378 4.85,10.093 v 0 0 q 0,6.217 -3.44,10.259 v 0 0 q -3.441,4.041 -9.783,5.367 v 0 0.121 z m -36.248,0.04 3.923,-18.596 h -14.59 l 2.28,-10.694 h 41.864 l -2.28,10.694 h -14.631 l -3.921,18.582 z m 52.875,-18.762 -2.86,13.471 h 6.176 v 0 q 5.016,0 7.524,-2.01 v 0 0 q 2.507,-2.01 2.507,-5.782 v 0 0 q 0,-5.679 -7.046,-5.679 v 0 z" />
      <path
         style="fill:#ffffff;fill-rule:evenodd"
         inkscape:connector-curvature="0"
         id="path16"
         d="m 299.21,417.259 h -12.684 l -4.786,24.856 h 21.637 v 0 q 11.191,0 17.533,-5.641 v 0 0 q 6.342,-5.642 6.342,-16.06 v 0 0 c 0,-1.147 -0.099,-2.221 -0.392,-3.155 h -12.992 q 0.576,1.343 0.576,3.246 v 0 0 q 0,4.686 -2.757,7.325 v 0 0 q -2.756,2.638 -7.606,2.638 v 0 h -7.461 z m -48.92,0 -4.777,24.856 h 12.642 l 4.777,-24.856 z" />
      <path
         style="fill:#ffffff"
         inkscape:connector-curvature="0"
         id="path18"
         d="m 351.833,416.817 -4.872,24.856 h -12.642 l 4.849,-24.856 z" />
      <path
         style="fill:#ffffff"
         inkscape:connector-curvature="0"
         id="path20"
         d="m 384.016,416.817 -4.848,24.856 h -12.684 l 4.872,-24.856 z" />
    </g>
  </g>
</svg>
