{
  "version": "14.0.0",
  "vulnerabilities": [],
  "remediations": [],
  "dependency_files": [
    {
      "path": "setup.py",
      "package_manager": "setuptools",
      "dependencies": [
        {
          "package": {
            "name": "Django"
          },
          "version": "4.0.1"
        },
        {
          "package": {
            "name": "Pillow"
          },
          "version": "8.4.0"
        },
        {
          "package": {
            "name": "asgiref"
          },
          "version": "3.4.1"
        },
        {
          "package": {
            "name": "backports.zoneinfo"
          },
          "version": "0.2.1"
        },
        {
          "package": {
            "name": "beautifulsoup4"
          },
          "version": "4.10.0"
        },
        {
          "package": {
            "name": "django-contrib-comments"
          },
          "version": "2.1.0"
        },
        {
          "package": {
            "name": "django-js-asset"
          },
          "version": "1.2.2"
        },
        {
          "package": {
            "name": "django-mptt"
          },
          "version": "0.13.4"
        },
        {
          "package": {
            "name": "django-tagging"
          },
          "version": "0.5.0"
        },
        {
          "package": {
            "name": "django-xmlrpc"
          },
          "version": "0.1.8"
        },
        {
          "package": {
            "name": "gitlab-sp-test-python-pip"
          },
          "version": "1.2.0"
        },
        {
          "package": {
            "name": "mots-vides"
          },
          "version": "2015.5.11"
        },
        {
          "package": {
            "name": "pytz"
          },
          "version": "2021.3"
        },
        {
          "package": {
            "name": "regex"
          },
          "version": "2021.11.10"
        },
        {
          "package": {
            "name": "soupsieve"
          },
          "version": ":SKIP:"
        },
        {
          "package": {
            "name": "sqlparse"
          },
          "version": "0.4.2"
        },
        {
          "package": {
            "name": "typing-extensions"
          },
          "version": "4.0.1"
        }
      ]
    }
  ],
  "scan": {
    "analyzer": {
      "id": "gemnasium-python",
      "name": "gemnasium-python",
      "url": "https://gitlab.com/gitlab-org/security-products/analyzers/gemnasium",
      "vendor": {
        "name": "GitLab"
      },
      "version": "3.6.0"
    },
    "scanner": {
      "id": "gemnasium-python",
      "name": "gemnasium-python",
      "url": "https://gitlab.com/gitlab-org/security-products/analyzers/gemnasium",
      "vendor": {
        "name": "GitLab"
      },
      "version": "2.20.1"
    },
    "type": "dependency_scanning",
    "start_time": "2021-12-03T10:16:46",
    "end_time": "2021-12-03T10:16:59",
    "status": "success"
  }
}
