{
  "bomFormat": "CycloneDX",
  "specVersion": "1.3",
  "serialNumber": "urn:uuid:651538e3-88e8-48c0-9701-bf12336cc41d",
  "version": 1,
  "metadata": {
    "tools": [
      {
        "vendor": "GitLab",
        "name": "gemnasium",
        "version": "not-configured"
      }
    ],
    "authors": [
      {
        "name": "GitLab",
        "email": "gitlab@gitlab.com"
      }
    ],
    "lock_file": "go/go.sum",
    "package_manager": "go"
  },
  "components": [
    {
      "iid": 1,
      "name": "github.com/pmezard/go-difflib",
      "version": "v1.0.0",
      "description": "description",
      "purl": "pkg:go/github.com/pmezard/go-difflib@v1.0.0",
      "type": "library",
      "bom-ref": "pkg:go/github.com/pmezard/go-difflib@v1.0.0"
    }
  ]
}
