{
  "version": "14.0.4",
  "vulnerabilities": [],
  "dependency_files": [
    {
      "path": "setup.py",
      "package_manager": "setuptools",
      "dependencies": [
        {
          "package": {
            "name": "SecretStorage"
          },
          "version": "3.3.2"
        },
        {
          "package": {
            "name": "cffi"
          },
          "version": "1.15.0"
        },
        {
          "package": {
            "name": "cryptography"
          },
          "version": "37.0.3"
        },
        {
          "package": {
            "name": "importlib-metadata"
          },
          "version": "4.12.0"
        },
        {
          "package": {
            "name": "jeepney"
          },
          "version": "0.8.0"
        },
        {
          "package": {
            "name": "keyring"
          },
          "version": "23.3.0"
        },
        {
          "package": {
            "name": "pycparser"
          },
          "version": "2.21"
        },
        {
          "package": {
            "name": "test-project"
          },
          "version": "0.0.1"
        }
      ]
    }
  ],
  "scan": {
    "analyzer": {
      "id": "gemnasium-python",
      "name": "gemnasium-python",
      "url": "https://gitlab.com/gitlab-org/security-products/analyzers/gemnasium",
      "vendor": {
        "name": "GitLab"
      },
      "version": "3.6.0"
    },
    "scanner": {
      "id": "gemnasium-python",
      "name": "gemnasium-python",
      "url": "https://gitlab.com/gitlab-org/security-products/analyzers/gemnasium",
      "vendor": {
        "name": "GitLab"
      },
      "version": "2.24.1"
    },
    "type": "dependency_scanning",
    "start_time": "2022-05-04T18:53:35",
    "end_time": "2022-05-04T18:53:41",
    "status": "success"
  }
}
