[
  {
    "name": "errno",
    "version": "0.1.7"
  },
  {
    "name": "find-up",
    "version": "3.0.0"
  },
  {
    "name": "json5",
    "version": "1.0.1"
  },
  {
    "name": "nan",
    "version": "2.14.1"
  },
  {
    "name": "object-visit",
    "version": "1.0.1"
  },
  {
    "name": "string-width",
    "version": "1.0.2"
  },
  {
    "name": "acorn",
    "version": "6.4.1"
  },
  {
    "name": "ajv",
    "version": "6.12.4"
  },
  {
    "name": "aws4",
    "version": "1.10.1"
  },
  {
    "name": "file-uri-to-path",
    "version": "1.0.0"
  },
  {
    "name": "hash.js",
    "version": "1.1.7"
  },
  {
    "name": "readdirp",
    "version": "2.2.1"
  },
  {
    "name": "schema-utils",
    "version": "1.0.0"
  },
  {
    "name": "balanced-match",
    "version": "1.0.0"
  },
  {
    "name": "chokidar",
    "version": "2.1.8"
  },
  {
    "name": "decode-uri-component",
    "version": "0.2.0"
  },
  {
    "name": "define-property",
    "version": "1.0.0"
  },
  {
    "name": "is-fullwidth-code-point",
    "version": "1.0.0"
  },
  {
    "name": "move-concurrently",
    "version": "1.0.1"
  },
  {
    "name": "extend",
    "version": "3.0.2"
  },
  {
    "name": "has-values",
    "version": "0.1.4"
  },
  {
    "name": "ieee754",
    "version": "1.1.13"
  },
  {
    "name": "pump",
    "version": "2.0.1"
  },
  {
    "name": "pump",
    "version": "3.0.0"
  },
  {
    "name": "source-map-support",
    "version": "0.5.19"
  },
  {
    "name": "component-emitter",
    "version": "1.3.0"
  },
  {
    "name": "diffie-hellman",
    "version": "5.0.3"
  },
  {
    "name": "is-descriptor",
    "version": "1.0.2"
  },
  {
    "name": "anymatch",
    "version": "3.1.1"
  },
  {
    "name": "cyclist",
    "version": "1.0.1"
  },
  {
    "name": "events",
    "version": "3.2.0"
  },
  {
    "name": "node-libs-browser",
    "version": "2.2.1"
  },
  {
    "name": "pascalcase",
    "version": "0.1.1"
  },
  {
    "name": "ret",
    "version": "0.1.15"
  },
  {
    "name": "source-map-url",
    "version": "0.4.0"
  },
  {
    "name": "@webassemblyjs/wast-parser",
    "version": "1.9.0"
  },
  {
    "name": "@xtuc/ieee754",
    "version": "1.2.0"
  },
  {
    "name": "base64-js",
    "version": "1.3.1"
  },
  {
    "name": "code-point-at",
    "version": "1.1.0"
  },
  {
    "name": "copy-concurrently",
    "version": "1.0.5"
  },
  {
    "name": "nanomatch",
    "version": "1.2.13"
  },
  {
    "name": "parse-asn1",
    "version": "5.1.6"
  },
  {
    "name": "browserify-zlib",
    "version": "0.2.0"
  },
  {
    "name": "fill-range",
    "version": "4.0.0"
  },
  {
    "name": "jsbn",
    "version": "0.1.1"
  },
  {
    "name": "sshpk",
    "version": "1.16.1"
  },
  {
    "name": "process-nextick-args",
    "version": "2.0.1"
  },
  {
    "name": "@webassemblyjs/helper-api-error",
    "version": "1.9.0"
  },
  {
    "name": "@webassemblyjs/leb128",
    "version": "1.9.0"
  },
  {
    "name": "asn1.js",
    "version": "5.4.1"
  },
  {
    "name": "estraverse",
    "version": "5.2.0"
  },
  {
    "name": "fsevents",
    "version": "2.1.3"
  },
  {
    "name": "https-browserify",
    "version": "1.0.0"
  },
  {
    "name": "os-homedir",
    "version": "1.0.2"
  },
  {
    "name": "sha.js",
    "version": "2.4.11"
  },
  {
    "name": "asynckit",
    "version": "0.4.0"
  },
  {
    "name": "lodash.omit",
    "version": "4.5.0"
  },
  {
    "name": "setimmediate",
    "version": "1.0.5"
  },
  {
    "name": "assign-symbols",
    "version": "1.0.0"
  },
  {
    "name": "inherits",
    "version": "2.0.1"
  },
  {
    "name": "performance-now",
    "version": "2.1.0"
  },
  {
    "name": "process",
    "version": "0.11.10"
  },
  {
    "name": "randombytes",
    "version": "2.1.0"
  },
  {
    "name": "@webassemblyjs/helper-wasm-bytecode",
    "version": "1.9.0"
  },
  {
    "name": "har-schema",
    "version": "2.0.0"
  },
  {
    "name": "minimatch",
    "version": "3.0.4"
  },
  {
    "name": "mkdirp",
    "version": "1.0.4"
  },
  {
    "name": "promise-inflight",
    "version": "1.0.1"
  },
  {
    "name": "regex-not",
    "version": "1.0.2"
  },
  {
    "name": "os-browserify",
    "version": "0.3.0"
  },
  {
    "name": "arr-diff",
    "version": "4.0.0"
  },
  {
    "name": "arr-union",
    "version": "3.1.0"
  },
  {
    "name": "bcrypt-pbkdf",
    "version": "1.0.2"
  },
  {
    "name": "class-utils",
    "version": "0.3.6"
  },
  {
    "name": "is-data-descriptor",
    "version": "0.1.4"
  },
  {
    "name": "is-glob",
    "version": "4.0.1"
  },
  {
    "name": "is-wsl",
    "version": "1.1.0"
  },
  {
    "name": "querystring",
    "version": "0.2.0"
  },
  {
    "name": "split-string",
    "version": "3.1.0"
  },
  {
    "name": "tslib",
    "version": "1.13.0"
  },
  {
    "name": "unique-filename",
    "version": "1.1.1"
  },
  {
    "name": "util",
    "version": "0.11.1"
  },
  {
    "name": "lru-cache",
    "version": "5.1.1"
  },
  {
    "name": "bluebird",
    "version": "3.7.2"
  },
  {
    "name": "braces",
    "version": "3.0.2"
  },
  {
    "name": "chokidar",
    "version": "3.4.2"
  },
  {
    "name": "console-control-strings",
    "version": "1.1.0"
  },
  {
    "name": "fill-range",
    "version": "7.0.1"
  },
  {
    "name": "glob-parent",
    "version": "5.1.1"
  },
  {
    "name": "mime-db",
    "version": "1.44.0"
  },
  {
    "name": "mime-types",
    "version": "2.1.27"
  },
  {
    "name": "pako",
    "version": "1.0.11"
  },
  {
    "name": "path-is-absolute",
    "version": "1.0.1"
  },
  {
    "name": "semver",
    "version": "5.7.1"
  },
  {
    "name": "@webassemblyjs/utf8",
    "version": "1.9.0"
  },
  {
    "name": "combined-stream",
    "version": "1.0.8"
  },
  {
    "name": "har-validator",
    "version": "5.1.5"
  },
  {
    "name": "pbkdf2",
    "version": "3.1.1"
  },
  {
    "name": "util-deprecate",
    "version": "1.0.2"
  },
  {
    "name": "yallist",
    "version": "4.0.0"
  },
  {
    "name": "fs-write-stream-atomic",
    "version": "1.0.10"
  },
  {
    "name": "hmac-drbg",
    "version": "1.0.1"
  },
  {
    "name": "is-accessor-descriptor",
    "version": "0.1.6"
  },
  {
    "name": "memory-fs",
    "version": "0.5.0"
  },
  {
    "name": "mixin-deep",
    "version": "1.3.2"
  },
  {
    "name": "pify",
    "version": "4.0.1"
  },
  {
    "name": "string_decoder",
    "version": "1.1.1"
  },
  {
    "name": "form-data",
    "version": "2.3.3"
  },
  {
    "name": "has-values",
    "version": "1.0.0"
  },
  {
    "name": "is-binary-path",
    "version": "2.1.0"
  },
  {
    "name": "mississippi",
    "version": "3.0.0"
  },
  {
    "name": "readable-stream",
    "version": "2.3.7"
  },
  {
    "name": "safer-buffer",
    "version": "2.1.2"
  },
  {
    "name": "@webassemblyjs/wasm-edit",
    "version": "1.9.0"
  },
  {
    "name": "is-number",
    "version": "7.0.0"
  },
  {
    "name": "safe-buffer",
    "version": "5.2.1"
  },
  {
    "name": "watchpack",
    "version": "1.7.4"
  },
  {
    "name": "concat-stream",
    "version": "1.6.2"
  },
  {
    "name": "through2",
    "version": "2.0.5"
  },
  {
    "name": "uri-js",
    "version": "4.4.0"
  },
  {
    "name": "@webassemblyjs/helper-code-frame",
    "version": "1.9.0"
  },
  {
    "name": "base",
    "version": "0.11.2"
  },
  {
    "name": "braces",
    "version": "2.3.2"
  },
  {
    "name": "glob-parent",
    "version": "3.1.0"
  },
  {
    "name": "kind-of",
    "version": "3.2.2"
  },
  {
    "name": "strip-ansi",
    "version": "3.0.1"
  },
  {
    "name": "to-regex-range",
    "version": "5.0.1"
  },
  {
    "name": "inherits",
    "version": "2.0.4"
  },
  {
    "name": "browserify-aes",
    "version": "1.2.0"
  },
  {
    "name": "browserify-rsa",
    "version": "4.0.1"
  },
  {
    "name": "builtin-status-codes",
    "version": "3.0.0"
  },
  {
    "name": "create-hmac",
    "version": "1.1.7"
  },
  {
    "name": "dashdash",
    "version": "1.14.1"
  },
  {
    "name": "fast-deep-equal",
    "version": "3.1.3"
  },
  {
    "name": "fragment-cache",
    "version": "0.2.1"
  },
  {
    "name": "ms",
    "version": "2.0.0"
  },
  {
    "name": "neo-async",
    "version": "2.6.2"
  },
  {
    "name": "object-copy",
    "version": "0.1.0"
  },
  {
    "name": "pumpify",
    "version": "1.5.1"
  },
  {
    "name": "randomfill",
    "version": "1.0.4"
  },
  {
    "name": "snapdragon-util",
    "version": "3.0.1"
  },
  {
    "name": "typedarray",
    "version": "0.0.6"
  },
  {
    "name": "@webassemblyjs/wast-printer",
    "version": "1.9.0"
  },
  {
    "name": "cipher-base",
    "version": "1.0.4"
  },
  {
    "name": "from2",
    "version": "2.3.0"
  },
  {
    "name": "getpass",
    "version": "0.1.7"
  },
  {
    "name": "string_decoder",
    "version": "1.3.0"
  },
  {
    "name": "assert-plus",
    "version": "1.0.0"
  },
  {
    "name": "mkdirp",
    "version": "0.5.5"
  },
  {
    "name": "to-arraybuffer",
    "version": "1.0.1"
  },
  {
    "name": "which",
    "version": "2.0.2"
  },
  {
    "name": "is-descriptor",
    "version": "0.1.6"
  },
  {
    "name": "is-typedarray",
    "version": "1.0.0"
  },
  {
    "name": "number-is-nan",
    "version": "1.0.1"
  },
  {
    "name": "source-map-resolve",
    "version": "0.5.3"
  },
  {
    "name": "core-util-is",
    "version": "1.0.2"
  },
  {
    "name": "estraverse",
    "version": "4.3.0"
  },
  {
    "name": "locate-path",
    "version": "3.0.0"
  },
  {
    "name": "signal-exit",
    "version": "3.0.3"
  },
  {
    "name": "stream-shift",
    "version": "1.0.1"
  },
  {
    "name": "terser",
    "version": "4.8.0"
  },
  {
    "name": "fast-json-stable-stringify",
    "version": "2.1.0"
  },
  {
    "name": "inherits",
    "version": "2.0.3"
  },
  {
    "name": "json-parse-better-errors",
    "version": "1.0.2"
  },
  {
    "name": "vm-browserify",
    "version": "1.1.2"
  },
  {
    "name": "define-property",
    "version": "0.2.5"
  },
  {
    "name": "figgy-pudding",
    "version": "3.5.2"
  },
  {
    "name": "get-value",
    "version": "2.0.6"
  },
  {
    "name": "loader-runner",
    "version": "2.4.0"
  },
  {
    "name": "minimist",
    "version": "1.2.5"
  },
  {
    "name": "p-limit",
    "version": "2.3.0"
  },
  {
    "name": "@webassemblyjs/helper-wasm-section",
    "version": "1.9.0"
  },
  {
    "name": "is-buffer",
    "version": "1.1.6"
  },
  {
    "name": "isexe",
    "version": "2.0.0"
  },
  {
    "name": "webpack",
    "version": "4.44.1"
  },
  {
    "name": "urix",
    "version": "0.1.0"
  },
  {
    "name": "@webassemblyjs/ast",
    "version": "1.9.0"
  },
  {
    "name": "arg",
    "version": "4.1.3"
  },
  {
    "name": "cache-base",
    "version": "1.0.1"
  },
  {
    "name": "minimalistic-crypto-utils",
    "version": "1.0.1"
  },
  {
    "name": "normalize-path",
    "version": "2.1.1"
  },
  {
    "name": "source-map",
    "version": "0.5.7"
  },
  {
    "name": "stream-each",
    "version": "1.2.3"
  },
  {
    "name": "caseless",
    "version": "0.12.0"
  },
  {
    "name": "npmlog",
    "version": "4.1.2"
  },
  {
    "name": "remove-trailing-separator",
    "version": "1.1.0"
  },
  {
    "name": "delayed-stream",
    "version": "1.0.0"
  },
  {
    "name": "extglob",
    "version": "2.0.4"
  },
  {
    "name": "is-binary-path",
    "version": "1.0.1"
  },
  {
    "name": "picomatch",
    "version": "2.2.2"
  },
  {
    "name": "yallist",
    "version": "3.1.1"
  },
  {
    "name": "brorand",
    "version": "1.1.0"
  },
  {
    "name": "end-of-stream",
    "version": "1.4.4"
  },
  {
    "name": "infer-owner",
    "version": "1.0.4"
  },
  {
    "name": "nopt",
    "version": "4.0.3"
  },
  {
    "name": "ssri",
    "version": "6.0.1"
  },
  {
    "name": "tunnel-agent",
    "version": "0.6.0"
  },
  {
    "name": "webpack-sources",
    "version": "1.4.3"
  },
  {
    "name": "@webassemblyjs/wasm-opt",
    "version": "1.9.0"
  },
  {
    "name": "constants-browserify",
    "version": "1.0.0"
  },
  {
    "name": "oauth-sign",
    "version": "0.9.0"
  },
  {
    "name": "psl",
    "version": "1.8.0"
  },
  {
    "name": "qs",
    "version": "6.5.2"
  },
  {
    "name": "repeat-string",
    "version": "1.6.1"
  },
  {
    "name": "stream-http",
    "version": "2.8.3"
  },
  {
    "name": "util",
    "version": "0.10.3"
  },
  {
    "name": "expand-brackets",
    "version": "2.1.4"
  },
  {
    "name": "is-windows",
    "version": "1.0.2"
  },
  {
    "name": "minimalistic-assert",
    "version": "1.0.1"
  },
  {
    "name": "static-extend",
    "version": "0.1.2"
  },
  {
    "name": "timers-browserify",
    "version": "2.0.11"
  },
  {
    "name": "to-regex",
    "version": "3.0.2"
  },
  {
    "name": "tty-browserify",
    "version": "0.0.0"
  },
  {
    "name": "wide-align",
    "version": "1.1.3"
  },
  {
    "name": "yn",
    "version": "3.1.1"
  },
  {
    "name": "aproba",
    "version": "1.2.0"
  },
  {
    "name": "create-ecdh",
    "version": "4.0.4"
  },
  {
    "name": "isstream",
    "version": "0.1.2"
  },
  {
    "name": "minipass",
    "version": "3.1.3"
  },
  {
    "name": "punycode",
    "version": "1.4.1"
  },
  {
    "name": "readable-stream",
    "version": "3.6.0"
  },
  {
    "name": "to-regex-range",
    "version": "2.1.1"
  },
  {
    "name": "gauge",
    "version": "2.7.4"
  },
  {
    "name": "pnp-webpack-plugin",
    "version": "1.6.4"
  },
  {
    "name": "tslib",
    "version": "2.0.1"
  },
  {
    "name": "array-unique",
    "version": "0.3.2"
  },
  {
    "name": "big.js",
    "version": "5.2.2"
  },
  {
    "name": "duplexify",
    "version": "3.7.1"
  },
  {
    "name": "for-in",
    "version": "1.0.2"
  },
  {
    "name": "has-unicode",
    "version": "2.0.1"
  },
  {
    "name": "prr",
    "version": "1.0.1"
  },
  {
    "name": "serialize-javascript",
    "version": "4.0.0"
  },
  {
    "name": "@webassemblyjs/wasm-parser",
    "version": "1.9.0"
  },
  {
    "name": "@xtuc/long",
    "version": "4.2.2"
  },
  {
    "name": "map-visit",
    "version": "1.0.0"
  },
  {
    "name": "set-blocking",
    "version": "2.0.0"
  },
  {
    "name": "to-object-path",
    "version": "0.3.0"
  },
  {
    "name": "tweetnacl",
    "version": "0.14.5"
  },
  {
    "name": "@webassemblyjs/helper-fsm",
    "version": "1.9.0"
  },
  {
    "name": "fs.realpath",
    "version": "1.0.0"
  },
  {
    "name": "is-number",
    "version": "3.0.0"
  },
  {
    "name": "punycode",
    "version": "2.1.1"
  },
  {
    "name": "@webassemblyjs/helper-module-context",
    "version": "1.9.0"
  },
  {
    "name": "isobject",
    "version": "2.1.0"
  },
  {
    "name": "normalize-path",
    "version": "3.0.0"
  },
  {
    "name": "verror",
    "version": "1.10.0"
  },
  {
    "name": "binary-extensions",
    "version": "2.1.0"
  },
  {
    "name": "eslint-scope",
    "version": "4.0.3"
  },
  {
    "name": "extend-shallow",
    "version": "3.0.2"
  },
  {
    "name": "make-dir",
    "version": "2.1.0"
  },
  {
    "name": "object-assign",
    "version": "4.1.1"
  },
  {
    "name": "p-try",
    "version": "2.2.0"
  },
  {
    "name": "pkg-dir",
    "version": "3.0.0"
  },
  {
    "name": "unset-value",
    "version": "1.0.0"
  },
  {
    "name": "@webassemblyjs/wasm-gen",
    "version": "1.9.0"
  },
  {
    "name": "ajv-keywords",
    "version": "3.5.2"
  },
  {
    "name": "crypto-browserify",
    "version": "3.12.0"
  },
  {
    "name": "has-value",
    "version": "1.0.0"
  },
  {
    "name": "os-tmpdir",
    "version": "1.0.2"
  },
  {
    "name": "repeat-element",
    "version": "1.1.3"
  },
  {
    "name": "resolve-url",
    "version": "0.2.1"
  },
  {
    "name": "url",
    "version": "0.11.0"
  },
  {
    "name": "wrappy",
    "version": "1.0.2"
  },
  {
    "name": "md5.js",
    "version": "1.3.5"
  },
  {
    "name": "request",
    "version": "2.88.2"
  },
  {
    "name": "@webassemblyjs/helper-buffer",
    "version": "1.9.0"
  },
  {
    "name": "abbrev",
    "version": "1.1.1"
  },
  {
    "name": "browserify-sign",
    "version": "4.2.1"
  },
  {
    "name": "extend-shallow",
    "version": "2.0.1"
  },
  {
    "name": "is-extendable",
    "version": "0.1.1"
  },
  {
    "name": "xtend",
    "version": "4.0.2"
  },
  {
    "name": "http-signature",
    "version": "1.2.0"
  },
  {
    "name": "ajv-errors",
    "version": "1.0.1"
  },
  {
    "name": "aws-sign2",
    "version": "0.7.0"
  },
  {
    "name": "collection-visit",
    "version": "1.0.0"
  },
  {
    "name": "enhanced-resolve",
    "version": "4.3.0"
  },
  {
    "name": "glob",
    "version": "7.1.6"
  },
  {
    "name": "has-value",
    "version": "0.3.1"
  },
  {
    "name": "snapdragon",
    "version": "0.8.2"
  },
  {
    "name": "tar",
    "version": "6.0.5"
  },
  {
    "name": "make-error",
    "version": "1.3.6"
  },
  {
    "name": "@webassemblyjs/ieee754",
    "version": "1.9.0"
  },
  {
    "name": "chrome-trace-event",
    "version": "1.0.2"
  },
  {
    "name": "commander",
    "version": "2.20.3"
  },
  {
    "name": "inflight",
    "version": "1.0.6"
  },
  {
    "name": "isobject",
    "version": "3.0.1"
  },
  {
    "name": "json-schema",
    "version": "0.2.3"
  },
  {
    "name": "jsprim",
    "version": "1.4.1"
  },
  {
    "name": "union-value",
    "version": "1.0.1"
  },
  {
    "name": "watchpack-chokidar2",
    "version": "2.0.0"
  },
  {
    "name": "public-encrypt",
    "version": "4.0.3"
  },
  {
    "name": "typescript",
    "version": "4.0.2"
  },
  {
    "name": "chownr",
    "version": "1.1.4"
  },
  {
    "name": "chownr",
    "version": "2.0.0"
  },
  {
    "name": "env-paths",
    "version": "2.2.0"
  },
  {
    "name": "forever-agent",
    "version": "0.6.1"
  },
  {
    "name": "imurmurhash",
    "version": "0.1.4"
  },
  {
    "name": "json-schema-traverse",
    "version": "0.4.1"
  },
  {
    "name": "posix-character-classes",
    "version": "0.1.1"
  },
  {
    "name": "path-browserify",
    "version": "0.0.1"
  },
  {
    "name": "arr-flatten",
    "version": "1.1.0"
  },
  {
    "name": "assert",
    "version": "1.5.0"
  },
  {
    "name": "buffer-from",
    "version": "1.1.1"
  },
  {
    "name": "emojis-list",
    "version": "3.0.0"
  },
  {
    "name": "is-glob",
    "version": "3.1.0"
  },
  {
    "name": "kind-of",
    "version": "6.0.3"
  },
  {
    "name": "osenv",
    "version": "0.1.5"
  },
  {
    "name": "uuid",
    "version": "3.4.0"
  },
  {
    "name": "brace-expansion",
    "version": "1.1.11"
  },
  {
    "name": "cacache",
    "version": "12.0.4"
  },
  {
    "name": "set-value",
    "version": "2.0.1"
  },
  {
    "name": "source-list-map",
    "version": "2.0.1"
  },
  {
    "name": "stream-browserify",
    "version": "2.0.2"
  },
  {
    "name": "ts-node",
    "version": "9.0.0"
  },
  {
    "name": "use",
    "version": "3.1.1"
  },
  {
    "name": "y18n",
    "version": "4.0.0"
  },
  {
    "name": "is-extglob",
    "version": "2.1.1"
  },
  {
    "name": "minizlib",
    "version": "2.1.2"
  },
  {
    "name": "p-locate",
    "version": "3.0.0"
  },
  {
    "name": "rimraf",
    "version": "2.7.1"
  },
  {
    "name": "safe-buffer",
    "version": "5.1.2"
  },
  {
    "name": "ts-pnp",
    "version": "1.2.0"
  },
  {
    "name": "upath",
    "version": "1.2.0"
  },
  {
    "name": "ansi-regex",
    "version": "2.1.1"
  },
  {
    "name": "esrecurse",
    "version": "4.3.0"
  },
  {
    "name": "miller-rabin",
    "version": "4.0.1"
  },
  {
    "name": "diff",
    "version": "4.0.2"
  },
  {
    "name": "evp_bytestokey",
    "version": "1.0.3"
  },
  {
    "name": "hash-base",
    "version": "3.1.0"
  },
  {
    "name": "is-accessor-descriptor",
    "version": "1.0.0"
  },
  {
    "name": "map-cache",
    "version": "0.2.2"
  },
  {
    "name": "path-exists",
    "version": "3.0.0"
  },
  {
    "name": "terser-webpack-plugin",
    "version": "1.4.5"
  },
  {
    "name": "binary-extensions",
    "version": "1.13.1"
  },
  {
    "name": "ecc-jsbn",
    "version": "0.1.2"
  },
  {
    "name": "flush-write-stream",
    "version": "1.1.1"
  },
  {
    "name": "des.js",
    "version": "1.0.1"
  },
  {
    "name": "domain-browser",
    "version": "1.2.0"
  },
  {
    "name": "iferr",
    "version": "0.1.5"
  },
  {
    "name": "querystring-es3",
    "version": "0.2.1"
  },
  {
    "name": "run-queue",
    "version": "1.0.3"
  },
  {
    "name": "semver",
    "version": "7.3.2"
  },
  {
    "name": "path-dirname",
    "version": "1.0.2"
  },
  {
    "name": "asn1",
    "version": "0.2.4"
  },
  {
    "name": "concat-map",
    "version": "0.0.1"
  },
  {
    "name": "debug",
    "version": "2.6.9"
  },
  {
    "name": "elliptic",
    "version": "6.5.3"
  },
  {
    "name": "is-data-descriptor",
    "version": "1.0.0"
  },
  {
    "name": "is-plain-object",
    "version": "2.0.4"
  },
  {
    "name": "once",
    "version": "1.4.0"
  },
  {
    "name": "snapdragon-node",
    "version": "2.1.1"
  },
  {
    "name": "source-map",
    "version": "0.6.1"
  },
  {
    "name": "console-browserify",
    "version": "1.2.0"
  },
  {
    "name": "define-property",
    "version": "2.0.2"
  },
  {
    "name": "fs-minipass",
    "version": "2.1.0"
  },
  {
    "name": "is-extendable",
    "version": "1.0.1"
  },
  {
    "name": "object.pick",
    "version": "1.3.0"
  },
  {
    "name": "@types/node",
    "version": "14.6.2"
  },
  {
    "name": "bindings",
    "version": "1.5.0"
  },
  {
    "name": "bn.js",
    "version": "4.11.9"
  },
  {
    "name": "buffer",
    "version": "4.9.2"
  },
  {
    "name": "graceful-fs",
    "version": "4.2.4"
  },
  {
    "name": "kind-of",
    "version": "5.1.0"
  },
  {
    "name": "@webassemblyjs/floating-point-hex-parser",
    "version": "1.9.0"
  },
  {
    "name": "commondir",
    "version": "1.0.1"
  },
  {
    "name": "isarray",
    "version": "1.0.0"
  },
  {
    "name": "node-gyp",
    "version": "7.1.0"
  },
  {
    "name": "unique-slug",
    "version": "2.0.2"
  },
  {
    "name": "create-hash",
    "version": "1.2.0"
  },
  {
    "name": "fsevents",
    "version": "1.2.13"
  },
  {
    "name": "micromatch",
    "version": "3.1.10"
  },
  {
    "name": "parallel-transform",
    "version": "1.2.0"
  },
  {
    "name": "ripemd160",
    "version": "2.0.2"
  },
  {
    "name": "atob",
    "version": "2.1.2"
  },
  {
    "name": "bn.js",
    "version": "5.1.3"
  },
  {
    "name": "browserify-des",
    "version": "1.0.2"
  },
  {
    "name": "buffer-xor",
    "version": "1.0.3"
  },
  {
    "name": "extsprintf",
    "version": "1.3.0"
  },
  {
    "name": "readdirp",
    "version": "3.4.0"
  },
  {
    "name": "tough-cookie",
    "version": "2.5.0"
  },
  {
    "name": "async-each",
    "version": "1.0.3"
  },
  {
    "name": "json-stringify-safe",
    "version": "5.0.1"
  },
  {
    "name": "loader-utils",
    "version": "1.4.0"
  },
  {
    "name": "memory-fs",
    "version": "0.4.1"
  },
  {
    "name": "punycode",
    "version": "1.3.2"
  },
  {
    "name": "safe-regex",
    "version": "1.1.0"
  },
  {
    "name": "anymatch",
    "version": "2.0.0"
  },
  {
    "name": "are-we-there-yet",
    "version": "1.1.5"
  },
  {
    "name": "browserify-cipher",
    "version": "1.0.1"
  },
  {
    "name": "copy-descriptor",
    "version": "0.1.1"
  },
  {
    "name": "delegates",
    "version": "1.0.0"
  },
  {
    "name": "find-cache-dir",
    "version": "2.1.0"
  },
  {
    "name": "kind-of",
    "version": "4.0.0"
  },
  {
    "name": "tapable",
    "version": "1.1.3"
  },
  {
    "name": "worker-farm",
    "version": "1.7.0"
  }
]
