[
    {
        "led_state": 1,
        "led_status": 169,
        "datetime": "2024-06-04 19:23:54"
    },
    {
        "led_state": 1,
        "led_status": 185,
        "datetime": "2024-06-04 19:23:55"
    },
    {
        "led_state": 1,
        "led_status": 209,
        "datetime": "2024-06-04 19:23:55"
    },
    {
        "led_state": 1,
        "led_status": 209,
        "datetime": "2024-06-04 19:23:56"
    },
    {
        "led_state": 1,
        "led_status": 209,
        "datetime": "2024-06-04 19:23:56"
    },
    {
        "led_state": 1,
        "led_status": 208,
        "datetime": "2024-06-04 19:23:57"
    },
    {
        "led_state": 1,
        "led_status": 208,
        "datetime": "2024-06-04 19:23:57"
    },
    {
        "led_state": 1,
        "led_status": 209,
        "datetime": "2024-06-04 19:23:58"
    },
    {
        "led_state": 1,
        "led_status": 109,
        "datetime": "2024-06-04 19:23:58"
    },
    {
        "led_state": 1,
        "led_status": 80,
        "datetime": "2024-06-04 19:23:59"
    },
    {
        "led_state": 1,
        "led_status": 68,
        "datetime": "2024-06-04 19:23:59"
    },
    {
        "led_state": 1,
        "led_status": 60,
        "datetime": "2024-06-04 19:24:00"
    },
    {
        "led_state": 1,
        "led_status": 58,
        "datetime": "2024-06-04 19:24:00"
    },
    {
        "led_state": 1,
        "led_status": 52,
        "datetime": "2024-06-04 19:24:01"
    },
    {
        "led_state": 1,
        "led_status": 195,
        "datetime": "2024-06-04 19:24:01"
    },
    {
        "led_state": 1,
        "led_status": 198,
        "datetime": "2024-06-04 19:24:02"
    },
    {
        "led_state": 1,
        "led_status": 53,
        "datetime": "2024-06-04 19:24:02"
    },
    {
        "led_state": 1,
        "led_status": 44,
        "datetime": "2024-06-04 19:24:03"
    },
    {
        "led_state": 1,
        "led_status": 41,
        "datetime": "2024-06-04 19:24:03"
    },
    {
        "led_state": 1,
        "led_status": 39,
        "datetime": "2024-06-04 19:24:04"
    }
]