{
  "$schema": "../../node_modules/ng-packagr/ng-package.schema.json",
  "dest": "../../dist/sc-settings-lib",
  "lib": {
    "entryFile": "src/public-api.ts"
  },
  "assets": [
    "styles.scss"
  ]
}