<svg width="19" height="23" viewBox="0 0 19 23" fill="none" xmlns="http://www.w3.org/2000/svg">
<path d="M18 11.3789L18 3.1523C18 2.60685 17.7833 2.08373 17.3976 1.69803C17.0119 1.31234 16.4888 1.09565 15.9434 1.09565L3.60345 1.09565C3.05799 1.09565 2.53487 1.31233 2.14918 1.69803C1.76348 2.08373 1.5468 2.60684 1.5468 3.1523L1.5468 11.3789" stroke="#404040" stroke-width="2" stroke-linecap="round" stroke-linejoin="round"/>
<path d="M5.65963 17.5488L9.77293 21.6621L13.8862 17.5488" stroke="#404040" stroke-width="2" stroke-linecap="round" stroke-linejoin="round"/>
<path d="M9.77344 21.6621L9.77344 8.29388" stroke="#404040" stroke-width="2" stroke-linecap="round" stroke-linejoin="round"/>
</svg>
