<svg xmlns="http://www.w3.org/2000/svg" width="127" height="127" viewBox="0 0 127 127" fill="none">
<rect x="1.5" y="1.5" width="123.233" height="123.233" rx="61.6167" fill="white" fill-opacity="0.37" stroke="#F3F6FB" stroke-width="3"/>
<rect x="13.2881" y="13.2871" width="99.658" height="99.658" rx="49.829" fill="#F3F6FB"/>
<path d="M88.8037 58.0918H64.2442C63.2008 58.0918 62.355 58.9259 62.355 59.9548V94.4194C62.355 95.4483 63.2008 96.2824 64.2442 96.2824H88.8037C89.8471 96.2824 90.6929 95.4483 90.6929 94.4194V59.9548C90.6929 58.9259 89.8471 58.0918 88.8037 58.0918Z" fill="#56788B"/>
<path d="M86.9144 60.8874H66.1333V45.0522L68.9671 42.2578L72.7455 44.1208L76.5239 42.2578L80.3023 44.1208L84.0806 42.2578L86.9144 45.9837V60.8874Z" fill="#5BCBFA"/>
<path d="M67.0776 72.9961H70.856V76.722H67.0776V72.9961Z" fill="#BCE8FE"/>
<path d="M67.0776 80.4492H70.856V84.1751H67.0776V80.4492Z" fill="#BCE8FE"/>
<path d="M67.0776 87.9004H70.856V91.6263H67.0776V87.9004Z" fill="#BCE8FE"/>
<path d="M74.6343 72.9961H78.4127V76.722H74.6343V72.9961Z" fill="#BCE8FE"/>
<path d="M74.6343 80.4492H78.4127V84.1751H74.6343V80.4492Z" fill="#BCE8FE"/>
<path d="M74.6343 87.9004H78.4127V91.6263H74.6343V87.9004Z" fill="#BCE8FE"/>
<path d="M82.1914 72.9961H85.9698V76.722H82.1914V72.9961Z" fill="#BCE8FE"/>
<path d="M82.1914 80.4492H85.9698V84.1751H82.1914V80.4492Z" fill="#BCE8FE"/>
<path d="M82.1914 87.9004H85.9698V91.6263H82.1914V87.9004Z" fill="#BCE8FE"/>
<path d="M67.0776 64.6133H85.9696V70.2022H67.0776V64.6133Z" fill="#BCE8FE"/>
<path d="M62.3549 70.2022V53.4355V42.2578H41.5737V53.4355V70.2022V81.3799H62.3549V70.2022Z" fill="#16BB87"/>
<path d="M58.5764 73.9268V49.7083C57.5743 49.7083 56.6133 49.3158 55.9047 48.617C55.1961 47.9183 54.798 46.9706 54.798 45.9824H49.1304C49.1304 46.9706 48.7324 47.9183 48.0238 48.617C47.3152 49.3158 46.3541 49.7083 45.3521 49.7083V73.9268C46.3541 73.9268 47.3152 74.3193 48.0238 75.0181C48.7324 75.7168 49.1304 76.6645 49.1304 77.6527H54.798C54.798 76.6645 55.1961 75.7168 55.9047 75.0181C56.6133 74.3193 57.5743 73.9268 58.5764 73.9268Z" fill="#0BEAA2"/>
<path d="M51.9642 68.3395C55.616 68.3395 58.5764 65.4203 58.5764 61.8192C58.5764 58.2181 55.616 55.2988 51.9642 55.2988C48.3124 55.2988 45.3521 58.2181 45.3521 61.8192C45.3521 65.4203 48.3124 68.3395 51.9642 68.3395Z" fill="#FBDF63"/>
<path d="M41.5738 60.8867L37.0171 70.9411C36.2919 72.1229 35.9078 73.4776 35.9062 74.8589V96.2829H47.2414L48.0424 95.1763C49.1866 93.5966 49.8016 91.7038 49.8016 89.7625C49.8016 87.8213 49.1866 85.9285 48.0424 84.3488L47.2414 83.2422L50.403 78.8773C50.8526 78.2569 51.0846 77.5087 51.0636 76.7464C51.0427 75.9841 50.7699 75.2494 50.2868 74.654C49.7193 73.9545 48.9016 73.4961 48.0019 73.3729C47.1022 73.2497 46.1888 73.4711 45.4495 73.9917L41.5738 76.7218V60.8867Z" fill="#FFDDCE"/>
<path d="M68.9668 47.8457H84.0804V49.7087H68.9668V47.8457Z" fill="#1A6FB0"/>
<path d="M68.9668 51.5723H84.0804V53.4352H68.9668V51.5723Z" fill="#1A6FB0"/>
<path d="M76.5239 55.2988H84.0807V57.1618H76.5239V55.2988Z" fill="#1A6FB0"/>
<path d="M68.9668 56.2303C68.9668 55.7159 69.3838 55.2988 69.8983 55.2988H69.9245C70.439 55.2988 70.856 55.7159 70.856 56.2303C70.856 56.7447 70.439 57.1618 69.9245 57.1618H69.8983C69.3838 57.1618 68.9668 56.7447 68.9668 56.2303Z" fill="#1A6FB0"/>
<path d="M72.7451 55.2988H74.6343V57.1618H72.7451V55.2988Z" fill="#1A6FB0"/>
</svg>