^D:\MARJO\DOCUMENTS\SEMESTRE 2022-1\COMPUTACIÓN GRÁFICA\JAPANESEHOUSE\JAPANESE_HOUSE\STB_IMAGE.CPP
/c /I"D:\MARJO\DOCUMENTS\SEMESTRE 2022-1\COMPUTACIÓN GRÁFICA\JAPANESEHOUSE\DEPS\IRRKLANG\INCLUDE" /I"D:\MARJO\DOCUMENTS\SEMESTRE 2022-1\COMPUTACIÓN GRÁFICA\JAPANESEHOUSE\JAPANESE_HOUSE\INCLUDE" /I"D:\MARJO\DOCUMENTS\SEMESTRE 2022-1\COMPUTACIÓN GRÁFICA\JAPANESEHOUSE\DEPS\ASSIMP\INCLUDE" /I"D:\MARJO\DOCUMENTS\SEMESTRE 2022-1\COMPUTACIÓN GRÁFICA\JAPANESEHOUSE\DEPS\GLAD\INCLUDE" /I"D:\MARJO\DOCUMENTS\SEMESTRE 2022-1\COMPUTACIÓN GRÁFICA\JAPANESEHOUSE\DEPS\GLFW\INCLUDE" /I"D:\MARJO\DOCUMENTS\SEMESTRE 2022-1\COMPUTACIÓN GRÁFICA\JAPANESEHOUSE\DEPS\GLM" /ZI /JMC /nologo /W3 /WX- /diagnostics:column /sdl /Od /D _DEBUG /D _CONSOLE /D _UNICODE /D UNICODE /Gm- /EHsc /RTC1 /MDd /GS /fp:precise /permissive- /Zc:wchar_t /Zc:forScope /Zc:inline /Fo"X64\DEBUG\\" /Fd"X64\DEBUG\VC142.PDB" /external:W3 /Gd /TP /FC D:\MARJO\DOCUMENTS\SEMESTRE 2022-1\COMPUTACIÓN GRÁFICA\JAPANESEHOUSE\JAPANESE_HOUSE\STB_IMAGE.CPP
^D:\MARJO\DOCUMENTS\SEMESTRE 2022-1\COMPUTACIÓN GRÁFICA\JAPANESEHOUSE\JAPANESE_HOUSE\09_INTERACTION.CPP
/c /I"D:\MARJO\DOCUMENTS\SEMESTRE 2022-1\COMPUTACIÓN GRÁFICA\JAPANESEHOUSE\DEPS\IRRKLANG\INCLUDE" /I"D:\MARJO\DOCUMENTS\SEMESTRE 2022-1\COMPUTACIÓN GRÁFICA\JAPANESEHOUSE\JAPANESE_HOUSE\INCLUDE" /I"D:\MARJO\DOCUMENTS\SEMESTRE 2022-1\COMPUTACIÓN GRÁFICA\JAPANESEHOUSE\DEPS\ASSIMP\INCLUDE" /I"D:\MARJO\DOCUMENTS\SEMESTRE 2022-1\COMPUTACIÓN GRÁFICA\JAPANESEHOUSE\DEPS\GLAD\INCLUDE" /I"D:\MARJO\DOCUMENTS\SEMESTRE 2022-1\COMPUTACIÓN GRÁFICA\JAPANESEHOUSE\DEPS\GLFW\INCLUDE" /I"D:\MARJO\DOCUMENTS\SEMESTRE 2022-1\COMPUTACIÓN GRÁFICA\JAPANESEHOUSE\DEPS\GLM" /ZI /JMC /nologo /W3 /WX- /diagnostics:column /sdl /Od /D _DEBUG /D _CONSOLE /D _UNICODE /D UNICODE /Gm- /EHsc /RTC1 /MDd /GS /fp:precise /permissive- /Zc:wchar_t /Zc:forScope /Zc:inline /Fo"X64\DEBUG\\" /Fd"X64\DEBUG\VC142.PDB" /external:W3 /Gd /TP /FC D:\MARJO\DOCUMENTS\SEMESTRE 2022-1\COMPUTACIÓN GRÁFICA\JAPANESEHOUSE\JAPANESE_HOUSE\09_INTERACTION.CPP
