{
  "_id": "60f9e3e27c99216f8dbd9f92",
  "name": "Archive Jobs and Tasks Collections",
  "data": {
    "description": "",
    "workflowId": "Archive Jobs and Tasks Collections",
    "formId": "Archive Jobs and Tasks Collections",
    "formData": {
      "createArchiveCollections": true,
      "deleteCopiedDataFromCollections": true,
      "verbose": true,
      "createArchiveCollection": true,
      "copyMoveJobsDataToCollection": "jobs_archive",
      "copyMoveTasksDataToCollection": "tasks_archive",
      "copyMoveDataOlderThanDays": 30,
      "batchSize": 100000
    },
    "gbac": {
      "write": [],
      "read": []
    },
    "lastUpdated": "2021-07-23T13:18:01.023Z",
    "modifiedById": "60a42ca0957f45d70745e15b",
    "modifiedByUsername": "admin@pronghorn"
  },
  "lastModifiedBy": "09558acaf784:160",
  "lastRunAt": null,
  "nextRunAt": null,
  "priority": 0,
  "repeatInterval": null,
  "repeatTimezone": null,
  "type": "normal"
}