{
  "name": "queryFormData",
  "incoming": [
    {
      "$id": "formData",
      "type": "object",
      "properties": {
        "createArchiveCollections": {
          "type": "boolean",
          "examples": [
            true,
            false
          ]
        },
        "deleteCopiedDataFromCollections": {
          "type": "boolean",
          "examples": [
            true,
            false
          ]
        },
        "verbose": {
          "type": "boolean",
          "examples": [
            true,
            false
          ]
        },
        "copyMoveJobsDataToCollection": {
          "type": "string",
          "examples": [
            "archiveJobs"
          ]
        },
        "copyMoveTasksDataToCollection": {
          "type": "string",
          "examples": [
            "archiveCollection"
          ]
        },
        "copyMoveDataOlderThanDays": {
          "type": "integer",
          "examples": [
            30
          ]
        },
        "batchSize": {
          "type": "integer",
          "examples": [
            30
          ]
        },
        "mongoDbAdapter": {
          "type": "string",
          "examples": [
            "mongo-adapter"
          ]
        }
      },
      "required": []
    }
  ],
  "outgoing": [
    {
      "$id": "collectionNameForJobs",
      "type": [
        "array",
        "boolean",
        "number",
        "integer",
        "string",
        "object",
        "null"
      ]
    },
    {
      "$id": "collectionNameForTasks",
      "type": [
        "array",
        "boolean",
        "number",
        "integer",
        "string",
        "object",
        "null"
      ]
    },
    {
      "$id": "offsetDuration",
      "type": [
        "array",
        "boolean",
        "number",
        "integer",
        "string",
        "object",
        "null"
      ]
    },
    {
      "$id": "createArchiveCollection",
      "type": "boolean",
      "examples": [
        true,
        false
      ]
    },
    {
      "$id": "deleteCopiedDataFromCollections",
      "type": [
        "array",
        "boolean",
        "number",
        "integer",
        "string",
        "object",
        "null"
      ]
    },
    {
      "$id": "verbose",
      "type": [
        "array",
        "boolean",
        "number",
        "integer",
        "string",
        "object",
        "null"
      ]
    },
    {
      "$id": "viewDataNumberOfDays",
      "type": "string",
      "examples": [
        "a"
      ]
    },
    {
      "$id": "numberOfDays",
      "type": "integer"
    },
    {
      "$id": "batchSize",
      "type": "integer",
      "examples": [
        20000
      ]
    },
    {
      "$id": "mongoAdapter",
      "type": "string",
      "examples": [
        "adapter-mongo"
      ]
    }
  ],
  "steps": [
    {
      "id": 6,
      "type": "declaration",
      "library": "Object",
      "method": "new Object",
      "args": [
        "{}"
      ],
      "view": {
        "row": 2,
        "col": 1
      }
    },
    {
      "id": 17,
      "type": "assign",
      "from": {
        "location": "incoming",
        "name": "formData",
        "ptr": "/verbose"
      },
      "to": {
        "location": "outgoing",
        "name": "verbose",
        "ptr": ""
      }
    },
    {
      "id": 18,
      "type": "assign",
      "from": {
        "location": "incoming",
        "name": "formData",
        "ptr": "/deleteCopiedDataFromCollections"
      },
      "to": {
        "location": "outgoing",
        "name": "deleteCopiedDataFromCollections",
        "ptr": ""
      }
    },
    {
      "id": 19,
      "type": "assign",
      "from": {
        "location": "incoming",
        "name": "formData",
        "ptr": "/copyMoveDataOlderThanDays"
      },
      "to": {
        "location": "method",
        "name": 11,
        "ptr": "/args/1/value"
      }
    },
    {
      "id": 21,
      "type": "assign",
      "from": {
        "location": "incoming",
        "name": "formData",
        "ptr": "/copyMoveDataOlderThanDays"
      },
      "to": {
        "location": "template",
        "name": 20,
        "ptr": "/args/0/value"
      }
    },
    {
      "id": 23,
      "type": "assign",
      "from": {
        "location": "incoming",
        "name": "formData",
        "ptr": "/copyMoveDataOlderThanDays"
      },
      "to": {
        "location": "outgoing",
        "name": "numberOfDays",
        "ptr": ""
      }
    },
    {
      "id": 24,
      "type": "declaration",
      "library": "Date",
      "method": "new Date",
      "args": [],
      "view": {
        "row": 1,
        "col": 1
      },
      "polymorphIndex": 0
    },
    {
      "id": 31,
      "type": "assign",
      "from": {
        "location": "incoming",
        "name": "formData",
        "ptr": "/copyMoveJobsDataToCollection"
      },
      "to": {
        "location": "method",
        "name": 26,
        "ptr": "/args/0/value"
      }
    },
    {
      "id": 33,
      "type": "assign",
      "from": {
        "location": "incoming",
        "name": "formData",
        "ptr": "/copyMoveTasksDataToCollection"
      },
      "to": {
        "location": "method",
        "name": 27,
        "ptr": "/args/0/value"
      }
    },
    {
      "id": 8,
      "type": "assign",
      "from": {
        "location": "declaration",
        "name": 6,
        "ptr": "/return"
      },
      "to": {
        "location": "method",
        "name": 7,
        "ptr": "/args/0/value"
      }
    },
    {
      "id": 11,
      "type": "method",
      "library": "Math",
      "method": "multiply",
      "args": [
        -1,
        null
      ],
      "view": {
        "row": 3,
        "col": 1
      }
    },
    {
      "id": 20,
      "type": "template",
      "library": "String",
      "method": "templateLiteral",
      "template": "✗ No data found older than ${numberOfDays} days",
      "args": [
        null
      ],
      "view": {
        "row": 3,
        "col": 2
      }
    },
    {
      "id": 28,
      "type": "assign",
      "from": {
        "location": "declaration",
        "name": 24,
        "ptr": "/return"
      },
      "to": {
        "location": "method",
        "name": 25,
        "ptr": "/args/0/value"
      }
    },
    {
      "id": 13,
      "type": "assign",
      "from": {
        "location": "method",
        "name": 11,
        "ptr": "/return"
      },
      "to": {
        "location": "method",
        "name": 7,
        "ptr": "/args/2/value"
      }
    },
    {
      "id": 22,
      "type": "assign",
      "from": {
        "location": "template",
        "name": 20,
        "ptr": "/return"
      },
      "to": {
        "location": "outgoing",
        "name": "viewDataNumberOfDays",
        "ptr": ""
      }
    },
    {
      "id": 25,
      "type": "method",
      "library": "Date",
      "method": "toISOString",
      "args": [
        null
      ],
      "view": {
        "row": 1,
        "col": 2
      }
    },
    {
      "id": 35,
      "type": "assign",
      "from": {
        "location": "method",
        "name": 25,
        "ptr": "/return"
      },
      "to": {
        "location": "method",
        "name": 26,
        "ptr": "/args/2/value"
      }
    },
    {
      "id": 36,
      "type": "assign",
      "from": {
        "location": "method",
        "name": 25,
        "ptr": "/return"
      },
      "to": {
        "location": "method",
        "name": 27,
        "ptr": "/args/2/value"
      }
    },
    {
      "id": 7,
      "type": "method",
      "library": "Object",
      "method": "setProperty",
      "args": [
        null,
        "days",
        null
      ],
      "view": {
        "row": 2,
        "col": 2
      }
    },
    {
      "id": 26,
      "type": "method",
      "library": "String",
      "method": "concat",
      "args": [
        null,
        "_",
        null
      ],
      "view": {
        "row": 1,
        "col": 3
      }
    },
    {
      "id": 27,
      "type": "method",
      "library": "String",
      "method": "concat",
      "args": [
        null,
        "_",
        null
      ],
      "view": {
        "row": 2,
        "col": 3
      }
    },
    {
      "id": 10,
      "type": "assign",
      "from": {
        "location": "method",
        "name": 7,
        "ptr": "/return"
      },
      "to": {
        "location": "outgoing",
        "name": "offsetDuration",
        "ptr": ""
      }
    },
    {
      "id": 32,
      "type": "assign",
      "from": {
        "location": "method",
        "name": 26,
        "ptr": "/return"
      },
      "to": {
        "location": "outgoing",
        "name": "collectionNameForJobs",
        "ptr": ""
      }
    },
    {
      "id": 34,
      "type": "assign",
      "from": {
        "location": "method",
        "name": 27,
        "ptr": "/return"
      },
      "to": {
        "location": "outgoing",
        "name": "collectionNameForTasks",
        "ptr": ""
      }
    },
    {
      "id": 38,
      "type": "assign",
      "from": {
        "location": "incoming",
        "name": "formData",
        "ptr": "/mongoDbAdapter"
      },
      "to": {
        "location": "outgoing",
        "name": "mongoAdapter",
        "ptr": ""
      }
    },
    {
      "id": 39,
      "type": "assign",
      "from": {
        "location": "incoming",
        "name": "formData",
        "ptr": "/createArchiveCollections"
      },
      "to": {
        "location": "outgoing",
        "name": "createArchiveCollection",
        "ptr": ""
      }
    },
    {
      "id": 40,
      "type": "assign",
      "from": {
        "location": "incoming",
        "name": "formData",
        "ptr": "/batchSize"
      },
      "to": {
        "location": "outgoing",
        "name": "batchSize",
        "ptr": ""
      }
    }
  ],
  "functions": [],
  "view": {
    "col": 3,
    "row": 5
  },
  "_id": "5f736aad89fdc04a3b6b701e",
  "comments": [],
  "version": "3.17.7-2021.1.0",
  "created": "2021-07-22T17:45:19.685Z",
  "createdBy": "admin@pronghorn",
  "lastUpdated": "2021-07-22T17:45:19.685Z",
  "lastUpdatedBy": "admin@pronghorn"
}