{
  "model": {
    "type": "rmplStrings",
    "files": [
      ";;; -*- mode: common-lisp; -*-\n\n(rmpl:defpackage :costa-rica/campaign\n  (:use #:cl #:rmpl/lib/lock)\n  (:export #:main))\n\n(in-package :costa-rica/campaign)\n\n;; define all resources\n\n(defclass resource (standard-model-object)\n  ((id\n    :initarg :id)\n   (lock\n    :final t\n    :initform (make-lock)\n    :reader resource-lock)))\n(defclass 5bfc209102e0f3030ce8ed67 (resource)\n  ())\n(defclass 5bfc9f4702e0f30016628f6f (resource)\n  ())\n",
      "(in-package :costa-rica/campaign)\n\n;; define the world with resources\n\n(defclass world (standard-model-object)\n  ((5bfc20ee02e0f3030ce8ed68\n    :type 5bfc209102e0f3030ce8ed67\n    :initform (make-instance '5bfc209102e0f3030ce8ed67\n                             :id \"5bfc20ee02e0f3030ce8ed68\")\n    :final t)\n   (5bfc433102e0f30016628f39\n    :type 5bfc209102e0f3030ce8ed67\n    :initform (make-instance '5bfc209102e0f3030ce8ed67\n                             :id \"5bfc433102e0f30016628f39\")\n    :final t)\n   (5bfc4efc02e0f30016628f3b\n    :type resource\n    :initform (make-instance 'resource\n                             :id \"5bfc4efc02e0f30016628f3b\")\n    :final t)\n   (5bfc564c02e0f30016628f45\n    :type 5bfc9f4702e0f30016628f6f\n    :initform (make-instance '5bfc9f4702e0f30016628f6f\n                             :id \"5bfc564c02e0f30016628f45\")\n    :final t)\n   (5bfc5c4502e0f30016628f54\n    :type 5bfc9f4702e0f30016628f6f\n    :initform (make-instance '5bfc9f4702e0f30016628f6f\n                             :id \"5bfc5c4502e0f30016628f54\")\n    :final t)\n   (5bfc8bec02e0f30016628f5f\n    :type 5bfc9f4702e0f30016628f6f\n    :initform (make-instance '5bfc9f4702e0f30016628f6f\n                             :id \"5bfc8bec02e0f30016628f5f\")\n    :final t)\n   (5bfc955002e0f30016628f6a\n    :type 5bfc9f4702e0f30016628f6f\n    :initform (make-instance '5bfc9f4702e0f30016628f6f\n                             :id \"5bfc955002e0f30016628f6a\")\n    :final t)))\n\n(define-control-program 5bfdbbc302e0f30016628f74 (vehicle crew)\n  (declare (primitive vehicle crew)\n           ;;(duration (simple :lower-bound 10 :upper-bound 18))\n           (holds-lock\n            (resource-lock vehicle)\n            (resource-lock crew))))\n\n(define-control-program 5bfdbc0f02e0f30016628f75 (boat)\n  (declare (primitive boat)\n           ;;(duration (simple :lower-bound 30 :upper-bound 135))\n           (holds-lock\n            (resource-lock boat))))\n\n(define-control-program main ()\n  (with-blocks (5bfdb8c502e0f30016628f72 5bfdbb7b02e0f30016628f73 5bfdbbc302e0f30016628f74 5bfdbc0f02e0f30016628f75 main)\n    (rmpl-block main\n      (assert! (simple-temporal :from-event (start-of main)\n                                :to-event (end-of main)\n                                :upper-bound (* 600 60)))\n      (assert! (simple-temporal :from-event (start-of main)\n                                :to-event (start-of 5bfdb8c502e0f30016628f72)\n                                :lower-bound 16775))\n      (assert! (simple-temporal :from-event (start-of main)\n                                :to-event (end-of 5bfdb8c502e0f30016628f72)\n                                :upper-bound 17376))\n      (assert! (simple-temporal :from-event (start-of main)\n                                :to-event (start-of 5bfdbb7b02e0f30016628f73)\n                                :lower-bound 16775))\n      (assert! (simple-temporal :from-event (start-of main)\n                                :to-event (end-of 5bfdbb7b02e0f30016628f73)\n                                :upper-bound 17196))\n      (assert! (simple-temporal :from-event (start-of main)\n                                :to-event (start-of 5bfdbbc302e0f30016628f74)\n                                :lower-bound 16775))\n      (assert! (simple-temporal :from-event (start-of main)\n                                :to-event (end-of 5bfdbbc302e0f30016628f74)\n                                :upper-bound 17513))\n      (assert! (simple-temporal :from-event (start-of main)\n                                :to-event (start-of 5bfdbc0f02e0f30016628f75)\n                                :lower-bound 16745))\n      (assert! (simple-temporal :from-event (start-of main)\n                                :to-event (end-of 5bfdbc0f02e0f30016628f75)\n                                :upper-bound 17905))\n      (assert! (simple-temporal :from-event (end-of 5bfdbc0f02e0f30016628f75)\n                                :to-event (start-of 5bfdbbc302e0f30016628f74)\n                                :lower-bound 0))\n      (assert! (simple-temporal :from-event (start-of 5bfdb8c502e0f30016628f72)\n                                :to-event (end-of 5bfdb8c502e0f30016628f72)\n                                :lower-bound 170\n                                :upper-bound 240))\n      (assert! (simple-temporal :from-event (start-of 5bfdbb7b02e0f30016628f73)\n                                :to-event (end-of 5bfdbb7b02e0f30016628f73)\n                                :lower-bound 35\n                                :upper-bound 40))\n\n      (let ((vehicle-5bfdbbc302e0f30016628f74 (choose-either (slot-value *world* '5bfc4efc02e0f30016628f3b)\n                                                             (slot-value *world* '5bfc20ee02e0f3030ce8ed68)))\n            (crew-5bfdbbc302e0f30016628f74 (choose-either (slot-value *world* '5bfc4efc02e0f30016628f3b)))\n            (boat-5bfdbc0f02e0f30016628f75 (choose-either (slot-value *world* '5bfc564c02e0f30016628f45)\n                                                          (slot-value *world* '5bfc5c4502e0f30016628f54)\n                                                          (slot-value *world* '5bfc8bec02e0f30016628f5f)\n                                                          (slot-value *world* '5bfc955002e0f30016628f6a))))\n\n        (par (:slack t)\n          (rmpl-block 5bfdb8c502e0f30016628f72\n            (par (:slack t)\n              (rmpl-block 5bfdbb7b02e0f30016628f73\n                (par (:slack t)\n                  (rmpl-block 5bfdbbc302e0f30016628f74\n                    (5bfdbbc302e0f30016628f74 vehicle-5bfdbbc302e0f30016628f74 crew-5bfdbbc302e0f30016628f74))))))\n          (rmpl-block 5bfdbc0f02e0f30016628f75\n            (5bfdbc0f02e0f30016628f75 boat-5bfdbc0f02e0f30016628f75)))))))\n"
    ]
  },
  "worldState": {
    "type": "jsonEncodedRmplObjects",
    "worldState": {
      "type": "object",
      "packageName": "costa-rica/campaign",
      "className": "world",
      "makeInstance": true
    }
  },
  "goal": {
    "type": "runRmplFunction",
    "functionPackage": "costa-rica/campaign",
    "functionName": "main",
    "functionArgs": []
  },
  "termination": {
    "plans": 1
  }
}
