G75*
G70*
%OFA0B0*%
%FSLAX24Y24*%
%IPPOS*%
%LPD*%
%AMOC8*
5,1,8,0,0,1.08239X$1,22.5*
%
%ADD10C,0.0472*%
%ADD11R,0.0600X0.1500*%
%ADD12R,0.0394X0.0433*%
%ADD13C,0.0240*%
D10*
X001460Y003238D03*
X001800Y003838D03*
X002170Y003238D03*
X002510Y003838D03*
X002890Y003238D03*
X003230Y003838D03*
X003600Y003238D03*
X003940Y003838D03*
D11*
X004850Y004338D03*
X000650Y004288D03*
D12*
X003500Y001523D03*
X004000Y001523D03*
X004000Y000854D03*
X003500Y000854D03*
D13*
X002665Y001523D02*
X001500Y002688D01*
X001500Y003198D01*
X001460Y003238D01*
X002665Y001523D02*
X003500Y001523D01*
X004000Y001523D02*
X004000Y002385D01*
X003697Y002688D01*
X003697Y003142D01*
X003600Y003238D01*
X003940Y003838D02*
X004750Y003028D01*
X004750Y001138D01*
X004465Y000854D01*
X004000Y000854D01*
X003500Y000854D01*
M02*
