<?xml version="1.0" encoding="utf-8"?>
<!DOCTYPE eagle SYSTEM "eagle.dtd">
<eagle version="6.3">
<drawing>
<settings>
<setting alwaysvectorfont="yes"/>
<setting verticaltext="up"/>
</settings>
<grid distance="0.05" unitdist="inch" unit="inch" style="lines" multiple="1" display="yes" altdistance="0.005" altunitdist="inch" altunit="inch"/>
<layers>
<layer number="1" name="Top" color="4" fill="1" visible="yes" active="yes"/>
<layer number="2" name="Route2" color="1" fill="3" visible="no" active="yes"/>
<layer number="15" name="Route15" color="4" fill="6" visible="no" active="yes"/>
<layer number="16" name="Bottom" color="1" fill="1" visible="yes" active="yes"/>
<layer number="17" name="Pads" color="2" fill="1" visible="yes" active="yes"/>
<layer number="18" name="Vias" color="2" fill="1" visible="yes" active="yes"/>
<layer number="19" name="Unrouted" color="6" fill="1" visible="yes" active="yes"/>
<layer number="20" name="Dimension" color="15" fill="1" visible="yes" active="yes"/>
<layer number="21" name="tPlace" color="16" fill="1" visible="yes" active="yes"/>
<layer number="22" name="bPlace" color="14" fill="1" visible="yes" active="yes"/>
<layer number="23" name="tOrigins" color="15" fill="1" visible="yes" active="yes"/>
<layer number="24" name="bOrigins" color="15" fill="1" visible="yes" active="yes"/>
<layer number="25" name="tNames" color="7" fill="1" visible="no" active="yes"/>
<layer number="26" name="bNames" color="7" fill="1" visible="no" active="yes"/>
<layer number="27" name="tValues" color="7" fill="1" visible="no" active="yes"/>
<layer number="28" name="bValues" color="7" fill="1" visible="no" active="yes"/>
<layer number="29" name="tStop" color="7" fill="3" visible="no" active="yes"/>
<layer number="30" name="bStop" color="7" fill="6" visible="no" active="yes"/>
<layer number="31" name="tCream" color="7" fill="4" visible="no" active="yes"/>
<layer number="32" name="bCream" color="7" fill="5" visible="no" active="yes"/>
<layer number="33" name="tFinish" color="6" fill="3" visible="no" active="yes"/>
<layer number="34" name="bFinish" color="6" fill="6" visible="no" active="yes"/>
<layer number="35" name="tGlue" color="7" fill="4" visible="no" active="yes"/>
<layer number="36" name="bGlue" color="7" fill="5" visible="no" active="yes"/>
<layer number="37" name="tTest" color="7" fill="1" visible="no" active="yes"/>
<layer number="38" name="bTest" color="7" fill="1" visible="no" active="yes"/>
<layer number="39" name="tKeepout" color="4" fill="11" visible="no" active="yes"/>
<layer number="40" name="bKeepout" color="1" fill="11" visible="no" active="yes"/>
<layer number="41" name="tRestrict" color="4" fill="10" visible="no" active="yes"/>
<layer number="42" name="bRestrict" color="1" fill="10" visible="no" active="yes"/>
<layer number="43" name="vRestrict" color="2" fill="10" visible="no" active="yes"/>
<layer number="44" name="Drills" color="7" fill="1" visible="no" active="yes"/>
<layer number="45" name="Holes" color="7" fill="1" visible="yes" active="yes"/>
<layer number="46" name="Milling" color="3" fill="1" visible="no" active="yes"/>
<layer number="47" name="Measures" color="7" fill="1" visible="no" active="yes"/>
<layer number="48" name="Document" color="7" fill="1" visible="no" active="yes"/>
<layer number="49" name="Reference" color="7" fill="1" visible="no" active="yes"/>
<layer number="50" name="dxf" color="7" fill="1" visible="no" active="no"/>
<layer number="51" name="tDocu" color="6" fill="1" visible="yes" active="yes"/>
<layer number="52" name="bDocu" color="7" fill="1" visible="no" active="yes"/>
<layer number="53" name="tGND_GNDA" color="7" fill="9" visible="no" active="no"/>
<layer number="54" name="bGND_GNDA" color="1" fill="9" visible="no" active="no"/>
<layer number="56" name="wert" color="7" fill="1" visible="no" active="no"/>
<layer number="91" name="Nets" color="2" fill="1" visible="no" active="no"/>
<layer number="92" name="Busses" color="1" fill="1" visible="no" active="no"/>
<layer number="93" name="Pins" color="2" fill="1" visible="no" active="no"/>
<layer number="94" name="Symbols" color="4" fill="1" visible="no" active="no"/>
<layer number="95" name="Names" color="7" fill="1" visible="no" active="no"/>
<layer number="96" name="Values" color="7" fill="1" visible="no" active="no"/>
<layer number="97" name="Info" color="7" fill="1" visible="no" active="no"/>
<layer number="98" name="Guide" color="6" fill="1" visible="no" active="no"/>
<layer number="100" name="Muster" color="7" fill="1" visible="no" active="no"/>
<layer number="101" name="Patch_Top" color="12" fill="4" visible="no" active="yes"/>
<layer number="102" name="Vscore" color="7" fill="1" visible="no" active="yes"/>
<layer number="103" name="tMap" color="7" fill="1" visible="no" active="yes"/>
<layer number="104" name="Name" color="16" fill="1" visible="no" active="yes"/>
<layer number="105" name="tPlate" color="7" fill="1" visible="no" active="yes"/>
<layer number="106" name="bPlate" color="7" fill="1" visible="no" active="yes"/>
<layer number="107" name="Crop" color="7" fill="1" visible="no" active="yes"/>
<layer number="116" name="Patch_BOT" color="9" fill="4" visible="no" active="yes"/>
<layer number="121" name="_tsilk" color="7" fill="1" visible="no" active="yes"/>
<layer number="122" name="_bsilk" color="7" fill="1" visible="no" active="yes"/>
<layer number="125" name="_tNames" color="7" fill="1" visible="no" active="yes"/>
<layer number="144" name="Drill_legend" color="7" fill="1" visible="no" active="yes"/>
<layer number="151" name="HeatSink" color="7" fill="1" visible="no" active="yes"/>
<layer number="199" name="Contour" color="7" fill="1" visible="no" active="yes"/>
<layer number="200" name="200bmp" color="1" fill="10" visible="no" active="yes"/>
<layer number="201" name="201bmp" color="2" fill="10" visible="no" active="yes"/>
<layer number="202" name="202bmp" color="3" fill="10" visible="no" active="yes"/>
<layer number="203" name="203bmp" color="4" fill="10" visible="no" active="yes"/>
<layer number="204" name="204bmp" color="5" fill="10" visible="no" active="yes"/>
<layer number="205" name="205bmp" color="6" fill="10" visible="no" active="yes"/>
<layer number="206" name="206bmp" color="7" fill="10" visible="no" active="yes"/>
<layer number="207" name="207bmp" color="8" fill="10" visible="no" active="yes"/>
<layer number="208" name="208bmp" color="9" fill="10" visible="no" active="yes"/>
<layer number="209" name="209bmp" color="7" fill="1" visible="no" active="yes"/>
<layer number="210" name="210bmp" color="7" fill="1" visible="no" active="yes"/>
<layer number="211" name="211bmp" color="7" fill="1" visible="no" active="yes"/>
<layer number="212" name="212bmp" color="7" fill="1" visible="no" active="yes"/>
<layer number="213" name="213bmp" color="7" fill="1" visible="no" active="yes"/>
<layer number="214" name="214bmp" color="7" fill="1" visible="no" active="yes"/>
<layer number="215" name="215bmp" color="7" fill="1" visible="no" active="yes"/>
<layer number="216" name="216bmp" color="7" fill="1" visible="no" active="yes"/>
<layer number="217" name="217bmp" color="18" fill="1" visible="no" active="no"/>
<layer number="218" name="218bmp" color="19" fill="1" visible="no" active="no"/>
<layer number="219" name="219bmp" color="20" fill="1" visible="no" active="no"/>
<layer number="220" name="220bmp" color="21" fill="1" visible="no" active="no"/>
<layer number="221" name="221bmp" color="22" fill="1" visible="no" active="no"/>
<layer number="222" name="222bmp" color="23" fill="1" visible="no" active="no"/>
<layer number="223" name="223bmp" color="24" fill="1" visible="no" active="no"/>
<layer number="224" name="224bmp" color="25" fill="1" visible="no" active="no"/>
<layer number="250" name="Descript" color="3" fill="1" visible="no" active="no"/>
<layer number="251" name="SMDround" color="12" fill="11" visible="no" active="no"/>
<layer number="254" name="cooling" color="7" fill="1" visible="no" active="yes"/>
</layers>
<board>
<plain>
<wire x1="0" y1="0" x2="13.208" y2="0" width="0" layer="20"/>
<wire x1="13.208" y1="0" x2="13.208" y2="13.208" width="0" layer="20"/>
<wire x1="13.208" y1="13.208" x2="0" y2="13.208" width="0" layer="20"/>
<wire x1="0" y1="13.208" x2="0" y2="0" width="0" layer="20"/>
<wire x1="0" y1="0" x2="13.208" y2="0" width="0.254" layer="21"/>
<wire x1="13.208" y1="0" x2="13.208" y2="13.208" width="0.254" layer="21"/>
<wire x1="13.208" y1="13.208" x2="0" y2="13.208" width="0.254" layer="21"/>
<wire x1="0" y1="13.208" x2="0" y2="0" width="0.254" layer="21"/>
<text x="7.112" y="5.334" size="1.27" layer="22" ratio="18" rot="MR270">10K</text>
<text x="12.7" y="5.461" size="1.27" layer="22" ratio="18" rot="MR270">0.1uF</text>
<text x="12.446" y="10.16" size="0.762" layer="21" ratio="18" rot="R90">VCC</text>
<text x="11.176" y="10.16" size="0.762" layer="21" ratio="18" rot="R90">GND</text>
<text x="3.556" y="10.16" size="0.762" layer="21" ratio="18" rot="R90">SCL</text>
<text x="2.286" y="10.16" size="0.762" layer="21" ratio="18" rot="R90">SDA</text>
<text x="10.922" y="0.381" size="1.0922" layer="22" ratio="18" rot="MR0">WII-CAM v1.1</text>
<text x="12.827" y="2.667" size="1.0922" layer="21" ratio="18" rot="R90">1/7/13</text>
</plain>
<libraries>
<library name="ACL">
<packages>
<package name="WII_CAM">
<pad name="P$2" x="-2.159" y="2.286" drill="0.8"/>
<pad name="P$4" x="-0.3556" y="2.286" drill="0.8"/>
<pad name="P$6" x="1.4732" y="2.286" drill="0.8"/>
<pad name="P$8" x="3.2766" y="2.286" drill="0.8"/>
<pad name="P$7" x="2.413" y="3.81" drill="0.8"/>
<pad name="P$5" x="0.6096" y="3.81" drill="0.8"/>
<pad name="P$3" x="-1.2192" y="3.81" drill="0.8"/>
<pad name="P$1" x="-3.0226" y="3.81" drill="0.8"/>
<wire x1="-6.35" y1="0" x2="6.35" y2="0" width="0.254" layer="21"/>
<hole x="-2.3368" y="6.096" drill="1.27"/>
<hole x="1.4732" y="6.096" drill="1.27"/>
<wire x1="-6.35" y1="0" x2="-6.35" y2="7.62" width="0.254" layer="21"/>
<wire x1="-6.35" y1="7.62" x2="6.35" y2="7.62" width="0.254" layer="21"/>
<wire x1="6.35" y1="7.62" x2="6.35" y2="0" width="0.254" layer="21"/>
<smd name="P$9" x="-5.334" y="5.08" dx="3.81" dy="1.524" layer="1" rot="R90"/>
<smd name="P$10" x="5.334" y="4.953" dx="3.81" dy="1.524" layer="1" rot="R90"/>
</package>
<package name="CRYSTAL-OSC-SMD-4X2">
<wire x1="-0.25" y1="1.37" x2="0.26" y2="1.37" width="0.2032" layer="21"/>
<wire x1="-1.735" y1="0.16" x2="-1.735" y2="-0.15" width="0.2032" layer="21"/>
<circle x="-2.2536" y="-1.0894" radius="0.2653" width="0.127" layer="21"/>
<circle x="-2.2536" y="-1.0894" radius="0.1456" width="0.127" layer="21"/>
<circle x="-2.2536" y="-1.0894" radius="0.0284" width="0.127" layer="21"/>
<smd name="1" x="-1.1" y="-0.875" dx="1.2" dy="0.95" layer="1"/>
<smd name="3" x="1.1" y="0.875" dx="1.2" dy="0.95" layer="1"/>
<smd name="4" x="-1.1" y="0.875" dx="1.2" dy="0.95" layer="1"/>
<smd name="2" x="1.1" y="-0.875" dx="1.2" dy="0.95" layer="1"/>
<text x="-1.77" y="1.625" size="0.4064" layer="25">&gt;NAME</text>
<text x="-1.72" y="-2.05" size="0.4064" layer="27">&gt;VALUE</text>
<wire x1="-0.26" y1="-1.34" x2="0.25" y2="-1.34" width="0.2032" layer="21"/>
<wire x1="1.725" y1="0.16" x2="1.725" y2="-0.15" width="0.2032" layer="21"/>
</package>
</packages>
</library>
<library name="SparkFun-Resistors">
<description>&lt;h3&gt;SparkFun Electronics' preferred foot prints&lt;/h3&gt;
In this library you'll find resistors, capacitors, inductors, test points, jumper pads, etc.&lt;br&gt;&lt;br&gt;
We've spent an enormous amount of time creating and checking these footprints and parts, but it is the end user's responsibility to ensure correctness and suitablity for a given componet or application. If you enjoy using this library, please buy one of our products at www.sparkfun.com.
&lt;br&gt;&lt;br&gt;
&lt;b&gt;Licensing:&lt;/b&gt; CC v3.0 Share-Alike You are welcome to use this library for commercial purposes. For attribution, we ask that when you begin to sell your device using our footprint, you email us with a link to the product being sold. We want bragging rights that we helped (in a very small part) to create your 8th world wonder. We would like the opportunity to feature your device on our homepage.</description>
<packages>
<package name="0603-RES">
<wire x1="-1.473" y1="0.983" x2="1.473" y2="0.983" width="0.0508" layer="39"/>
<wire x1="1.473" y1="0.983" x2="1.473" y2="-0.983" width="0.0508" layer="39"/>
<wire x1="1.473" y1="-0.983" x2="-1.473" y2="-0.983" width="0.0508" layer="39"/>
<wire x1="-1.473" y1="-0.983" x2="-1.473" y2="0.983" width="0.0508" layer="39"/>
<wire x1="-0.356" y1="0.432" x2="0.356" y2="0.432" width="0.1016" layer="51"/>
<wire x1="-0.356" y1="-0.419" x2="0.356" y2="-0.419" width="0.1016" layer="51"/>
<smd name="1" x="-0.85" y="0" dx="1.1" dy="1" layer="1"/>
<smd name="2" x="0.85" y="0" dx="1.1" dy="1" layer="1"/>
<text x="-0.889" y="0.762" size="0.4064" layer="25" font="vector">&gt;NAME</text>
<text x="-1.016" y="-1.143" size="0.4064" layer="27" font="vector">&gt;VALUE</text>
<rectangle x1="-0.8382" y1="-0.4699" x2="-0.3381" y2="0.4801" layer="51"/>
<rectangle x1="0.3302" y1="-0.4699" x2="0.8303" y2="0.4801" layer="51"/>
<rectangle x1="-0.1999" y1="-0.3" x2="0.1999" y2="0.3" layer="35"/>
<rectangle x1="-0.2286" y1="-0.381" x2="0.2286" y2="0.381" layer="21"/>
</package>
</packages>
</library>
<library name="SparkFun-Passives">
<description>&lt;h3&gt;SparkFun Electronics' preferred foot prints&lt;/h3&gt;
In this library you'll find resistors, capacitors, inductors, test points, jumper pads, etc.&lt;br&gt;&lt;br&gt;
We've spent an enormous amount of time creating and checking these footprints and parts, but it is the end user's responsibility to ensure correctness and suitablity for a given componet or application. If you enjoy using this library, please buy one of our products at www.sparkfun.com.
&lt;br&gt;&lt;br&gt;
&lt;b&gt;Licensing:&lt;/b&gt; CC v3.0 Share-Alike You are welcome to use this library for commercial purposes. For attribution, we ask that when you begin to sell your device using our footprint, you email us with a link to the product being sold. We want bragging rights that we helped (in a very small part) to create your 8th world wonder. We would like the opportunity to feature your device on our homepage.</description>
<packages>
<package name="0603-CAP">
<wire x1="-1.473" y1="0.983" x2="1.473" y2="0.983" width="0.0508" layer="39"/>
<wire x1="1.473" y1="0.983" x2="1.473" y2="-0.983" width="0.0508" layer="39"/>
<wire x1="1.473" y1="-0.983" x2="-1.473" y2="-0.983" width="0.0508" layer="39"/>
<wire x1="-1.473" y1="-0.983" x2="-1.473" y2="0.983" width="0.0508" layer="39"/>
<wire x1="-0.356" y1="0.432" x2="0.356" y2="0.432" width="0.1016" layer="51"/>
<wire x1="-0.356" y1="-0.419" x2="0.356" y2="-0.419" width="0.1016" layer="51"/>
<wire x1="0" y1="0.0305" x2="0" y2="-0.0305" width="0.5588" layer="21"/>
<smd name="1" x="-0.85" y="0" dx="1.1" dy="1" layer="1"/>
<smd name="2" x="0.85" y="0" dx="1.1" dy="1" layer="1"/>
<text x="-0.889" y="0.762" size="0.4064" layer="25" font="vector">&gt;NAME</text>
<text x="-1.016" y="-1.143" size="0.4064" layer="27" font="vector">&gt;VALUE</text>
<rectangle x1="-0.8382" y1="-0.4699" x2="-0.3381" y2="0.4801" layer="51"/>
<rectangle x1="0.3302" y1="-0.4699" x2="0.8303" y2="0.4801" layer="51"/>
<rectangle x1="-0.1999" y1="-0.3" x2="0.1999" y2="0.3" layer="35"/>
</package>
</packages>
</library>
<library name="SparkFun-Connectors">
<description>&lt;h3&gt;SparkFun Electronics' preferred foot prints&lt;/h3&gt;
In this library you'll find connectors and sockets- basically anything that can be plugged into or onto.&lt;br&gt;&lt;br&gt;
We've spent an enormous amount of time creating and checking these footprints and parts, but it is the end user's responsibility to ensure correctness and suitablity for a given componet or application. If you enjoy using this library, please buy one of our products at www.sparkfun.com.
&lt;br&gt;&lt;br&gt;
&lt;b&gt;Licensing:&lt;/b&gt; CC v3.0 Share-Alike You are welcome to use this library for commercial purposes. For attribution, we ask that when you begin to sell your device using our footprint, you email us with a link to the product being sold. We want bragging rights that we helped (in a very small part) to create your 8th world wonder. We would like the opportunity to feature your device on our homepage.</description>
<packages>
<package name="1X04-1MM-RA">
<wire x1="-1.5" y1="-4.6" x2="1.5" y2="-4.6" width="0.254" layer="21"/>
<wire x1="-3" y1="-2" x2="-3" y2="-0.35" width="0.254" layer="21"/>
<wire x1="2.25" y1="-0.35" x2="3" y2="-0.35" width="0.254" layer="21"/>
<wire x1="3" y1="-0.35" x2="3" y2="-2" width="0.254" layer="21"/>
<wire x1="-3" y1="-0.35" x2="-2.25" y2="-0.35" width="0.254" layer="21"/>
<circle x="-2.5" y="0.3" radius="0.1414" width="0.4" layer="21"/>
<smd name="NC2" x="-2.8" y="-3.675" dx="1.2" dy="2" layer="1"/>
<smd name="NC1" x="2.8" y="-3.675" dx="1.2" dy="2" layer="1"/>
<smd name="1" x="-1.5" y="0" dx="0.6" dy="1.35" layer="1"/>
<smd name="2" x="-0.5" y="0" dx="0.6" dy="1.35" layer="1"/>
<smd name="3" x="0.5" y="0" dx="0.6" dy="1.35" layer="1"/>
<smd name="4" x="1.5" y="0" dx="0.6" dy="1.35" layer="1"/>
<text x="-1.73" y="1.73" size="0.4064" layer="25" rot="R180">&gt;NAME</text>
<text x="3.46" y="1.73" size="0.4064" layer="27" rot="R180">&gt;VALUE</text>
</package>
</packages>
</library>
</libraries>
<attributes>
</attributes>
<variantdefs>
</variantdefs>
<classes>
<class number="0" name="default" width="0" drill="0">
</class>
</classes>
<designrules name="advance *">
<description language="de">&lt;b&gt;EAGLE Design Rules&lt;/b&gt;
&lt;p&gt;
Die Standard-Design-Rules sind so gewählt, dass sie für 
die meisten Anwendungen passen. Sollte ihre Platine 
besondere Anforderungen haben, treffen Sie die erforderlichen
Einstellungen hier und speichern die Design Rules unter 
einem neuen Namen ab.</description>
<description language="en">&lt;b&gt;PCB Order Design Rules for Advanced Circuits&lt;/b&gt;
&lt;p&gt;
Please make sure your boards conform to these design rules.</description>
<param name="layerSetup" value="(1*2+15*16)"/>
<param name="mtCopper" value="0.0356mm 0.0356mm 0.0356mm 0.0356mm 0.0356mm 0.0356mm 0.0356mm 0.0356mm 0.0356mm 0.0356mm 0.0356mm 0.0356mm 0.0356mm 0.0356mm 0.0356mm 0.0356mm"/>
<param name="mtIsolate" value="1.5011mm 0.1499mm 0.2007mm 0.1499mm 0.2007mm 0.1499mm 0.2007mm 0.1499mm 0.2007mm 0.1499mm 0.2007mm 0.1499mm 0.2007mm 0.1499mm 0.2007mm"/>
<param name="mdWireWire" value="6mil"/>
<param name="mdWirePad" value="7mil"/>
<param name="mdWireVia" value="6mil"/>
<param name="mdPadPad" value="6mil"/>
<param name="mdPadVia" value="6mil"/>
<param name="mdViaVia" value="6mil"/>
<param name="mdSmdPad" value="6mil"/>
<param name="mdSmdVia" value="6mil"/>
<param name="mdSmdSmd" value="6mil"/>
<param name="mdViaViaSameLayer" value="8mil"/>
<param name="mnLayersViaInSmd" value="2"/>
<param name="mdCopperDimension" value="10mil"/>
<param name="mdDrill" value="6mil"/>
<param name="mdSmdStop" value="0mil"/>
<param name="msWidth" value="7mil"/>
<param name="msDrill" value="15mil"/>
<param name="msMicroVia" value="15mil"/>
<param name="msBlindViaRatio" value="0.5"/>
<param name="rvPadTop" value="0.25"/>
<param name="rvPadInner" value="0.25"/>
<param name="rvPadBottom" value="0.25"/>
<param name="rvViaOuter" value="0.25"/>
<param name="rvViaInner" value="0.25"/>
<param name="rvMicroViaOuter" value="0.25"/>
<param name="rvMicroViaInner" value="0.25"/>
<param name="rlMinPadTop" value="7mil"/>
<param name="rlMaxPadTop" value="20mil"/>
<param name="rlMinPadInner" value="7mil"/>
<param name="rlMaxPadInner" value="20mil"/>
<param name="rlMinPadBottom" value="7mil"/>
<param name="rlMaxPadBottom" value="20mil"/>
<param name="rlMinViaOuter" value="10mil"/>
<param name="rlMaxViaOuter" value="20mil"/>
<param name="rlMinViaInner" value="10mil"/>
<param name="rlMaxViaInner" value="20mil"/>
<param name="rlMinMicroViaOuter" value="4mil"/>
<param name="rlMaxMicroViaOuter" value="20mil"/>
<param name="rlMinMicroViaInner" value="4mil"/>
<param name="rlMaxMicroViaInner" value="20mil"/>
<param name="psTop" value="-1"/>
<param name="psBottom" value="-1"/>
<param name="psFirst" value="-1"/>
<param name="psElongationLong" value="100"/>
<param name="psElongationOffset" value="100"/>
<param name="mvStopFrame" value="1"/>
<param name="mvCreamFrame" value="0"/>
<param name="mlMinStopFrame" value="4mil"/>
<param name="mlMaxStopFrame" value="4mil"/>
<param name="mlMinCreamFrame" value="0mil"/>
<param name="mlMaxCreamFrame" value="0mil"/>
<param name="mlViaStopLimit" value="0mil"/>
<param name="srRoundness" value="0"/>
<param name="srMinRoundness" value="0mil"/>
<param name="srMaxRoundness" value="0mil"/>
<param name="slThermalIsolate" value="10mil"/>
<param name="slThermalsForVias" value="0"/>
<param name="dpMaxLengthDifference" value="10mm"/>
<param name="dpGapFactor" value="2.5"/>
<param name="checkGrid" value="0"/>
<param name="checkAngle" value="0"/>
<param name="checkFont" value="1"/>
<param name="checkRestrict" value="1"/>
<param name="useDiameter" value="13"/>
<param name="maxErrors" value="50"/>
</designrules>
<autorouter>
<pass name="Default">
<param name="RoutingGrid" value="50mil"/>
<param name="tpViaShape" value="round"/>
<param name="PrefDir.1" value="|"/>
<param name="PrefDir.2" value="0"/>
<param name="PrefDir.3" value="0"/>
<param name="PrefDir.4" value="0"/>
<param name="PrefDir.5" value="0"/>
<param name="PrefDir.6" value="0"/>
<param name="PrefDir.7" value="0"/>
<param name="PrefDir.8" value="0"/>
<param name="PrefDir.9" value="0"/>
<param name="PrefDir.10" value="0"/>
<param name="PrefDir.11" value="0"/>
<param name="PrefDir.12" value="0"/>
<param name="PrefDir.13" value="0"/>
<param name="PrefDir.14" value="0"/>
<param name="PrefDir.15" value="0"/>
<param name="PrefDir.16" value="-"/>
<param name="cfVia" value="8"/>
<param name="cfNonPref" value="5"/>
<param name="cfChangeDir" value="2"/>
<param name="cfOrthStep" value="2"/>
<param name="cfDiagStep" value="3"/>
<param name="cfExtdStep" value="0"/>
<param name="cfBonusStep" value="1"/>
<param name="cfMalusStep" value="1"/>
<param name="cfPadImpact" value="4"/>
<param name="cfSmdImpact" value="4"/>
<param name="cfBusImpact" value="0"/>
<param name="cfHugging" value="3"/>
<param name="cfAvoid" value="4"/>
<param name="cfPolygon" value="10"/>
<param name="cfBase.1" value="0"/>
<param name="cfBase.2" value="1"/>
<param name="cfBase.3" value="1"/>
<param name="cfBase.4" value="1"/>
<param name="cfBase.5" value="1"/>
<param name="cfBase.6" value="1"/>
<param name="cfBase.7" value="1"/>
<param name="cfBase.8" value="1"/>
<param name="cfBase.9" value="1"/>
<param name="cfBase.10" value="1"/>
<param name="cfBase.11" value="1"/>
<param name="cfBase.12" value="1"/>
<param name="cfBase.13" value="1"/>
<param name="cfBase.14" value="1"/>
<param name="cfBase.15" value="1"/>
<param name="cfBase.16" value="0"/>
<param name="mnVias" value="20"/>
<param name="mnSegments" value="9999"/>
<param name="mnExtdSteps" value="9999"/>
<param name="mnRipupLevel" value="10"/>
<param name="mnRipupSteps" value="100"/>
<param name="mnRipupTotal" value="100"/>
</pass>
<pass name="Follow-me" refer="Default" active="yes">
</pass>
<pass name="Busses" refer="Default" active="yes">
<param name="cfNonPref" value="4"/>
<param name="cfBusImpact" value="4"/>
<param name="cfHugging" value="0"/>
<param name="mnVias" value="0"/>
</pass>
<pass name="Route" refer="Default" active="yes">
</pass>
<pass name="Optimize1" refer="Default" active="yes">
<param name="cfVia" value="99"/>
<param name="cfExtdStep" value="10"/>
<param name="cfHugging" value="1"/>
<param name="mnExtdSteps" value="1"/>
<param name="mnRipupLevel" value="0"/>
</pass>
<pass name="Optimize2" refer="Optimize1" active="yes">
<param name="cfNonPref" value="0"/>
<param name="cfChangeDir" value="6"/>
<param name="cfExtdStep" value="0"/>
<param name="cfBonusStep" value="2"/>
<param name="cfMalusStep" value="2"/>
<param name="cfPadImpact" value="2"/>
<param name="cfSmdImpact" value="2"/>
<param name="cfHugging" value="0"/>
</pass>
<pass name="Optimize3" refer="Optimize2" active="yes">
<param name="cfChangeDir" value="8"/>
<param name="cfPadImpact" value="0"/>
<param name="cfSmdImpact" value="0"/>
</pass>
<pass name="Optimize4" refer="Optimize3" active="yes">
<param name="cfChangeDir" value="25"/>
</pass>
</autorouter>
<elements>
<element name="WII-CAM" library="ACL" package="WII_CAM" value="WII-CAM" x="6.604" y="5.461" rot="MR0"/>
<element name="R1" library="SparkFun-Resistors" package="0603-RES" value="10K" x="8.001" y="3.048" rot="MR270"/>
<element name="C1" library="SparkFun-Passives" package="0603-CAP" value="0.1uF" x="9.779" y="3.048" rot="MR90"/>
<element name="JP1" library="SparkFun-Connectors" package="1X04-1MM-RA" value="" x="8.509" y="5.08"/>
<element name="U$1" library="ACL" package="CRYSTAL-OSC-SMD-4X2" value="CRYSTAL" x="2.667" y="3.937" rot="R270"/>
</elements>
<signals>
<signal name="GND">
<contactref element="WII-CAM" pad="P$3"/>
<contactref element="WII-CAM" pad="P$2"/>
<contactref element="C1" pad="2"/>
<contactref element="JP1" pad="3"/>
<contactref element="U$1" pad="2"/>
<wire x1="7.8232" y1="9.271" x2="7.8232" y2="8.6868" width="0.6096" layer="1"/>
<wire x1="7.8232" y1="8.6868" x2="8.763" y2="7.747" width="0.6096" layer="1"/>
<wire x1="9.009" y1="5.08" x2="9.009" y2="7.501" width="0.6096" layer="1"/>
<wire x1="9.009" y1="7.501" x2="8.763" y2="7.747" width="0.6096" layer="1"/>
<wire x1="8.509" y1="3.683" x2="9.017" y2="4.191" width="0.6096" layer="1"/>
<wire x1="9.017" y1="4.191" x2="9.017" y2="5.072" width="0.6096" layer="1"/>
<wire x1="9.017" y1="5.072" x2="9.009" y2="5.08" width="0.4064" layer="1"/>
<wire x1="9.779" y1="3.898" x2="9.779" y2="5.58" width="0.6096" layer="16"/>
<wire x1="9.779" y1="5.58" x2="9.009" y2="6.35" width="0.6096" layer="16"/>
<wire x1="9.009" y1="6.35" x2="9.009" y2="7.501" width="0.6096" layer="16"/>
<wire x1="9.009" y1="7.501" x2="8.763" y2="7.747" width="0.6096" layer="16"/>
<wire x1="8.509" y1="3.683" x2="5.566209375" y2="3.683" width="0.6096" layer="1"/>
<wire x1="5.566209375" y1="3.683" x2="5.38660625" y2="3.60860625" width="0.4064" layer="1" curve="44.999502"/>
<wire x1="5.38660625" y1="3.60860625" x2="4.572" y2="2.794" width="0.4064" layer="1"/>
<wire x1="4.572" y1="2.794" x2="4.572" y2="2.264209375" width="0.4064" layer="1"/>
<wire x1="4.572" y1="2.264209375" x2="4.49760625" y2="2.08460625" width="0.4064" layer="1" curve="-44.999502"/>
<wire x1="4.49760625" y1="2.08460625" x2="4.064" y2="1.651" width="0.4064" layer="1"/>
<wire x1="4.064" y1="1.651" x2="2.137209375" y2="1.651" width="0.4064" layer="1"/>
<wire x1="2.137209375" y1="1.651" x2="1.95760625" y2="1.72539375" width="0.4064" layer="1" curve="-44.999502"/>
<wire x1="1.95760625" y1="1.72539375" x2="1.778" y2="1.905" width="0.4064" layer="1"/>
<wire x1="1.778" y1="1.905" x2="1.778" y2="2.8032" width="0.4064" layer="1"/>
<wire x1="1.778" y1="2.8032" x2="1.792" y2="2.837" width="0.4064" layer="1" curve="-45"/>
</signal>
<signal name="VCC">
<contactref element="C1" pad="1"/>
<contactref element="WII-CAM" pad="P$1"/>
<contactref element="JP1" pad="4"/>
<contactref element="R1" pad="2"/>
<contactref element="U$1" pad="4"/>
<wire x1="10.009" y1="5.08" x2="10.009" y2="6.072" width="0.6096" layer="1"/>
<wire x1="10.009" y1="6.072" x2="10.287" y2="6.35" width="0.6096" layer="1"/>
<wire x1="10.287" y1="6.35" x2="10.287" y2="8.6106" width="0.6096" layer="1"/>
<wire x1="10.287" y1="8.6106" x2="9.6266" y2="9.271" width="0.6096" layer="1"/>
<wire x1="10.033" y1="5.056" x2="10.009" y2="5.08" width="0.4064" layer="1"/>
<wire x1="9.779" y1="2.198" x2="8.001" y2="2.198" width="0.6096" layer="16"/>
<wire x1="9.779" y1="2.198" x2="10.961" y2="2.198" width="0.6096" layer="16"/>
<wire x1="10.961" y1="2.198" x2="11.684" y2="2.921" width="0.6096" layer="16"/>
<wire x1="11.684" y1="2.921" x2="11.684" y2="7.2136" width="0.6096" layer="16"/>
<wire x1="11.684" y1="7.2136" x2="9.6266" y2="9.271" width="0.6096" layer="16"/>
<wire x1="3.542" y1="5.037" x2="4.382790625" y2="5.037" width="0.6096" layer="1"/>
<wire x1="4.382790625" y1="5.037" x2="4.56239375" y2="4.96260625" width="0.4064" layer="1" curve="-44.999502"/>
<wire x1="4.56239375" y1="4.96260625" x2="4.826" y2="4.699" width="0.6096" layer="1"/>
<via x="4.826" y="4.699" extent="1-16" drill="0.508"/>
<wire x1="4.826" y1="4.699" x2="4.826" y2="2.899209375" width="0.6096" layer="16"/>
<wire x1="4.826" y1="2.899209375" x2="4.90039375" y2="2.71960625" width="0.4064" layer="16" curve="44.999502"/>
<wire x1="4.90039375" y1="2.71960625" x2="5.461" y2="2.159" width="0.6096" layer="16"/>
<wire x1="5.461" y1="2.159" x2="7.934790625" y2="2.159" width="0.6096" layer="16"/>
<wire x1="7.934790625" y1="2.159" x2="8.11439375" y2="2.33860625" width="0.4064" layer="16" curve="-44.999502"/>
<wire x1="8.11439375" y1="2.33860625" x2="8.001" y2="2.198" width="0.4064" layer="16"/>
</signal>
<signal name="SCL">
<contactref element="JP1" pad="2"/>
<contactref element="WII-CAM" pad="P$5"/>
<wire x1="5.9944" y1="9.271" x2="6.114496875" y2="6.604834375" width="0.2286" layer="1"/>
<wire x1="6.114496875" y1="6.604834375" x2="6.1214" y2="6.4516" width="0.2286" layer="1"/>
<wire x1="6.4516" y1="6.4516" x2="6.477" y2="6.477" width="0.2032" layer="1"/>
<wire x1="6.477" y1="6.477" x2="7.747" y2="6.477" width="0.4064" layer="1"/>
<wire x1="7.747" y1="6.477" x2="8.001" y2="6.223" width="0.4064" layer="1"/>
<wire x1="8.001" y1="6.223" x2="8.001" y2="5.088" width="0.4064" layer="1"/>
<wire x1="8.001" y1="5.088" x2="8.009" y2="5.08" width="0.4064" layer="1"/>
<wire x1="6.4516" y1="6.4516" x2="6.26773125" y2="6.4516" width="0.4064" layer="1"/>
<wire x1="6.26773125" y1="6.4516" x2="6.114496875" y2="6.604834375" width="0.4064" layer="1"/>
</signal>
<signal name="SDA">
<contactref element="JP1" pad="1"/>
<contactref element="WII-CAM" pad="P$6"/>
<wire x1="7.009" y1="5.08" x2="6.604" y2="5.08" width="0.4064" layer="1"/>
<wire x1="6.604" y1="5.08" x2="5.207" y2="6.477" width="0.4064" layer="1"/>
<wire x1="5.207" y1="6.477" x2="5.207" y2="7.6708" width="0.4064" layer="1"/>
<wire x1="5.207" y1="7.6708" x2="5.1308" y2="7.747" width="0.4064" layer="1"/>
</signal>
<signal name="CLK">
<contactref element="WII-CAM" pad="P$7"/>
<contactref element="U$1" pad="3"/>
<wire x1="4.191" y1="9.271" x2="2.794" y2="9.271" width="0.6096" layer="1"/>
<wire x1="2.794" y1="9.271" x2="1.778" y2="8.255" width="0.6096" layer="1"/>
<wire x1="1.778" y1="7.366" x2="1.778" y2="8.255" width="0.6096" layer="1"/>
<wire x1="1.778" y1="7.366" x2="1.778" y2="7.344209375" width="0.4064" layer="1"/>
<wire x1="1.778" y1="7.344209375" x2="1.70360625" y2="7.16460625" width="0.4064" layer="1" curve="-44.999502"/>
<wire x1="1.70360625" y1="7.16460625" x2="0.762" y2="6.223" width="0.4064" layer="1"/>
<wire x1="3.542" y1="2.837" x2="3.542" y2="3.083790625" width="0.4064" layer="1"/>
<wire x1="3.542" y1="3.083790625" x2="3.46760625" y2="3.26339375" width="0.4064" layer="1" curve="44.999502"/>
<wire x1="3.46760625" y1="3.26339375" x2="2.794" y2="3.937" width="0.4064" layer="1"/>
<wire x1="2.794" y1="3.937" x2="1.121209375" y2="3.937" width="0.4064" layer="1"/>
<wire x1="1.121209375" y1="3.937" x2="0.94160625" y2="4.01139375" width="0.4064" layer="1" curve="-44.999502"/>
<wire x1="0.94160625" y1="4.01139375" x2="0.762" y2="4.191" width="0.4064" layer="1"/>
<wire x1="0.762" y1="4.191" x2="0.762" y2="6.223" width="0.4064" layer="1"/>
</signal>
<signal name="N$6">
<contactref element="WII-CAM" pad="P$8"/>
<contactref element="R1" pad="1"/>
<wire x1="3.429" y1="6.35" x2="3.429" y2="7.6454" width="0.6096" layer="16"/>
<wire x1="3.429" y1="7.6454" x2="3.3274" y2="7.747" width="0.6096" layer="16"/>
<wire x1="8.001" y1="3.898" x2="8.001" y2="3.831790625" width="0.6096" layer="16"/>
<wire x1="8.001" y1="3.831790625" x2="7.92660625" y2="4.13839375" width="0.4064" layer="16" curve="44.999502"/>
<wire x1="7.92660625" y1="4.13839375" x2="6.096" y2="5.969" width="0.6096" layer="16"/>
<wire x1="6.096" y1="5.969" x2="3.915209375" y2="5.969" width="0.6096" layer="16"/>
<wire x1="3.915209375" y1="5.969" x2="3.73560625" y2="6.04339375" width="0.4064" layer="16" curve="-44.999502"/>
<wire x1="3.73560625" y1="6.04339375" x2="3.429" y2="6.35" width="0.6096" layer="16"/>
</signal>
</signals>
</board>
</drawing>
</eagle>
