G75*
G70*
%OFA0B0*%
%FSLAX24Y24*%
%IPPOS*%
%LPD*%
%AMOC8*
5,1,8,0,0,1.08239X$1,22.5*
%
%ADD10C,0.0090*%
%ADD11C,0.0080*%
%ADD12C,0.0100*%
%ADD13R,0.0300X0.0180*%
%ADD14C,0.0220*%
D10*
X002578Y000952D02*
X002578Y001226D01*
X002578Y001089D02*
X002988Y001089D01*
X002851Y000952D01*
X002920Y001413D02*
X002646Y001413D01*
X002920Y001686D01*
X002646Y001686D01*
X002578Y001618D01*
X002578Y001481D01*
X002646Y001413D01*
X002920Y001413D02*
X002988Y001481D01*
X002988Y001618D01*
X002920Y001686D01*
X002988Y001873D02*
X002578Y001873D01*
X002714Y001873D02*
X002988Y002147D01*
X002783Y001941D02*
X002578Y002147D01*
X004778Y001923D02*
X005188Y001923D01*
X005188Y002197D01*
X004983Y002060D02*
X004983Y001923D01*
X005051Y001736D02*
X004778Y001736D01*
X004778Y001531D01*
X004846Y001463D01*
X005051Y001463D01*
X004778Y001276D02*
X004778Y001002D01*
X004778Y001139D02*
X005188Y001139D01*
X005051Y001002D01*
X004846Y000840D02*
X004778Y000840D01*
X004778Y000772D01*
X004846Y000772D01*
X004846Y000840D01*
X004846Y000585D02*
X004778Y000517D01*
X004778Y000380D01*
X004846Y000312D01*
X005120Y000585D01*
X004846Y000585D01*
X004846Y000312D02*
X005120Y000312D01*
X005188Y000380D01*
X005188Y000517D01*
X005120Y000585D01*
D11*
X000599Y000378D02*
X000366Y000378D01*
X000483Y000378D02*
X000483Y000729D01*
X000599Y000612D01*
X000739Y000437D02*
X000739Y000378D01*
X000797Y000378D01*
X000797Y000437D01*
X000739Y000437D01*
X000960Y000378D02*
X001193Y000378D01*
X001076Y000378D02*
X001076Y000729D01*
X001193Y000612D01*
X001356Y000612D02*
X001472Y000378D01*
X001589Y000612D01*
X002147Y000729D02*
X002147Y000378D01*
X002381Y000378D02*
X002381Y000729D01*
X002264Y000612D01*
X002147Y000729D01*
X002543Y000612D02*
X002543Y000378D01*
X002543Y000554D02*
X002777Y000554D01*
X002777Y000612D02*
X002660Y000729D01*
X002543Y000612D01*
X002777Y000612D02*
X002777Y000378D01*
X002939Y000437D02*
X002998Y000378D01*
X003114Y000378D01*
X003173Y000437D01*
X003173Y000670D01*
X003114Y000729D01*
X002998Y000729D01*
X002939Y000670D01*
X003335Y000554D02*
X003569Y000554D01*
X003716Y000729D02*
X003833Y000729D01*
X003774Y000729D02*
X003774Y000378D01*
X003716Y000378D02*
X003833Y000378D01*
X003980Y000378D02*
X004097Y000378D01*
X004038Y000378D02*
X004038Y000729D01*
X003980Y000729D02*
X004097Y000729D01*
X004259Y000729D02*
X004259Y000378D01*
X004376Y000495D01*
X004493Y000378D01*
X004493Y000729D01*
D12*
X005333Y002338D02*
X005333Y005338D01*
X000333Y005338D01*
X000333Y002338D01*
X005333Y002338D01*
D13*
X003383Y001388D03*
D14*
X004071Y001388D02*
X004095Y001388D01*
M02*
