G75*
G70*
%OFA0B0*%
%FSLAX24Y24*%
%IPPOS*%
%LPD*%
%AMOC8*
5,1,8,0,0,1.08239X$1,22.5*
%
%ADD10C,0.0472*%
%ADD11R,0.0472X0.0787*%
%ADD12R,0.0236X0.0531*%
%ADD13R,0.0374X0.0472*%
%ADD14C,0.0240*%
%ADD15C,0.0160*%
%ADD16C,0.0090*%
%ADD17C,0.0080*%
D10*
X001460Y003238D03*
X001800Y003838D03*
X002170Y003238D03*
X002510Y003838D03*
X002890Y003238D03*
X003230Y003838D03*
X003600Y003238D03*
X003940Y003838D03*
D11*
X004602Y000742D03*
X002398Y000742D03*
D12*
X002909Y002188D03*
X003303Y002188D03*
X003697Y002188D03*
X004091Y002188D03*
D13*
X000856Y001305D03*
X001544Y001305D03*
X001544Y002172D03*
X000856Y002172D03*
D14*
X001544Y002172D02*
X001544Y002394D01*
X000850Y003088D01*
X000850Y003438D01*
X001250Y003838D01*
X001800Y003838D01*
X003230Y003838D02*
X003230Y003608D01*
X003600Y003238D01*
X003697Y003142D01*
X003697Y002188D01*
X004091Y002188D02*
X004091Y002579D01*
X004200Y002688D01*
X004200Y003578D01*
X003940Y003838D01*
X004100Y002179D02*
X004100Y001738D01*
X003800Y001438D01*
X001678Y001438D01*
X001544Y001305D01*
D15*
X001289Y001738D02*
X000856Y002172D01*
X001289Y001738D02*
X003600Y001738D01*
X003700Y001838D01*
X003700Y002185D01*
X003697Y002188D01*
X004091Y002188D02*
X004100Y002179D01*
X003303Y002188D02*
X003300Y002192D01*
X003300Y002638D01*
X003200Y002738D01*
X002700Y002738D01*
X002690Y002728D02*
X002618Y002728D01*
X002557Y002789D01*
X002200Y002738D02*
X002200Y003208D01*
X002170Y003238D01*
X002200Y002738D02*
X002750Y002188D01*
X002909Y002188D01*
D16*
X002560Y002728D02*
X002557Y002789D01*
X002510Y003838D01*
D17*
X002700Y002738D02*
X002690Y002728D01*
M02*
