G75*
G70*
%OFA0B0*%
%FSLAX24Y24*%
%IPPOS*%
%LPD*%
%AMOC8*
5,1,8,0,0,1.08239X$1,22.5*
%
%ADD10C,0.0080*%
%ADD11C,0.0100*%
%ADD12C,0.0110*%
%ADD13C,0.0070*%
%ADD14C,0.0040*%
%ADD15C,0.0050*%
%ADD16C,0.0160*%
%ADD17R,0.0300X0.0180*%
%ADD18C,0.0220*%
%ADD19C,0.0157*%
%ADD20C,0.0060*%
%ADD21R,0.0180X0.0300*%
D10*
X002101Y000527D02*
X002101Y015527D01*
X022101Y015527D01*
X022101Y000527D01*
X002101Y000527D01*
X002631Y002867D02*
X002631Y003078D01*
X002771Y003218D01*
X002771Y003288D01*
X002631Y003078D02*
X002491Y003218D01*
X002491Y003288D01*
X002896Y004205D02*
X003112Y004205D01*
X002896Y004205D02*
X002896Y005189D01*
X003112Y005189D01*
X003991Y003788D02*
X004271Y003367D01*
X003991Y003367D02*
X004271Y003788D01*
X009401Y003027D02*
X009401Y000627D01*
X010501Y000627D01*
X010501Y003027D01*
X009401Y003027D01*
X009696Y003335D02*
X009818Y003427D01*
X009818Y003608D01*
X009696Y003513D02*
X009811Y003437D01*
X009818Y003427D02*
X009818Y003246D01*
X010601Y003027D02*
X011701Y003027D01*
X011701Y000627D01*
X010601Y000627D01*
X010601Y003027D01*
X010711Y004205D02*
X010967Y004205D01*
X010967Y005189D01*
X010711Y005189D01*
X010826Y005843D02*
X011141Y005843D01*
X010275Y005843D02*
X009960Y005843D01*
X010512Y007221D02*
X010514Y007233D01*
X010519Y007244D01*
X010528Y007253D01*
X010539Y007258D01*
X010551Y007260D01*
X010563Y007258D01*
X010574Y007253D01*
X010583Y007244D01*
X010588Y007233D01*
X010590Y007221D01*
X010588Y007209D01*
X010583Y007198D01*
X010574Y007189D01*
X010563Y007184D01*
X010551Y007182D01*
X010539Y007184D01*
X010528Y007189D01*
X010519Y007198D01*
X010514Y007209D01*
X010512Y007221D01*
X010275Y007812D02*
X009960Y007812D01*
X010826Y007812D02*
X011141Y007812D01*
X010650Y008890D02*
X010788Y009028D01*
X009351Y008890D02*
X009213Y008890D01*
X009213Y009028D01*
X009213Y010327D02*
X009213Y010465D01*
X009351Y010465D01*
X010650Y010465D02*
X010788Y010465D01*
X010788Y010327D01*
X010711Y012866D02*
X010967Y012866D01*
X010967Y013850D01*
X010711Y013850D01*
X011101Y013777D02*
X011101Y014277D01*
X011351Y014527D01*
X011851Y014527D01*
X012101Y014277D01*
X012351Y014527D01*
X012851Y014527D01*
X013101Y014277D01*
X013351Y014527D01*
X013851Y014527D01*
X014101Y014277D01*
X014351Y014527D01*
X014851Y014527D01*
X015101Y014277D01*
X015351Y014527D01*
X015851Y014527D01*
X016101Y014277D01*
X016351Y014527D01*
X016851Y014527D01*
X017101Y014277D01*
X017351Y014527D01*
X017851Y014527D01*
X018101Y014277D01*
X018101Y013777D01*
X017851Y013527D01*
X017351Y013527D01*
X017101Y013777D01*
X016851Y013527D01*
X016351Y013527D01*
X016101Y013777D01*
X015851Y013527D01*
X015351Y013527D01*
X015101Y013777D01*
X014851Y013527D01*
X014351Y013527D01*
X014101Y013777D01*
X013851Y013527D01*
X013351Y013527D01*
X013101Y013777D01*
X012851Y013527D01*
X012351Y013527D01*
X012101Y013777D01*
X011851Y013527D01*
X011351Y013527D01*
X011101Y013777D01*
X011351Y014527D02*
X011101Y014777D01*
X011101Y015277D01*
X011351Y015527D01*
X011851Y015527D01*
X012101Y015277D01*
X012351Y015527D01*
X012851Y015527D01*
X013101Y015277D01*
X013351Y015527D01*
X013851Y015527D01*
X014101Y015277D01*
X014351Y015527D01*
X014851Y015527D01*
X015101Y015277D01*
X015351Y015527D01*
X015851Y015527D01*
X016101Y015277D01*
X016351Y015527D01*
X016851Y015527D01*
X017101Y015277D01*
X017351Y015527D01*
X017851Y015527D01*
X018101Y015277D01*
X018101Y014777D01*
X017851Y014527D01*
X017351Y014527D01*
X017101Y014777D01*
X016851Y014527D01*
X016351Y014527D01*
X016101Y014777D01*
X015851Y014527D01*
X015351Y014527D01*
X015101Y014777D01*
X014851Y014527D01*
X014351Y014527D01*
X014101Y014777D01*
X013851Y014527D01*
X013351Y014527D01*
X013101Y014777D01*
X012851Y014527D01*
X012351Y014527D01*
X012101Y014777D01*
X011851Y014527D01*
X011351Y014527D01*
X014824Y012864D02*
X014824Y012627D01*
X015572Y012116D02*
X016044Y012116D01*
X016792Y012627D02*
X016792Y012864D01*
X016044Y013375D02*
X015572Y013375D01*
X018920Y014144D02*
X019101Y014144D01*
X019193Y014022D01*
X019282Y014144D02*
X019101Y014144D01*
X019091Y014138D02*
X019015Y014022D01*
X019420Y014394D02*
X019601Y014394D01*
X019693Y014272D01*
X019782Y014394D02*
X019601Y014394D01*
X019591Y014388D02*
X019515Y014272D01*
X019881Y013097D02*
X019881Y012860D01*
X019881Y013097D02*
X020118Y013097D01*
X020984Y013097D02*
X021220Y013097D01*
X021220Y012860D01*
X021220Y011994D02*
X021220Y011758D01*
X020984Y011758D01*
X020055Y011784D02*
X019907Y011923D01*
X007310Y015368D02*
X007076Y015368D01*
X007193Y015368D02*
X007193Y015017D01*
X006914Y015076D02*
X006914Y015309D01*
X006855Y015368D01*
X006739Y015368D01*
X006680Y015309D01*
X006680Y015076D01*
X006739Y015017D01*
X006855Y015017D01*
X006914Y015076D01*
X006518Y015017D02*
X006284Y015017D01*
X006284Y015368D01*
X006137Y015368D02*
X006020Y015368D01*
X006079Y015368D02*
X006079Y015017D01*
X006137Y015017D02*
X006020Y015017D01*
X006089Y014868D02*
X006030Y014809D01*
X006030Y014576D01*
X006264Y014809D01*
X006264Y014576D01*
X006206Y014517D01*
X006089Y014517D01*
X006030Y014576D01*
X005891Y014576D02*
X005891Y014517D01*
X005833Y014517D01*
X005833Y014576D01*
X005891Y014576D01*
X005670Y014517D02*
X005437Y014517D01*
X005670Y014751D01*
X005670Y014809D01*
X005612Y014868D01*
X005495Y014868D01*
X005437Y014809D01*
X005274Y014751D02*
X005157Y014517D01*
X005041Y014751D01*
X005066Y015017D02*
X004833Y015017D01*
X004833Y015368D01*
X005066Y015368D01*
X005228Y015368D02*
X005404Y015368D01*
X005462Y015309D01*
X005462Y015193D01*
X005404Y015134D01*
X005228Y015134D01*
X005228Y015017D02*
X005228Y015368D01*
X005345Y015134D02*
X005462Y015017D01*
X005624Y015017D02*
X005624Y015368D01*
X005800Y015368D01*
X005858Y015309D01*
X005858Y015193D01*
X005800Y015134D01*
X005624Y015134D01*
X006089Y014868D02*
X006206Y014868D01*
X006264Y014809D01*
X004949Y015193D02*
X004833Y015193D01*
X004670Y015251D02*
X004612Y015193D01*
X004437Y015193D01*
X004437Y015368D02*
X004437Y015017D01*
X004612Y015017D01*
X004670Y015076D01*
X004670Y015134D01*
X004612Y015193D01*
X004670Y015251D02*
X004670Y015309D01*
X004612Y015368D01*
X004437Y015368D01*
X004274Y015368D02*
X004274Y015076D01*
X004216Y015017D01*
X004099Y015017D01*
X004041Y015076D01*
X004041Y015368D01*
X003112Y013850D02*
X002896Y013850D01*
X002896Y012866D01*
X003112Y012866D01*
X006804Y010367D02*
X006806Y010382D01*
X006812Y010395D01*
X006821Y010407D01*
X006832Y010416D01*
X006846Y010422D01*
X006861Y010424D01*
X006876Y010422D01*
X006889Y010416D01*
X006901Y010407D01*
X006910Y010396D01*
X006916Y010382D01*
X006918Y010367D01*
X006916Y010352D01*
X006910Y010339D01*
X006901Y010327D01*
X006890Y010318D01*
X006876Y010312D01*
X006861Y010310D01*
X006846Y010312D01*
X006833Y010318D01*
X006821Y010327D01*
X006812Y010338D01*
X006806Y010352D01*
X006804Y010367D01*
X012910Y001739D02*
X013501Y001739D01*
X014820Y001345D02*
X014820Y001109D01*
X014564Y000716D02*
X012438Y000716D01*
X012182Y001109D02*
X012182Y001345D01*
X018770Y001460D02*
X018951Y001460D01*
X018859Y001582D01*
X018951Y001460D02*
X019132Y001460D01*
X019220Y001460D02*
X019401Y001460D01*
X019309Y001582D01*
X019401Y001460D02*
X019582Y001460D01*
X019487Y001582D02*
X019411Y001466D01*
X019037Y001582D02*
X018961Y001466D01*
D11*
X020341Y003189D02*
X013057Y003189D01*
X012762Y003484D01*
X012762Y010768D01*
X012860Y010866D01*
X020341Y010866D01*
X020439Y010768D01*
X020439Y003287D01*
X020341Y003189D01*
X013058Y003582D02*
X013060Y003601D01*
X013065Y003620D01*
X013075Y003636D01*
X013087Y003651D01*
X013102Y003663D01*
X013118Y003673D01*
X013137Y003678D01*
X013156Y003680D01*
X013175Y003678D01*
X013194Y003673D01*
X013210Y003663D01*
X013225Y003651D01*
X013237Y003636D01*
X013247Y003620D01*
X013252Y003601D01*
X013254Y003582D01*
X013252Y003563D01*
X013247Y003544D01*
X013237Y003528D01*
X013225Y003513D01*
X013210Y003501D01*
X013194Y003491D01*
X013175Y003486D01*
X013156Y003484D01*
X013137Y003486D01*
X013118Y003491D01*
X013102Y003501D01*
X013087Y003513D01*
X013075Y003528D01*
X013065Y003544D01*
X013060Y003563D01*
X013058Y003582D01*
X007440Y003023D02*
X007442Y003035D01*
X007447Y003046D01*
X007456Y003055D01*
X007467Y003060D01*
X007479Y003062D01*
X007491Y003060D01*
X007502Y003055D01*
X007511Y003046D01*
X007516Y003035D01*
X007518Y003023D01*
X007516Y003011D01*
X007511Y003000D01*
X007502Y002991D01*
X007491Y002986D01*
X007479Y002984D01*
X007467Y002986D01*
X007456Y002991D01*
X007447Y003000D01*
X007442Y003011D01*
X007440Y003023D01*
X007440Y002508D02*
X007442Y002520D01*
X007447Y002531D01*
X007456Y002540D01*
X007467Y002545D01*
X007479Y002547D01*
X007491Y002545D01*
X007502Y002540D01*
X007511Y002531D01*
X007516Y002520D01*
X007518Y002508D01*
X007516Y002496D01*
X007511Y002485D01*
X007502Y002476D01*
X007491Y002471D01*
X007479Y002469D01*
X007467Y002471D01*
X007456Y002476D01*
X007447Y002485D01*
X007442Y002496D01*
X007440Y002508D01*
X007440Y001531D02*
X007442Y001543D01*
X007447Y001554D01*
X007456Y001563D01*
X007467Y001568D01*
X007479Y001570D01*
X007491Y001568D01*
X007502Y001563D01*
X007511Y001554D01*
X007516Y001543D01*
X007518Y001531D01*
X007516Y001519D01*
X007511Y001508D01*
X007502Y001499D01*
X007491Y001494D01*
X007479Y001492D01*
X007467Y001494D01*
X007456Y001499D01*
X007447Y001508D01*
X007442Y001519D01*
X007440Y001531D01*
X007440Y001016D02*
X007442Y001028D01*
X007447Y001039D01*
X007456Y001048D01*
X007467Y001053D01*
X007479Y001055D01*
X007491Y001053D01*
X007502Y001048D01*
X007511Y001039D01*
X007516Y001028D01*
X007518Y001016D01*
X007516Y001004D01*
X007511Y000993D01*
X007502Y000984D01*
X007491Y000979D01*
X007479Y000977D01*
X007467Y000979D01*
X007456Y000984D01*
X007447Y000993D01*
X007442Y001004D01*
X007440Y001016D01*
X003601Y002727D02*
X003601Y003477D01*
X003801Y003277D01*
X003601Y003477D02*
X003401Y003277D01*
X003101Y002977D02*
X002801Y002727D01*
X003101Y002527D01*
X002801Y002727D02*
X003601Y002727D01*
X003363Y005846D02*
X004013Y005846D01*
X004013Y006142D01*
X002340Y006437D02*
X002340Y007618D01*
X003363Y008208D02*
X004013Y008208D01*
X004013Y007913D01*
X004013Y009346D02*
X003363Y009346D01*
X004013Y009346D02*
X004013Y009642D01*
X002340Y009937D02*
X002340Y011118D01*
X003363Y011708D02*
X004013Y011708D01*
X004013Y011413D01*
D12*
X015422Y001374D02*
X015520Y001473D01*
X015717Y001473D01*
X015816Y001374D01*
X015816Y000981D01*
X015717Y000882D01*
X015520Y000882D01*
X015422Y000981D01*
X015422Y001374D01*
X016067Y001473D02*
X016067Y000882D01*
X016067Y001178D02*
X016263Y001178D01*
X016067Y001473D02*
X016460Y001473D01*
X016711Y001473D02*
X017105Y001473D01*
X016908Y001178D02*
X016711Y001178D01*
X016711Y001473D02*
X016711Y000882D01*
D13*
X011716Y005912D02*
X011495Y005912D01*
X011385Y006022D01*
X011495Y006133D01*
X011716Y006133D01*
X011661Y006281D02*
X011716Y006336D01*
X011716Y006446D01*
X011661Y006501D01*
X011661Y006649D02*
X011716Y006704D01*
X011716Y006814D01*
X011661Y006869D01*
X011440Y006869D02*
X011385Y006814D01*
X011385Y006704D01*
X011440Y006649D01*
X011661Y006649D01*
X011440Y006501D02*
X011385Y006446D01*
X011385Y006336D01*
X011440Y006281D01*
X011661Y006281D01*
X011550Y006133D02*
X011550Y005912D01*
X007788Y008062D02*
X007788Y008393D01*
X007677Y008283D01*
X007567Y008393D01*
X007567Y008062D01*
X007419Y008117D02*
X007419Y008338D01*
X007364Y008393D01*
X007254Y008393D01*
X007199Y008338D01*
X007199Y008117D01*
X007254Y008062D01*
X007364Y008062D01*
X007419Y008117D01*
X007051Y008062D02*
X006941Y008172D01*
X006996Y008172D02*
X006831Y008172D01*
X006831Y008062D02*
X006831Y008393D01*
X006996Y008393D01*
X007051Y008338D01*
X007051Y008228D01*
X006996Y008172D01*
X006683Y008228D02*
X006628Y008172D01*
X006462Y008172D01*
X006462Y008062D02*
X006462Y008393D01*
X006628Y008393D01*
X006683Y008338D01*
X006683Y008228D01*
X006314Y008393D02*
X006094Y008393D01*
X006094Y008062D01*
X006314Y008062D01*
X006204Y008228D02*
X006094Y008228D01*
X005946Y008393D02*
X005726Y008393D01*
X005726Y008062D01*
X005946Y008062D01*
X005836Y008228D02*
X005726Y008228D01*
X006112Y006043D02*
X006278Y006043D01*
X006333Y005988D01*
X006333Y005878D01*
X006278Y005822D01*
X006112Y005822D01*
X006112Y005712D02*
X006112Y006043D01*
X006481Y006043D02*
X006646Y006043D01*
X006701Y005988D01*
X006701Y005878D01*
X006646Y005822D01*
X006481Y005822D01*
X006481Y005712D02*
X006481Y006043D01*
X006591Y005822D02*
X006701Y005712D01*
X006849Y005712D02*
X007069Y005712D01*
X007217Y005767D02*
X007272Y005712D01*
X007382Y005712D01*
X007438Y005767D01*
X007438Y005822D01*
X007382Y005878D01*
X007272Y005878D01*
X007217Y005933D01*
X007217Y005988D01*
X007272Y006043D01*
X007382Y006043D01*
X007438Y005988D01*
X007069Y006043D02*
X006849Y006043D01*
X006849Y005712D01*
X006849Y005878D02*
X006959Y005878D01*
X008740Y010962D02*
X008961Y010962D01*
X009016Y011017D01*
X009016Y011128D01*
X008961Y011183D01*
X008850Y011183D01*
X008850Y011072D01*
X008740Y010962D02*
X008685Y011017D01*
X008685Y011128D01*
X008740Y011183D01*
X008740Y011331D02*
X008850Y011441D01*
X009016Y011441D01*
X008850Y011441D02*
X008740Y011551D01*
X008685Y011551D01*
X008685Y011699D02*
X008685Y011864D01*
X008740Y011919D01*
X008850Y011919D01*
X008906Y011864D01*
X008906Y011699D01*
X009016Y011699D02*
X008685Y011699D01*
X008906Y011809D02*
X009016Y011919D01*
X008961Y012067D02*
X009016Y012122D01*
X009016Y012232D01*
X008961Y012287D01*
X008740Y012287D01*
X008685Y012232D01*
X008685Y012122D01*
X008740Y012067D01*
X008961Y012067D01*
X008740Y011331D02*
X008685Y011331D01*
X018185Y012157D02*
X018295Y012268D01*
X018185Y012378D01*
X018516Y012378D01*
X018516Y012526D02*
X018295Y012526D01*
X018185Y012636D01*
X018295Y012746D01*
X018516Y012746D01*
X018461Y012894D02*
X018240Y012894D01*
X018185Y012949D01*
X018185Y013059D01*
X018240Y013114D01*
X018350Y013114D02*
X018350Y013004D01*
X018350Y013114D02*
X018461Y013114D01*
X018516Y013059D01*
X018516Y012949D01*
X018461Y012894D01*
X018350Y012746D02*
X018350Y012526D01*
X018516Y012157D02*
X018185Y012157D01*
D14*
X018081Y012177D02*
X018081Y012317D01*
X018081Y012247D02*
X017870Y012247D01*
X017941Y012177D01*
X017731Y012177D02*
X017731Y012317D01*
X017731Y012247D02*
X017520Y012247D01*
X017591Y012177D01*
X017626Y012407D02*
X017520Y012407D01*
X017520Y012547D01*
X017591Y012512D02*
X017626Y012547D01*
X017696Y012547D01*
X017731Y012512D01*
X017731Y012442D01*
X017696Y012407D01*
X017626Y012407D02*
X017591Y012477D01*
X017591Y012512D01*
X017591Y012637D02*
X017591Y012742D01*
X017626Y012777D01*
X017696Y012777D01*
X017731Y012742D01*
X017731Y012637D01*
X017801Y012637D02*
X017591Y012637D01*
X017626Y012867D02*
X017626Y012937D01*
X017731Y012867D02*
X017520Y012867D01*
X017520Y013007D01*
X017870Y013007D02*
X017870Y012867D01*
X018081Y012867D01*
X018046Y012777D02*
X017976Y012777D01*
X017941Y012742D01*
X017941Y012637D01*
X018151Y012637D01*
X018081Y012637D02*
X018081Y012742D01*
X018046Y012777D01*
X017976Y012867D02*
X017976Y012937D01*
X017976Y012547D02*
X018046Y012547D01*
X018081Y012512D01*
X018081Y012442D01*
X018046Y012407D01*
X017976Y012407D02*
X017941Y012477D01*
X017941Y012512D01*
X017976Y012547D01*
X017870Y012547D02*
X017870Y012407D01*
X017976Y012407D01*
X019020Y012402D02*
X019055Y012437D01*
X019196Y012297D01*
X019231Y012332D01*
X019231Y012402D01*
X019196Y012437D01*
X019055Y012437D01*
X019020Y012402D02*
X019020Y012332D01*
X019055Y012297D01*
X019196Y012297D01*
X019196Y012528D02*
X019196Y012563D01*
X019231Y012563D01*
X019231Y012528D01*
X019196Y012528D01*
X019231Y012643D02*
X019231Y012783D01*
X019231Y012713D02*
X019020Y012713D01*
X019091Y012643D01*
X019091Y012873D02*
X019196Y012873D01*
X019231Y012908D01*
X019231Y013013D01*
X019091Y013013D01*
X019126Y013103D02*
X019126Y013173D01*
X019231Y013103D02*
X019020Y013103D01*
X019020Y013243D01*
X018776Y013507D02*
X018670Y013612D01*
X018881Y013612D01*
X018776Y013647D02*
X018776Y013507D01*
X018741Y013737D02*
X018776Y013772D01*
X018776Y013877D01*
X018846Y013877D02*
X018705Y013877D01*
X018670Y013842D01*
X018670Y013772D01*
X018705Y013737D01*
X018741Y013737D01*
X018846Y013737D02*
X018881Y013772D01*
X018881Y013842D01*
X018846Y013877D01*
X018846Y013967D02*
X018881Y014002D01*
X018881Y014072D01*
X018846Y014107D01*
X018705Y014107D01*
X018670Y014072D01*
X018670Y014002D01*
X018705Y013967D01*
X018741Y013967D01*
X018776Y014002D01*
X018776Y014107D01*
X019021Y014597D02*
X019021Y014808D01*
X019126Y014808D01*
X019161Y014773D01*
X019161Y014702D01*
X019126Y014667D01*
X019021Y014667D01*
X019091Y014667D02*
X019161Y014597D01*
X019271Y014632D02*
X019306Y014597D01*
X019376Y014597D01*
X019411Y014632D01*
X019411Y014702D01*
X019341Y014702D01*
X019271Y014632D02*
X019271Y014773D01*
X019306Y014808D01*
X019376Y014808D01*
X019411Y014773D01*
X019926Y015147D02*
X019926Y015358D01*
X019821Y015252D01*
X019961Y015252D01*
X020051Y015287D02*
X020086Y015252D01*
X020191Y015252D01*
X020191Y015182D02*
X020191Y015323D01*
X020156Y015358D01*
X020086Y015358D01*
X020051Y015323D01*
X020051Y015287D01*
X020051Y015182D02*
X020086Y015147D01*
X020156Y015147D01*
X020191Y015182D01*
X020281Y015182D02*
X020316Y015147D01*
X020386Y015147D01*
X020421Y015182D01*
X020421Y015323D01*
X020386Y015358D01*
X020316Y015358D01*
X020281Y015323D01*
X020281Y015287D01*
X020316Y015252D01*
X020421Y015252D01*
X021770Y011923D02*
X021770Y011783D01*
X021981Y011783D01*
X021981Y011693D02*
X021841Y011693D01*
X021876Y011783D02*
X021876Y011853D01*
X021981Y011693D02*
X021981Y011588D01*
X021946Y011553D01*
X021841Y011553D01*
X021841Y011463D02*
X021805Y011463D01*
X021770Y011428D01*
X021770Y011358D01*
X021805Y011323D01*
X021805Y011233D02*
X021770Y011198D01*
X021770Y011128D01*
X021805Y011093D01*
X021805Y011233D02*
X021841Y011233D01*
X021981Y011093D01*
X021981Y011233D01*
X021981Y011323D02*
X021841Y011463D01*
X021981Y011463D02*
X021981Y011323D01*
X021981Y011013D02*
X021981Y010978D01*
X021946Y010978D01*
X021946Y011013D01*
X021981Y011013D01*
X021946Y010887D02*
X021981Y010852D01*
X021981Y010782D01*
X021946Y010747D01*
X021805Y010887D01*
X021946Y010887D01*
X021946Y010747D02*
X021805Y010747D01*
X021770Y010782D01*
X021770Y010852D01*
X021805Y010887D01*
X021481Y011108D02*
X021340Y011108D01*
X021340Y010897D01*
X021250Y010897D02*
X021250Y011037D01*
X021340Y011002D02*
X021410Y011002D01*
X021250Y010897D02*
X021145Y010897D01*
X021110Y010932D01*
X021110Y011037D01*
X021020Y011073D02*
X020880Y010932D01*
X020880Y010897D01*
X020800Y010897D02*
X020765Y010897D01*
X020765Y010932D01*
X020800Y010932D01*
X020800Y010897D01*
X020640Y010897D02*
X020640Y011108D01*
X020535Y011002D01*
X020675Y011002D01*
X020880Y011108D02*
X021020Y011108D01*
X021020Y011073D01*
X021770Y010407D02*
X021911Y010267D01*
X021876Y010302D02*
X021981Y010407D01*
X021981Y010267D02*
X021770Y010267D01*
X021770Y010177D02*
X021805Y010177D01*
X021946Y010037D01*
X021981Y010037D01*
X021981Y009957D02*
X021981Y009922D01*
X021946Y009922D01*
X021946Y009957D01*
X021981Y009957D01*
X021981Y009797D02*
X021770Y009797D01*
X021876Y009692D01*
X021876Y009832D01*
X021770Y010037D02*
X021770Y010177D01*
X021381Y006243D02*
X021276Y006138D01*
X021311Y006103D02*
X021170Y006243D01*
X021170Y006103D02*
X021381Y006103D01*
X021346Y006013D02*
X021381Y005978D01*
X021381Y005908D01*
X021346Y005873D01*
X021276Y005873D01*
X021276Y005978D01*
X021311Y006013D01*
X021346Y006013D01*
X021276Y005873D02*
X021205Y005943D01*
X021170Y006013D01*
X021346Y005793D02*
X021381Y005793D01*
X021381Y005758D01*
X021346Y005758D01*
X021346Y005793D01*
X021205Y005668D02*
X021346Y005528D01*
X021381Y005528D01*
X021346Y005437D02*
X021381Y005402D01*
X021381Y005332D01*
X021346Y005297D01*
X021276Y005297D02*
X021241Y005367D01*
X021241Y005402D01*
X021276Y005437D01*
X021346Y005437D01*
X021276Y005297D02*
X021170Y005297D01*
X021170Y005437D01*
X021170Y005528D02*
X021170Y005668D01*
X021205Y005668D01*
X021251Y002458D02*
X021216Y002423D01*
X021251Y002458D02*
X021321Y002458D01*
X021356Y002423D01*
X021356Y002387D01*
X021216Y002247D01*
X021356Y002247D01*
X021446Y002282D02*
X021481Y002247D01*
X021586Y002247D01*
X021586Y002387D01*
X021676Y002352D02*
X021746Y002352D01*
X021676Y002247D02*
X021676Y002458D01*
X021816Y002458D01*
X021446Y002387D02*
X021446Y002282D01*
X021136Y002282D02*
X021136Y002247D01*
X021101Y002247D01*
X021101Y002282D01*
X021136Y002282D01*
X021011Y002247D02*
X020871Y002247D01*
X021011Y002387D01*
X021011Y002423D01*
X020976Y002458D01*
X020906Y002458D01*
X020871Y002423D01*
X020221Y002402D02*
X020116Y002402D01*
X020081Y002437D01*
X020081Y002473D01*
X020116Y002508D01*
X020186Y002508D01*
X020221Y002473D01*
X020221Y002332D01*
X020186Y002297D01*
X020116Y002297D01*
X020081Y002332D01*
X019991Y002332D02*
X019991Y002473D01*
X019956Y002508D01*
X019886Y002508D01*
X019851Y002473D01*
X019851Y002437D01*
X019886Y002402D01*
X019991Y002402D01*
X019991Y002332D02*
X019956Y002297D01*
X019886Y002297D01*
X019851Y002332D01*
X019761Y002402D02*
X019621Y002402D01*
X019726Y002508D01*
X019726Y002297D01*
X019511Y002323D02*
X019441Y002252D01*
X019441Y002147D01*
X019441Y002252D02*
X019371Y002323D01*
X019371Y002358D01*
X019511Y002358D02*
X019511Y002323D01*
X019011Y002323D02*
X019011Y002287D01*
X018976Y002252D01*
X018871Y002252D01*
X018871Y002147D02*
X018976Y002147D01*
X019011Y002182D01*
X019011Y002217D01*
X018976Y002252D01*
X019011Y002323D02*
X018976Y002358D01*
X018871Y002358D01*
X018871Y002147D01*
X017481Y002202D02*
X017481Y002272D01*
X017446Y002307D01*
X017305Y002307D01*
X017270Y002272D01*
X017270Y002202D01*
X017305Y002167D01*
X017341Y002167D01*
X017376Y002202D01*
X017376Y002307D01*
X017481Y002202D02*
X017446Y002167D01*
X017446Y002077D02*
X017305Y002077D01*
X017270Y002042D01*
X017270Y001972D01*
X017305Y001937D01*
X017341Y001937D01*
X017376Y001972D01*
X017376Y002077D01*
X017446Y002077D02*
X017481Y002042D01*
X017481Y001972D01*
X017446Y001937D01*
X017376Y001847D02*
X017376Y001707D01*
X017270Y001812D01*
X017481Y001812D01*
X012666Y003458D02*
X012526Y003458D01*
X012526Y003247D01*
X012436Y003247D02*
X012436Y003387D01*
X012526Y003352D02*
X012596Y003352D01*
X012436Y003247D02*
X012331Y003247D01*
X012296Y003282D01*
X012296Y003387D01*
X012206Y003387D02*
X012206Y003423D01*
X012171Y003458D01*
X012101Y003458D01*
X012066Y003423D01*
X012206Y003387D02*
X012066Y003247D01*
X012206Y003247D01*
X011986Y003247D02*
X011951Y003247D01*
X011951Y003282D01*
X011986Y003282D01*
X011986Y003247D01*
X011861Y003247D02*
X011721Y003247D01*
X011861Y003387D01*
X011861Y003423D01*
X011826Y003458D01*
X011756Y003458D01*
X011721Y003423D01*
X010726Y004297D02*
X010726Y004508D01*
X010866Y004508D01*
X010796Y004402D02*
X010726Y004402D01*
X010636Y004437D02*
X010636Y004297D01*
X010531Y004297D01*
X010496Y004332D01*
X010496Y004437D01*
X010496Y004597D02*
X010496Y004808D01*
X010531Y004702D02*
X010636Y004597D01*
X010496Y004667D02*
X010636Y004808D01*
X010406Y004597D02*
X010266Y004597D01*
X010336Y004597D02*
X010336Y004808D01*
X010266Y004737D01*
X010186Y004632D02*
X010186Y004597D01*
X010151Y004597D01*
X010151Y004632D01*
X010186Y004632D01*
X010061Y004597D02*
X009921Y004597D01*
X009991Y004597D02*
X009991Y004808D01*
X009921Y004737D01*
X009956Y004508D02*
X010026Y004508D01*
X010061Y004473D01*
X009921Y004332D01*
X009956Y004297D01*
X010026Y004297D01*
X010061Y004332D01*
X010061Y004473D01*
X009956Y004508D02*
X009921Y004473D01*
X009921Y004332D01*
X010151Y004332D02*
X010186Y004332D01*
X010186Y004297D01*
X010151Y004297D01*
X010151Y004332D01*
X010266Y004297D02*
X010406Y004297D01*
X010336Y004297D02*
X010336Y004508D01*
X010266Y004437D01*
X010126Y003908D02*
X010056Y003908D01*
X010021Y003873D01*
X010021Y003732D01*
X010056Y003697D01*
X010126Y003697D01*
X010161Y003732D01*
X010161Y003802D01*
X010091Y003802D01*
X010161Y003873D02*
X010126Y003908D01*
X008631Y003893D02*
X008631Y003963D01*
X008596Y003998D01*
X008455Y003998D01*
X008420Y003963D01*
X008420Y003893D01*
X008455Y003858D01*
X008491Y003858D01*
X008526Y003893D01*
X008526Y003998D01*
X008631Y003893D02*
X008596Y003858D01*
X008596Y003768D02*
X008455Y003768D01*
X008420Y003733D01*
X008420Y003663D01*
X008455Y003628D01*
X008491Y003628D01*
X008526Y003663D01*
X008526Y003768D01*
X008596Y003768D02*
X008631Y003733D01*
X008631Y003663D01*
X008596Y003628D01*
X008526Y003537D02*
X008526Y003397D01*
X008420Y003502D01*
X008631Y003502D01*
X008246Y005661D02*
X008105Y005802D01*
X008246Y005802D01*
X008281Y005767D01*
X008281Y005697D01*
X008246Y005661D01*
X008105Y005661D01*
X008070Y005697D01*
X008070Y005767D01*
X008105Y005802D01*
X008246Y005892D02*
X008246Y005927D01*
X008281Y005927D01*
X008281Y005892D01*
X008246Y005892D01*
X008281Y006007D02*
X008281Y006147D01*
X008281Y006077D02*
X008070Y006077D01*
X008141Y006007D01*
X008141Y006237D02*
X008246Y006237D01*
X008281Y006272D01*
X008281Y006377D01*
X008141Y006377D01*
X008176Y006467D02*
X008176Y006537D01*
X008281Y006467D02*
X008070Y006467D01*
X008070Y006607D01*
X008406Y007047D02*
X008371Y007082D01*
X008511Y007223D01*
X008511Y007082D01*
X008476Y007047D01*
X008406Y007047D01*
X008371Y007082D02*
X008371Y007223D01*
X008406Y007258D01*
X008476Y007258D01*
X008511Y007223D01*
X008601Y007082D02*
X008636Y007082D01*
X008636Y007047D01*
X008601Y007047D01*
X008601Y007082D01*
X008716Y007047D02*
X008856Y007047D01*
X008786Y007047D02*
X008786Y007258D01*
X008716Y007187D01*
X008946Y007187D02*
X008946Y007082D01*
X008981Y007047D01*
X009086Y007047D01*
X009086Y007187D01*
X009176Y007152D02*
X009246Y007152D01*
X009176Y007047D02*
X009176Y007258D01*
X009316Y007258D01*
X009346Y007897D02*
X009346Y008037D01*
X009451Y008037D01*
X009486Y008002D01*
X009486Y007897D01*
X009576Y007897D02*
X009576Y008108D01*
X009716Y008108D01*
X009646Y008002D02*
X009576Y008002D01*
X009256Y008037D02*
X009256Y008073D01*
X009221Y008108D01*
X009151Y008108D01*
X009116Y008073D01*
X009256Y008037D02*
X009116Y007897D01*
X009256Y007897D01*
X009036Y007897D02*
X009001Y007897D01*
X009001Y007932D01*
X009036Y007932D01*
X009036Y007897D01*
X008911Y007897D02*
X008771Y007897D01*
X008911Y008037D01*
X008911Y008073D01*
X008876Y008108D01*
X008806Y008108D01*
X008771Y008073D01*
X008805Y009161D02*
X008770Y009197D01*
X008770Y009267D01*
X008805Y009302D01*
X008946Y009161D01*
X008981Y009197D01*
X008981Y009267D01*
X008946Y009302D01*
X008805Y009302D01*
X008805Y009161D02*
X008946Y009161D01*
X008946Y009392D02*
X008946Y009427D01*
X008981Y009427D01*
X008981Y009392D01*
X008946Y009392D01*
X008981Y009507D02*
X008981Y009647D01*
X008981Y009577D02*
X008770Y009577D01*
X008841Y009507D01*
X008841Y009737D02*
X008946Y009737D01*
X008981Y009772D01*
X008981Y009877D01*
X008841Y009877D01*
X008876Y009967D02*
X008876Y010037D01*
X008981Y009967D02*
X008770Y009967D01*
X008770Y010107D01*
X008081Y010097D02*
X008081Y009957D01*
X008081Y010027D02*
X007870Y010027D01*
X007941Y009957D01*
X008046Y009877D02*
X008081Y009877D01*
X008081Y009842D01*
X008046Y009842D01*
X008046Y009877D01*
X008046Y009752D02*
X008081Y009717D01*
X008081Y009647D01*
X008046Y009611D01*
X007905Y009752D01*
X008046Y009752D01*
X007905Y009752D02*
X007870Y009717D01*
X007870Y009647D01*
X007905Y009611D01*
X008046Y009611D01*
X008046Y010187D02*
X008081Y010222D01*
X008081Y010327D01*
X007941Y010327D01*
X007976Y010417D02*
X007976Y010487D01*
X008081Y010417D02*
X007870Y010417D01*
X007870Y010557D01*
X007941Y010187D02*
X008046Y010187D01*
X009220Y010997D02*
X009220Y011067D01*
X009255Y011102D01*
X009396Y010961D01*
X009431Y010997D01*
X009431Y011067D01*
X009396Y011102D01*
X009255Y011102D01*
X009220Y010997D02*
X009255Y010961D01*
X009396Y010961D01*
X009396Y011192D02*
X009396Y011227D01*
X009431Y011227D01*
X009431Y011192D01*
X009396Y011192D01*
X009431Y011307D02*
X009431Y011447D01*
X009431Y011377D02*
X009220Y011377D01*
X009291Y011307D01*
X009291Y011537D02*
X009396Y011537D01*
X009431Y011572D01*
X009431Y011677D01*
X009291Y011677D01*
X009326Y011767D02*
X009326Y011837D01*
X009431Y011767D02*
X009220Y011767D01*
X009220Y011907D01*
X007881Y011708D02*
X007740Y011708D01*
X007740Y011497D01*
X007650Y011497D02*
X007650Y011637D01*
X007740Y011602D02*
X007810Y011602D01*
X007650Y011497D02*
X007545Y011497D01*
X007510Y011532D01*
X007510Y011637D01*
X007420Y011497D02*
X007280Y011497D01*
X007350Y011497D02*
X007350Y011708D01*
X007280Y011637D01*
X007200Y011532D02*
X007200Y011497D01*
X007165Y011497D01*
X007165Y011532D01*
X007200Y011532D01*
X007075Y011532D02*
X007040Y011497D01*
X006970Y011497D01*
X006935Y011532D01*
X007075Y011673D01*
X007075Y011532D01*
X006935Y011532D02*
X006935Y011673D01*
X006970Y011708D01*
X007040Y011708D01*
X007075Y011673D01*
X007641Y013097D02*
X007570Y013167D01*
X007781Y013167D01*
X007781Y013097D02*
X007781Y013237D01*
X007746Y013328D02*
X007605Y013468D01*
X007746Y013468D01*
X007781Y013433D01*
X007781Y013363D01*
X007746Y013328D01*
X007605Y013328D01*
X007570Y013363D01*
X007570Y013433D01*
X007605Y013468D01*
X007570Y013558D02*
X007781Y013558D01*
X007711Y013558D02*
X007570Y013698D01*
X007676Y013593D02*
X007781Y013698D01*
X008320Y013698D02*
X008461Y013558D01*
X008426Y013593D02*
X008531Y013698D01*
X008531Y013558D02*
X008320Y013558D01*
X008355Y013468D02*
X008320Y013433D01*
X008320Y013363D01*
X008355Y013328D01*
X008496Y013328D01*
X008355Y013468D01*
X008496Y013468D01*
X008531Y013433D01*
X008531Y013363D01*
X008496Y013328D01*
X008531Y013237D02*
X008531Y013097D01*
X008531Y013167D02*
X008320Y013167D01*
X008391Y013097D01*
X009835Y013247D02*
X009975Y013387D01*
X009975Y013423D01*
X009940Y013458D01*
X009870Y013458D01*
X009835Y013423D01*
X009835Y013247D02*
X009975Y013247D01*
X010065Y013247D02*
X010100Y013247D01*
X010100Y013282D01*
X010065Y013282D01*
X010065Y013247D01*
X010180Y013247D02*
X010320Y013387D01*
X010320Y013423D01*
X010285Y013458D01*
X010215Y013458D01*
X010180Y013423D01*
X010180Y013247D02*
X010320Y013247D01*
X010410Y013247D02*
X010550Y013247D01*
X010480Y013247D02*
X010480Y013458D01*
X010410Y013387D01*
X010640Y013317D02*
X010781Y013458D01*
X010640Y013458D02*
X010640Y013247D01*
X010675Y013352D02*
X010781Y013247D01*
X011170Y012307D02*
X011311Y012167D01*
X011276Y012202D02*
X011381Y012307D01*
X011381Y012167D02*
X011170Y012167D01*
X011205Y012077D02*
X011170Y012042D01*
X011170Y011972D01*
X011205Y011937D01*
X011241Y011937D01*
X011276Y011972D01*
X011276Y012077D01*
X011346Y012077D02*
X011205Y012077D01*
X011346Y012077D02*
X011381Y012042D01*
X011381Y011972D01*
X011346Y011937D01*
X011346Y011847D02*
X011205Y011847D01*
X011170Y011812D01*
X011170Y011742D01*
X011205Y011707D01*
X011241Y011707D01*
X011276Y011742D01*
X011276Y011847D01*
X011346Y011847D02*
X011381Y011812D01*
X011381Y011742D01*
X011346Y011707D01*
X011346Y011627D02*
X011381Y011627D01*
X011381Y011592D01*
X011346Y011592D01*
X011346Y011627D01*
X011276Y011502D02*
X011276Y011361D01*
X011170Y011467D01*
X011381Y011467D01*
X010981Y011482D02*
X010981Y011412D01*
X010946Y011377D01*
X010805Y011517D01*
X010946Y011517D01*
X010981Y011482D01*
X010946Y011377D02*
X010805Y011377D01*
X010770Y011412D01*
X010770Y011482D01*
X010805Y011517D01*
X010805Y011607D02*
X010770Y011642D01*
X010770Y011712D01*
X010805Y011747D01*
X010946Y011607D01*
X010981Y011642D01*
X010981Y011712D01*
X010946Y011747D01*
X010805Y011747D01*
X010841Y011837D02*
X010841Y011942D01*
X010876Y011977D01*
X010946Y011977D01*
X010981Y011942D01*
X010981Y011837D01*
X011051Y011837D02*
X010841Y011837D01*
X010876Y012067D02*
X010876Y012137D01*
X010981Y012067D02*
X010770Y012067D01*
X010770Y012207D01*
X010805Y011607D02*
X010946Y011607D01*
X010946Y011286D02*
X010981Y011251D01*
X010981Y011181D01*
X010946Y011146D01*
X010805Y011286D01*
X010946Y011286D01*
X010946Y011146D02*
X010805Y011146D01*
X010770Y011181D01*
X010770Y011251D01*
X010805Y011286D01*
X010981Y011056D02*
X010981Y010916D01*
X010981Y010986D02*
X010770Y010986D01*
X010841Y010916D01*
X011070Y010393D02*
X011070Y010253D01*
X011281Y010253D01*
X011281Y010163D02*
X011141Y010163D01*
X011176Y010253D02*
X011176Y010323D01*
X011281Y010163D02*
X011281Y010058D01*
X011246Y010023D01*
X011141Y010023D01*
X011141Y009933D02*
X011105Y009933D01*
X011070Y009898D01*
X011070Y009828D01*
X011105Y009793D01*
X011141Y009933D02*
X011281Y009793D01*
X011281Y009933D01*
X011281Y009713D02*
X011246Y009713D01*
X011246Y009678D01*
X011281Y009678D01*
X011281Y009713D01*
X011281Y009587D02*
X011281Y009447D01*
X011141Y009587D01*
X011105Y009587D01*
X011070Y009552D01*
X011070Y009482D01*
X011105Y009447D01*
X011720Y009497D02*
X011720Y009567D01*
X011720Y009532D02*
X011931Y009532D01*
X011931Y009497D02*
X011931Y009567D01*
X011931Y009651D02*
X011720Y009651D01*
X011931Y009791D01*
X011720Y009791D01*
X011720Y009881D02*
X011720Y009986D01*
X011755Y010021D01*
X011896Y010021D01*
X011931Y009986D01*
X011931Y009881D01*
X011720Y009881D01*
X012555Y010861D02*
X012520Y010897D01*
X012520Y010967D01*
X012555Y011002D01*
X012591Y011002D01*
X012731Y010861D01*
X012731Y011002D01*
X012731Y011092D02*
X012731Y011127D01*
X012696Y011127D01*
X012696Y011092D01*
X012731Y011092D01*
X012731Y011207D02*
X012591Y011347D01*
X012555Y011347D01*
X012520Y011312D01*
X012520Y011242D01*
X012555Y011207D01*
X012731Y011207D02*
X012731Y011347D01*
X012696Y011437D02*
X012591Y011437D01*
X012696Y011437D02*
X012731Y011472D01*
X012731Y011577D01*
X012591Y011577D01*
X012626Y011667D02*
X012626Y011737D01*
X012731Y011667D02*
X012520Y011667D01*
X012520Y011807D01*
X012506Y012147D02*
X012366Y012147D01*
X012506Y012287D01*
X012506Y012323D01*
X012471Y012358D01*
X012401Y012358D01*
X012366Y012323D01*
X012286Y012182D02*
X012286Y012147D01*
X012251Y012147D01*
X012251Y012182D01*
X012286Y012182D01*
X012161Y012147D02*
X012021Y012147D01*
X012161Y012287D01*
X012161Y012323D01*
X012126Y012358D01*
X012056Y012358D01*
X012021Y012323D01*
X012596Y012287D02*
X012596Y012182D01*
X012631Y012147D01*
X012736Y012147D01*
X012736Y012287D01*
X012826Y012252D02*
X012896Y012252D01*
X012826Y012147D02*
X012826Y012358D01*
X012966Y012358D01*
X013471Y013197D02*
X013541Y013197D01*
X013506Y013197D02*
X013506Y013408D01*
X013471Y013408D02*
X013541Y013408D01*
X013624Y013408D02*
X013764Y013197D01*
X013764Y013408D01*
X013854Y013408D02*
X013959Y013408D01*
X013994Y013373D01*
X013994Y013232D01*
X013959Y013197D01*
X013854Y013197D01*
X013854Y013408D01*
X013624Y013408D02*
X013624Y013197D01*
X010781Y014547D02*
X010675Y014652D01*
X010640Y014617D02*
X010781Y014758D01*
X010640Y014758D02*
X010640Y014547D01*
X010550Y014547D02*
X010410Y014547D01*
X010480Y014547D02*
X010480Y014758D01*
X010410Y014687D01*
X010320Y014687D02*
X010320Y014723D01*
X010285Y014758D01*
X010215Y014758D01*
X010180Y014723D01*
X010320Y014687D02*
X010180Y014547D01*
X010320Y014547D01*
X010100Y014547D02*
X010065Y014547D01*
X010065Y014582D01*
X010100Y014582D01*
X010100Y014547D01*
X009975Y014547D02*
X009835Y014547D01*
X009975Y014687D01*
X009975Y014723D01*
X009940Y014758D01*
X009870Y014758D01*
X009835Y014723D01*
X005331Y012108D02*
X005190Y011967D01*
X005225Y012002D02*
X005331Y011897D01*
X005190Y011897D02*
X005190Y012108D01*
X005100Y012073D02*
X004960Y011932D01*
X004995Y011897D01*
X005065Y011897D01*
X005100Y011932D01*
X005100Y012073D01*
X005065Y012108D01*
X004995Y012108D01*
X004960Y012073D01*
X004960Y011932D01*
X004870Y011897D02*
X004730Y011897D01*
X004800Y011897D02*
X004800Y012108D01*
X004730Y012037D01*
X004710Y011308D02*
X004815Y011308D01*
X004850Y011273D01*
X004850Y011132D01*
X004815Y011097D01*
X004710Y011097D01*
X004710Y011308D01*
X004620Y011273D02*
X004585Y011308D01*
X004515Y011308D01*
X004480Y011273D01*
X004480Y011237D01*
X004515Y011202D01*
X004585Y011202D01*
X004620Y011167D01*
X004620Y011132D01*
X004585Y011097D01*
X004515Y011097D01*
X004480Y011132D01*
X004515Y010858D02*
X004480Y010823D01*
X004480Y010787D01*
X004515Y010752D01*
X004585Y010752D01*
X004620Y010717D01*
X004620Y010682D01*
X004585Y010647D01*
X004515Y010647D01*
X004480Y010682D01*
X004515Y010858D02*
X004585Y010858D01*
X004620Y010823D01*
X004710Y010823D02*
X004710Y010682D01*
X004745Y010647D01*
X004815Y010647D01*
X004850Y010682D01*
X004940Y010647D02*
X005081Y010647D01*
X004940Y010647D02*
X004940Y010858D01*
X004850Y010823D02*
X004815Y010858D01*
X004745Y010858D01*
X004710Y010823D01*
X004940Y011097D02*
X004940Y011237D01*
X005010Y011308D01*
X005081Y011237D01*
X005081Y011097D01*
X005081Y011202D02*
X004940Y011202D01*
X004940Y010458D02*
X005046Y010458D01*
X005081Y010423D01*
X005081Y010282D01*
X005046Y010247D01*
X004940Y010247D01*
X004940Y010458D01*
X004850Y010458D02*
X004850Y010247D01*
X004710Y010458D01*
X004710Y010247D01*
X004620Y010282D02*
X004620Y010352D01*
X004550Y010352D01*
X004480Y010282D02*
X004515Y010247D01*
X004585Y010247D01*
X004620Y010282D01*
X004480Y010282D02*
X004480Y010423D01*
X004515Y010458D01*
X004585Y010458D01*
X004620Y010423D01*
X004620Y010058D02*
X004620Y009917D01*
X004550Y009847D01*
X004480Y009917D01*
X004480Y010058D01*
X004710Y010023D02*
X004710Y009882D01*
X004745Y009847D01*
X004815Y009847D01*
X004850Y009882D01*
X004940Y009882D02*
X004975Y009847D01*
X005046Y009847D01*
X005081Y009882D01*
X005081Y010023D02*
X005046Y010058D01*
X004975Y010058D01*
X004940Y010023D01*
X004940Y009882D01*
X004850Y010023D02*
X004815Y010058D01*
X004745Y010058D01*
X004710Y010023D01*
X004810Y009058D02*
X004950Y009058D01*
X004950Y009023D01*
X004810Y008882D01*
X004810Y008847D01*
X004730Y008847D02*
X004695Y008847D01*
X004695Y008882D01*
X004730Y008882D01*
X004730Y008847D01*
X004570Y008847D02*
X004570Y009058D01*
X004465Y008952D01*
X004605Y008952D01*
X005040Y008917D02*
X005181Y009058D01*
X005040Y009058D02*
X005040Y008847D01*
X005075Y008952D02*
X005181Y008847D01*
X005096Y007408D02*
X004990Y007408D01*
X004990Y007197D01*
X005096Y007197D01*
X005131Y007232D01*
X005131Y007373D01*
X005096Y007408D01*
X004900Y007408D02*
X004900Y007197D01*
X004760Y007408D01*
X004760Y007197D01*
X004670Y007232D02*
X004670Y007302D01*
X004600Y007302D01*
X004530Y007232D02*
X004565Y007197D01*
X004635Y007197D01*
X004670Y007232D01*
X004530Y007232D02*
X004530Y007373D01*
X004565Y007408D01*
X004635Y007408D01*
X004670Y007373D01*
X004635Y007058D02*
X004670Y007023D01*
X004670Y006952D01*
X004635Y006917D01*
X004530Y006917D01*
X004530Y006847D02*
X004530Y007058D01*
X004635Y007058D01*
X004760Y007058D02*
X004760Y006847D01*
X004865Y006847D01*
X004900Y006882D01*
X004900Y006917D01*
X004865Y006952D01*
X004760Y006952D01*
X004865Y006952D02*
X004900Y006987D01*
X004900Y007023D01*
X004865Y007058D01*
X004760Y007058D01*
X004990Y007023D02*
X005025Y007058D01*
X005096Y007058D01*
X005131Y007023D01*
X005131Y006987D01*
X005096Y006952D01*
X005131Y006917D01*
X005131Y006882D01*
X005096Y006847D01*
X005025Y006847D01*
X004990Y006882D01*
X005060Y006952D02*
X005096Y006952D01*
X005096Y006258D02*
X004990Y006152D01*
X005131Y006152D01*
X005096Y006047D02*
X005096Y006258D01*
X004900Y006223D02*
X004900Y006187D01*
X004865Y006152D01*
X004760Y006152D01*
X004670Y006152D02*
X004635Y006117D01*
X004530Y006117D01*
X004530Y006047D02*
X004530Y006258D01*
X004635Y006258D01*
X004670Y006223D01*
X004670Y006152D01*
X004760Y006047D02*
X004865Y006047D01*
X004900Y006082D01*
X004900Y006117D01*
X004865Y006152D01*
X004900Y006223D02*
X004865Y006258D01*
X004760Y006258D01*
X004760Y006047D01*
X004760Y005958D02*
X004865Y005958D01*
X004900Y005923D01*
X004900Y005887D01*
X004865Y005852D01*
X004760Y005852D01*
X004670Y005852D02*
X004635Y005817D01*
X004530Y005817D01*
X004530Y005747D02*
X004530Y005958D01*
X004635Y005958D01*
X004670Y005923D01*
X004670Y005852D01*
X004760Y005747D02*
X004865Y005747D01*
X004900Y005782D01*
X004900Y005817D01*
X004865Y005852D01*
X004990Y005852D02*
X004990Y005958D01*
X005131Y005958D01*
X005096Y005887D02*
X005131Y005852D01*
X005131Y005782D01*
X005096Y005747D01*
X005025Y005747D01*
X004990Y005782D01*
X004990Y005852D02*
X005060Y005887D01*
X005096Y005887D01*
X004760Y005958D02*
X004760Y005747D01*
X008521Y005832D02*
X008661Y005973D01*
X008661Y005832D01*
X008626Y005797D01*
X008556Y005797D01*
X008521Y005832D01*
X008521Y005973D01*
X008556Y006008D01*
X008626Y006008D01*
X008661Y005973D01*
X008751Y005832D02*
X008786Y005832D01*
X008786Y005797D01*
X008751Y005797D01*
X008751Y005832D01*
X008866Y005797D02*
X009006Y005797D01*
X008936Y005797D02*
X008936Y006008D01*
X008866Y005937D01*
X009096Y005937D02*
X009096Y005832D01*
X009131Y005797D01*
X009236Y005797D01*
X009236Y005937D01*
X009326Y005902D02*
X009396Y005902D01*
X009326Y005797D02*
X009326Y006008D01*
X009466Y006008D01*
D15*
X007677Y006190D02*
X007638Y006190D01*
X007677Y006190D02*
X007677Y006466D01*
X007244Y006741D02*
X007246Y006762D01*
X007252Y006782D01*
X007261Y006802D01*
X007273Y006819D01*
X007288Y006833D01*
X007306Y006845D01*
X007326Y006853D01*
X007346Y006858D01*
X007367Y006859D01*
X007388Y006856D01*
X007408Y006850D01*
X007427Y006839D01*
X007444Y006826D01*
X007457Y006810D01*
X007468Y006792D01*
X007476Y006772D01*
X007480Y006752D01*
X007480Y006730D01*
X007476Y006710D01*
X007468Y006690D01*
X007457Y006672D01*
X007444Y006656D01*
X007427Y006643D01*
X007408Y006632D01*
X007388Y006626D01*
X007367Y006623D01*
X007346Y006624D01*
X007326Y006629D01*
X007306Y006637D01*
X007288Y006649D01*
X007273Y006663D01*
X007261Y006680D01*
X007252Y006700D01*
X007246Y006720D01*
X007244Y006741D01*
X007677Y007489D02*
X007677Y007765D01*
X007638Y007765D01*
X006063Y007765D02*
X006024Y007765D01*
X006024Y007529D01*
X006024Y006466D02*
X006024Y006190D01*
X006089Y006190D01*
X004074Y008502D02*
X003991Y008502D01*
X003949Y008544D01*
X003949Y008711D01*
X003991Y008753D01*
X004074Y008753D01*
X004116Y008711D01*
X004116Y008627D02*
X004033Y008627D01*
X004116Y008627D02*
X004116Y008544D01*
X004074Y008502D01*
X003840Y008544D02*
X003840Y008753D01*
X003673Y008753D02*
X003673Y008544D01*
X003715Y008502D01*
X003798Y008502D01*
X003840Y008544D01*
X003564Y008544D02*
X003522Y008502D01*
X003397Y008502D01*
X003397Y008753D01*
X003522Y008753D01*
X003564Y008711D01*
X003564Y008669D01*
X003522Y008627D01*
X003397Y008627D01*
X003522Y008627D02*
X003564Y008586D01*
X003564Y008544D01*
X003287Y008502D02*
X003121Y008502D01*
X003121Y008753D01*
X003287Y008753D01*
X003204Y008627D02*
X003121Y008627D01*
X003011Y008544D02*
X003011Y008711D01*
X002970Y008753D01*
X002844Y008753D01*
X002844Y008502D01*
X002970Y008502D01*
X003011Y008544D01*
X003063Y011952D02*
X003146Y011952D01*
X003104Y011952D02*
X003104Y012203D01*
X003063Y012203D02*
X003146Y012203D01*
X003247Y012161D02*
X003289Y012203D01*
X003372Y012203D01*
X003414Y012161D01*
X003414Y012119D01*
X003247Y011952D01*
X003414Y011952D01*
X003523Y011994D02*
X003565Y011952D01*
X003648Y011952D01*
X003690Y011994D01*
X003799Y011952D02*
X003966Y011952D01*
X003883Y011952D02*
X003883Y012203D01*
X003799Y012119D01*
X003690Y012161D02*
X003648Y012203D01*
X003565Y012203D01*
X003523Y012161D01*
X003523Y011994D01*
X004908Y003390D02*
X004908Y003201D01*
X004908Y003390D02*
X007431Y003390D01*
X007431Y003201D01*
X007431Y000846D02*
X007431Y000657D01*
X004908Y000657D01*
X004908Y000846D01*
D16*
X002612Y004189D02*
X002612Y005527D01*
X002612Y006315D02*
X002612Y007771D01*
X002612Y008480D02*
X002612Y009071D01*
X002612Y009819D02*
X002612Y011236D01*
X002612Y012023D02*
X002612Y013834D01*
X011001Y013777D02*
X011251Y013527D01*
X011751Y012977D02*
X012151Y012488D01*
X012551Y012027D02*
X013001Y011488D01*
X012051Y005427D02*
X011001Y004227D01*
D17*
X008901Y003377D03*
X018451Y001477D03*
X019951Y001677D03*
X021601Y006377D03*
X021501Y010177D03*
X020101Y014527D03*
X018401Y014777D03*
X011451Y012927D03*
X008351Y014777D03*
X007851Y014777D03*
D18*
X007351Y011989D02*
X007351Y011965D01*
X007539Y010127D02*
X007563Y010127D01*
X008489Y009677D02*
X008513Y009677D01*
X009201Y008389D02*
X009201Y008365D01*
X008013Y007277D02*
X007989Y007277D01*
X009151Y006789D02*
X009151Y006765D01*
X009151Y006289D02*
X009151Y006265D01*
X011289Y008827D02*
X011313Y008827D01*
X012239Y011377D02*
X012263Y011377D01*
X013551Y012315D02*
X013551Y012339D01*
X014396Y012745D02*
X014420Y012745D01*
X017196Y012795D02*
X017220Y012795D01*
X019489Y012827D02*
X019513Y012827D01*
X020601Y013515D02*
X020601Y013539D01*
X021739Y012627D02*
X021763Y012627D01*
X010513Y011477D02*
X010489Y011477D01*
X009713Y011477D02*
X009689Y011477D01*
X011101Y003539D02*
X011101Y003515D01*
X012201Y003039D02*
X012201Y003015D01*
X021101Y003065D02*
X021101Y003089D01*
D19*
X004213Y008012D02*
X004215Y008026D01*
X004221Y008040D01*
X004229Y008052D01*
X004241Y008060D01*
X004255Y008066D01*
X004269Y008068D01*
X004283Y008066D01*
X004297Y008060D01*
X004309Y008052D01*
X004317Y008040D01*
X004323Y008026D01*
X004325Y008012D01*
X004323Y007998D01*
X004317Y007984D01*
X004309Y007972D01*
X004297Y007964D01*
X004283Y007958D01*
X004269Y007956D01*
X004255Y007958D01*
X004241Y007964D01*
X004229Y007972D01*
X004221Y007984D01*
X004215Y007998D01*
X004213Y008012D01*
X004213Y011512D02*
X004215Y011526D01*
X004221Y011540D01*
X004229Y011552D01*
X004241Y011560D01*
X004255Y011566D01*
X004269Y011568D01*
X004283Y011566D01*
X004297Y011560D01*
X004309Y011552D01*
X004317Y011540D01*
X004323Y011526D01*
X004325Y011512D01*
X004323Y011498D01*
X004317Y011484D01*
X004309Y011472D01*
X004297Y011464D01*
X004283Y011458D01*
X004269Y011456D01*
X004255Y011458D01*
X004241Y011464D01*
X004229Y011472D01*
X004221Y011484D01*
X004215Y011498D01*
X004213Y011512D01*
D20*
X005221Y010687D02*
X005221Y009268D01*
X007081Y009268D02*
X007081Y010687D01*
D21*
X006001Y011977D03*
X010101Y015027D03*
X012301Y013277D03*
X005051Y008127D03*
X011101Y004027D03*
M02*
