G75*
G70*
%OFA0B0*%
%FSLAX24Y24*%
%IPPOS*%
%LPD*%
%AMOC8*
5,1,8,0,0,1.08239X$1,22.5*
%
%ADD10C,0.0000*%
D10*
X002101Y000527D02*
X002101Y015527D01*
X022101Y015527D01*
X022101Y000527D01*
X002101Y000527D01*
X002451Y001527D02*
X002453Y001577D01*
X002459Y001627D01*
X002469Y001677D01*
X002482Y001725D01*
X002499Y001773D01*
X002520Y001819D01*
X002544Y001863D01*
X002572Y001905D01*
X002603Y001945D01*
X002637Y001982D01*
X002674Y002017D01*
X002713Y002048D01*
X002754Y002077D01*
X002798Y002102D01*
X002844Y002124D01*
X002891Y002142D01*
X002939Y002156D01*
X002988Y002167D01*
X003038Y002174D01*
X003088Y002177D01*
X003139Y002176D01*
X003189Y002171D01*
X003239Y002162D01*
X003287Y002150D01*
X003335Y002133D01*
X003381Y002113D01*
X003426Y002090D01*
X003469Y002063D01*
X003509Y002033D01*
X003547Y002000D01*
X003582Y001964D01*
X003615Y001925D01*
X003644Y001884D01*
X003670Y001841D01*
X003693Y001796D01*
X003712Y001749D01*
X003727Y001701D01*
X003739Y001652D01*
X003747Y001602D01*
X003751Y001552D01*
X003751Y001502D01*
X003747Y001452D01*
X003739Y001402D01*
X003727Y001353D01*
X003712Y001305D01*
X003693Y001258D01*
X003670Y001213D01*
X003644Y001170D01*
X003615Y001129D01*
X003582Y001090D01*
X003547Y001054D01*
X003509Y001021D01*
X003469Y000991D01*
X003426Y000964D01*
X003381Y000941D01*
X003335Y000921D01*
X003287Y000904D01*
X003239Y000892D01*
X003189Y000883D01*
X003139Y000878D01*
X003088Y000877D01*
X003038Y000880D01*
X002988Y000887D01*
X002939Y000898D01*
X002891Y000912D01*
X002844Y000930D01*
X002798Y000952D01*
X002754Y000977D01*
X002713Y001006D01*
X002674Y001037D01*
X002637Y001072D01*
X002603Y001109D01*
X002572Y001149D01*
X002544Y001191D01*
X002520Y001235D01*
X002499Y001281D01*
X002482Y001329D01*
X002469Y001377D01*
X002459Y001427D01*
X002453Y001477D01*
X002451Y001527D01*
X012733Y001227D02*
X012735Y001253D01*
X012741Y001279D01*
X012751Y001304D01*
X012764Y001327D01*
X012780Y001347D01*
X012800Y001365D01*
X012822Y001380D01*
X012845Y001392D01*
X012871Y001400D01*
X012897Y001404D01*
X012923Y001404D01*
X012949Y001400D01*
X012975Y001392D01*
X012999Y001380D01*
X013020Y001365D01*
X013040Y001347D01*
X013056Y001327D01*
X013069Y001304D01*
X013079Y001279D01*
X013085Y001253D01*
X013087Y001227D01*
X013085Y001201D01*
X013079Y001175D01*
X013069Y001150D01*
X013056Y001127D01*
X013040Y001107D01*
X013020Y001089D01*
X012998Y001074D01*
X012975Y001062D01*
X012949Y001054D01*
X012923Y001050D01*
X012897Y001050D01*
X012871Y001054D01*
X012845Y001062D01*
X012821Y001074D01*
X012800Y001089D01*
X012780Y001107D01*
X012764Y001127D01*
X012751Y001150D01*
X012741Y001175D01*
X012735Y001201D01*
X012733Y001227D01*
X013914Y001227D02*
X013916Y001253D01*
X013922Y001279D01*
X013932Y001304D01*
X013945Y001327D01*
X013961Y001347D01*
X013981Y001365D01*
X014003Y001380D01*
X014026Y001392D01*
X014052Y001400D01*
X014078Y001404D01*
X014104Y001404D01*
X014130Y001400D01*
X014156Y001392D01*
X014180Y001380D01*
X014201Y001365D01*
X014221Y001347D01*
X014237Y001327D01*
X014250Y001304D01*
X014260Y001279D01*
X014266Y001253D01*
X014268Y001227D01*
X014266Y001201D01*
X014260Y001175D01*
X014250Y001150D01*
X014237Y001127D01*
X014221Y001107D01*
X014201Y001089D01*
X014179Y001074D01*
X014156Y001062D01*
X014130Y001054D01*
X014104Y001050D01*
X014078Y001050D01*
X014052Y001054D01*
X014026Y001062D01*
X014002Y001074D01*
X013981Y001089D01*
X013961Y001107D01*
X013945Y001127D01*
X013932Y001150D01*
X013922Y001175D01*
X013916Y001201D01*
X013914Y001227D01*
X020451Y001527D02*
X020453Y001577D01*
X020459Y001627D01*
X020469Y001677D01*
X020482Y001725D01*
X020499Y001773D01*
X020520Y001819D01*
X020544Y001863D01*
X020572Y001905D01*
X020603Y001945D01*
X020637Y001982D01*
X020674Y002017D01*
X020713Y002048D01*
X020754Y002077D01*
X020798Y002102D01*
X020844Y002124D01*
X020891Y002142D01*
X020939Y002156D01*
X020988Y002167D01*
X021038Y002174D01*
X021088Y002177D01*
X021139Y002176D01*
X021189Y002171D01*
X021239Y002162D01*
X021287Y002150D01*
X021335Y002133D01*
X021381Y002113D01*
X021426Y002090D01*
X021469Y002063D01*
X021509Y002033D01*
X021547Y002000D01*
X021582Y001964D01*
X021615Y001925D01*
X021644Y001884D01*
X021670Y001841D01*
X021693Y001796D01*
X021712Y001749D01*
X021727Y001701D01*
X021739Y001652D01*
X021747Y001602D01*
X021751Y001552D01*
X021751Y001502D01*
X021747Y001452D01*
X021739Y001402D01*
X021727Y001353D01*
X021712Y001305D01*
X021693Y001258D01*
X021670Y001213D01*
X021644Y001170D01*
X021615Y001129D01*
X021582Y001090D01*
X021547Y001054D01*
X021509Y001021D01*
X021469Y000991D01*
X021426Y000964D01*
X021381Y000941D01*
X021335Y000921D01*
X021287Y000904D01*
X021239Y000892D01*
X021189Y000883D01*
X021139Y000878D01*
X021088Y000877D01*
X021038Y000880D01*
X020988Y000887D01*
X020939Y000898D01*
X020891Y000912D01*
X020844Y000930D01*
X020798Y000952D01*
X020754Y000977D01*
X020713Y001006D01*
X020674Y001037D01*
X020637Y001072D01*
X020603Y001109D01*
X020572Y001149D01*
X020544Y001191D01*
X020520Y001235D01*
X020499Y001281D01*
X020482Y001329D01*
X020469Y001377D01*
X020459Y001427D01*
X020453Y001477D01*
X020451Y001527D01*
X020451Y014527D02*
X020453Y014577D01*
X020459Y014627D01*
X020469Y014677D01*
X020482Y014725D01*
X020499Y014773D01*
X020520Y014819D01*
X020544Y014863D01*
X020572Y014905D01*
X020603Y014945D01*
X020637Y014982D01*
X020674Y015017D01*
X020713Y015048D01*
X020754Y015077D01*
X020798Y015102D01*
X020844Y015124D01*
X020891Y015142D01*
X020939Y015156D01*
X020988Y015167D01*
X021038Y015174D01*
X021088Y015177D01*
X021139Y015176D01*
X021189Y015171D01*
X021239Y015162D01*
X021287Y015150D01*
X021335Y015133D01*
X021381Y015113D01*
X021426Y015090D01*
X021469Y015063D01*
X021509Y015033D01*
X021547Y015000D01*
X021582Y014964D01*
X021615Y014925D01*
X021644Y014884D01*
X021670Y014841D01*
X021693Y014796D01*
X021712Y014749D01*
X021727Y014701D01*
X021739Y014652D01*
X021747Y014602D01*
X021751Y014552D01*
X021751Y014502D01*
X021747Y014452D01*
X021739Y014402D01*
X021727Y014353D01*
X021712Y014305D01*
X021693Y014258D01*
X021670Y014213D01*
X021644Y014170D01*
X021615Y014129D01*
X021582Y014090D01*
X021547Y014054D01*
X021509Y014021D01*
X021469Y013991D01*
X021426Y013964D01*
X021381Y013941D01*
X021335Y013921D01*
X021287Y013904D01*
X021239Y013892D01*
X021189Y013883D01*
X021139Y013878D01*
X021088Y013877D01*
X021038Y013880D01*
X020988Y013887D01*
X020939Y013898D01*
X020891Y013912D01*
X020844Y013930D01*
X020798Y013952D01*
X020754Y013977D01*
X020713Y014006D01*
X020674Y014037D01*
X020637Y014072D01*
X020603Y014109D01*
X020572Y014149D01*
X020544Y014191D01*
X020520Y014235D01*
X020499Y014281D01*
X020482Y014329D01*
X020469Y014377D01*
X020459Y014427D01*
X020453Y014477D01*
X020451Y014527D01*
X002451Y014527D02*
X002453Y014577D01*
X002459Y014627D01*
X002469Y014677D01*
X002482Y014725D01*
X002499Y014773D01*
X002520Y014819D01*
X002544Y014863D01*
X002572Y014905D01*
X002603Y014945D01*
X002637Y014982D01*
X002674Y015017D01*
X002713Y015048D01*
X002754Y015077D01*
X002798Y015102D01*
X002844Y015124D01*
X002891Y015142D01*
X002939Y015156D01*
X002988Y015167D01*
X003038Y015174D01*
X003088Y015177D01*
X003139Y015176D01*
X003189Y015171D01*
X003239Y015162D01*
X003287Y015150D01*
X003335Y015133D01*
X003381Y015113D01*
X003426Y015090D01*
X003469Y015063D01*
X003509Y015033D01*
X003547Y015000D01*
X003582Y014964D01*
X003615Y014925D01*
X003644Y014884D01*
X003670Y014841D01*
X003693Y014796D01*
X003712Y014749D01*
X003727Y014701D01*
X003739Y014652D01*
X003747Y014602D01*
X003751Y014552D01*
X003751Y014502D01*
X003747Y014452D01*
X003739Y014402D01*
X003727Y014353D01*
X003712Y014305D01*
X003693Y014258D01*
X003670Y014213D01*
X003644Y014170D01*
X003615Y014129D01*
X003582Y014090D01*
X003547Y014054D01*
X003509Y014021D01*
X003469Y013991D01*
X003426Y013964D01*
X003381Y013941D01*
X003335Y013921D01*
X003287Y013904D01*
X003239Y013892D01*
X003189Y013883D01*
X003139Y013878D01*
X003088Y013877D01*
X003038Y013880D01*
X002988Y013887D01*
X002939Y013898D01*
X002891Y013912D01*
X002844Y013930D01*
X002798Y013952D01*
X002754Y013977D01*
X002713Y014006D01*
X002674Y014037D01*
X002637Y014072D01*
X002603Y014109D01*
X002572Y014149D01*
X002544Y014191D01*
X002520Y014235D01*
X002499Y014281D01*
X002482Y014329D01*
X002469Y014377D01*
X002459Y014427D01*
X002453Y014477D01*
X002451Y014527D01*
M02*
