%YAML 1.1
%TAG !u! tag:unity3d.com,2011:
--- !u!29 &1
OcclusionCullingSettings:
  m_ObjectHideFlags: 0
  serializedVersion: 2
  m_OcclusionBakeSettings:
    smallestOccluder: 5
    smallestHole: 0.25
    backfaceThreshold: 100
  m_SceneGUID: 00000000000000000000000000000000
  m_OcclusionCullingData: {fileID: 0}
--- !u!104 &2
RenderSettings:
  m_ObjectHideFlags: 0
  serializedVersion: 9
  m_Fog: 0
  m_FogColor: {r: 0.5, g: 0.5, b: 0.5, a: 1}
  m_FogMode: 3
  m_FogDensity: 0.01
  m_LinearFogStart: 0
  m_LinearFogEnd: 300
  m_AmbientSkyColor: {r: 0.2, g: 0.2, b: 0.2, a: 1}
  m_AmbientEquatorColor: {r: 0.2, g: 0.2, b: 0.2, a: 1}
  m_AmbientGroundColor: {r: 0.2, g: 0.2, b: 0.2, a: 1}
  m_AmbientIntensity: 1
  m_AmbientMode: 3
  m_SubtractiveShadowColor: {r: 0.42, g: 0.478, b: 0.627, a: 1}
  m_SkyboxMaterial: {fileID: 0}
  m_HaloStrength: 0.5
  m_FlareStrength: 1
  m_FlareFadeSpeed: 3
  m_HaloTexture: {fileID: 0}
  m_SpotCookie: {fileID: 10001, guid: 0000000000000000e000000000000000, type: 0}
  m_DefaultReflectionMode: 0
  m_DefaultReflectionResolution: 128
  m_ReflectionBounces: 1
  m_ReflectionIntensity: 1
  m_CustomReflection: {fileID: 0}
  m_Sun: {fileID: 0}
  m_IndirectSpecularColor: {r: 0, g: 0, b: 0, a: 1}
  m_UseRadianceAmbientProbe: 0
--- !u!157 &4
LightmapSettings:
  m_ObjectHideFlags: 0
  serializedVersion: 12
  m_GIWorkflowMode: 1
  m_GISettings:
    serializedVersion: 2
    m_BounceScale: 1
    m_IndirectOutputScale: 1
    m_AlbedoBoost: 1
    m_EnvironmentLightingMode: 0
    m_EnableBakedLightmaps: 1
    m_EnableRealtimeLightmaps: 0
  m_LightmapEditorSettings:
    serializedVersion: 12
    m_Resolution: 1
    m_BakeResolution: 50
    m_AtlasSize: 1024
    m_AO: 1
    m_AOMaxDistance: 1
    m_CompAOExponent: 1
    m_CompAOExponentDirect: 0
    m_ExtractAmbientOcclusion: 0
    m_Padding: 2
    m_LightmapParameters: {fileID: 0}
    m_LightmapsBakeMode: 1
    m_TextureCompression: 0
    m_FinalGather: 0
    m_FinalGatherFiltering: 1
    m_FinalGatherRayCount: 256
    m_ReflectionCompression: 2
    m_MixedBakeMode: 1
    m_BakeBackend: 0
    m_PVRSampling: 1
    m_PVRDirectSampleCount: 32
    m_PVRSampleCount: 512
    m_PVRBounces: 2
    m_PVREnvironmentSampleCount: 512
    m_PVREnvironmentReferencePointCount: 2048
    m_PVRFilteringMode: 0
    m_PVRDenoiserTypeDirect: 0
    m_PVRDenoiserTypeIndirect: 0
    m_PVRDenoiserTypeAO: 0
    m_PVRFilterTypeDirect: 0
    m_PVRFilterTypeIndirect: 0
    m_PVRFilterTypeAO: 0
    m_PVREnvironmentMIS: 0
    m_PVRCulling: 1
    m_PVRFilteringGaussRadiusDirect: 1
    m_PVRFilteringGaussRadiusIndirect: 5
    m_PVRFilteringGaussRadiusAO: 2
    m_PVRFilteringAtrousPositionSigmaDirect: 0.5
    m_PVRFilteringAtrousPositionSigmaIndirect: 2
    m_PVRFilteringAtrousPositionSigmaAO: 1
    m_ExportTrainingData: 0
    m_TrainingDataDestination: TrainingData
    m_LightProbeSampleCountMultiplier: 4
  m_LightingDataAsset: {fileID: 0}
  m_LightingSettings: {fileID: 4890085278179872738, guid: aaa0cbfa6d52fb0878211a04ae4a82c6, type: 2}
--- !u!196 &5
NavMeshSettings:
  serializedVersion: 2
  m_ObjectHideFlags: 0
  m_BuildSettings:
    serializedVersion: 2
    agentTypeID: 0
    agentRadius: 0.5
    agentHeight: 2
    agentSlope: 45
    agentClimb: 0.4
    ledgeDropHeight: 0
    maxJumpAcrossDistance: 0
    minRegionArea: 2
    manualCellSize: 0
    cellSize: 0.16666666
    manualTileSize: 0
    tileSize: 256
    accuratePlacement: 0
    maxJobWorkers: 0
    preserveTilesOutsideBounds: 0
    debug:
      m_Flags: 0
  m_NavMeshData: {fileID: 0}
--- !u!1 &98204239
GameObject:
  m_ObjectHideFlags: 0
  m_CorrespondingSourceObject: {fileID: 0}
  m_PrefabInstance: {fileID: 0}
  m_PrefabAsset: {fileID: 0}
  serializedVersion: 6
  m_Component:
  - component: {fileID: 98204241}
  - component: {fileID: 98204240}
  m_Layer: 0
  m_Name: Directional light
  m_TagString: Untagged
  m_Icon: {fileID: 0}
  m_NavMeshLayer: 0
  m_StaticEditorFlags: 0
  m_IsActive: 1
--- !u!108 &98204240
Light:
  m_ObjectHideFlags: 0
  m_CorrespondingSourceObject: {fileID: 0}
  m_PrefabInstance: {fileID: 0}
  m_PrefabAsset: {fileID: 0}
  m_GameObject: {fileID: 98204239}
  m_Enabled: 1
  serializedVersion: 10
  m_Type: 1
  m_Shape: 0
  m_Color: {r: 1, g: 1, b: 1, a: 1}
  m_Intensity: 1.4
  m_Range: 10
  m_SpotAngle: 30
  m_InnerSpotAngle: 21.80208
  m_CookieSize: 10
  m_Shadows:
    m_Type: 0
    m_Resolution: -1
    m_CustomResolution: -1
    m_Strength: 1
    m_Bias: 0.05
    m_NormalBias: 0.4
    m_NearPlane: 0.2
    m_CullingMatrixOverride:
      e00: 1
      e01: 0
      e02: 0
      e03: 0
      e10: 0
      e11: 1
      e12: 0
      e13: 0
      e20: 0
      e21: 0
      e22: 1
      e23: 0
      e30: 0
      e31: 0
      e32: 0
      e33: 1
    m_UseCullingMatrixOverride: 0
  m_Cookie: {fileID: 0}
  m_DrawHalo: 0
  m_Flare: {fileID: 0}
  m_RenderMode: 0
  m_CullingMask:
    serializedVersion: 2
    m_Bits: 4294967295
  m_RenderingLayerMask: 1
  m_Lightmapping: 1
  m_LightShadowCasterMode: 0
  m_AreaSize: {x: 1, y: 1}
  m_BounceIntensity: 1
  m_ColorTemperature: 6570
  m_UseColorTemperature: 0
  m_BoundingSphereOverride: {x: 0, y: 0, z: 0, w: 0}
  m_UseBoundingSphereOverride: 0
  m_ShadowRadius: 0
  m_ShadowAngle: 0
--- !u!4 &98204241
Transform:
  m_ObjectHideFlags: 0
  m_CorrespondingSourceObject: {fileID: 0}
  m_PrefabInstance: {fileID: 0}
  m_PrefabAsset: {fileID: 0}
  m_GameObject: {fileID: 98204239}
  m_LocalRotation: {x: 0.40821794, y: -0.23456973, z: 0.109381676, w: 0.87542605}
  m_LocalPosition: {x: 2.351798, y: 6.4029236, z: 7.1672544}
  m_LocalScale: {x: 1, y: 1, z: 1}
  m_Children:
  - {fileID: 802942458}
  - {fileID: 1891617102}
  m_Father: {fileID: 0}
  m_RootOrder: 1
  m_LocalEulerAnglesHint: {x: 0, y: 0, z: 0}
--- !u!1001 &800433642
PrefabInstance:
  m_ObjectHideFlags: 0
  serializedVersion: 2
  m_Modification:
    m_TransformParent: {fileID: 0}
    m_Modifications:
    - target: {fileID: 400000, guid: 84376f2a0948947b5a6dfe814a1100a0, type: 3}
      propertyPath: m_LocalPosition.x
      value: 3.02999997
      objectReference: {fileID: 0}
    - target: {fileID: 400000, guid: 84376f2a0948947b5a6dfe814a1100a0, type: 3}
      propertyPath: m_LocalPosition.y
      value: 8.07999992
      objectReference: {fileID: 0}
    - target: {fileID: 400000, guid: 84376f2a0948947b5a6dfe814a1100a0, type: 3}
      propertyPath: m_LocalPosition.z
      value: 5.5
      objectReference: {fileID: 0}
    - target: {fileID: 400000, guid: 84376f2a0948947b5a6dfe814a1100a0, type: 3}
      propertyPath: m_LocalRotation.x
      value: -.00384809822
      objectReference: {fileID: 0}
    - target: {fileID: 400000, guid: 84376f2a0948947b5a6dfe814a1100a0, type: 3}
      propertyPath: m_LocalRotation.y
      value: .247222841
      objectReference: {fileID: 0}
    - target: {fileID: 400000, guid: 84376f2a0948947b5a6dfe814a1100a0, type: 3}
      propertyPath: m_LocalRotation.z
      value: -.0332436226
      objectReference: {fileID: 0}
    - target: {fileID: 400000, guid: 84376f2a0948947b5a6dfe814a1100a0, type: 3}
      propertyPath: m_LocalRotation.w
      value: -.96838057
      objectReference: {fileID: 0}
    m_RemovedComponents: []
  m_SourcePrefab: {fileID: 100100000, guid: 84376f2a0948947b5a6dfe814a1100a0, type: 3}
--- !u!1 &802942457
GameObject:
  m_ObjectHideFlags: 0
  m_CorrespondingSourceObject: {fileID: 0}
  m_PrefabInstance: {fileID: 0}
  m_PrefabAsset: {fileID: 0}
  serializedVersion: 6
  m_Component:
  - component: {fileID: 802942458}
  - component: {fileID: 802942459}
  m_Layer: 0
  m_Name: Directional light
  m_TagString: Untagged
  m_Icon: {fileID: 0}
  m_NavMeshLayer: 0
  m_StaticEditorFlags: 0
  m_IsActive: 1
--- !u!4 &802942458
Transform:
  m_ObjectHideFlags: 0
  m_CorrespondingSourceObject: {fileID: 0}
  m_PrefabInstance: {fileID: 0}
  m_PrefabAsset: {fileID: 0}
  m_GameObject: {fileID: 802942457}
  m_LocalRotation: {x: 0.030858051, y: 0.41387957, z: -0.5375761, w: 0.7340051}
  m_LocalPosition: {x: 0, y: 0, z: 0}
  m_LocalScale: {x: 1, y: 1, z: 1}
  m_Children: []
  m_Father: {fileID: 98204241}
  m_RootOrder: 0
  m_LocalEulerAnglesHint: {x: 0, y: 0, z: 0}
--- !u!108 &802942459
Light:
  m_ObjectHideFlags: 0
  m_CorrespondingSourceObject: {fileID: 0}
  m_PrefabInstance: {fileID: 0}
  m_PrefabAsset: {fileID: 0}
  m_GameObject: {fileID: 802942457}
  m_Enabled: 1
  serializedVersion: 10
  m_Type: 1
  m_Shape: 0
  m_Color: {r: 1, g: 1, b: 1, a: 1}
  m_Intensity: 0.6
  m_Range: 10
  m_SpotAngle: 30
  m_InnerSpotAngle: 21.80208
  m_CookieSize: 10
  m_Shadows:
    m_Type: 0
    m_Resolution: -1
    m_CustomResolution: -1
    m_Strength: 1
    m_Bias: 0.05
    m_NormalBias: 0.4
    m_NearPlane: 0.2
    m_CullingMatrixOverride:
      e00: 1
      e01: 0
      e02: 0
      e03: 0
      e10: 0
      e11: 1
      e12: 0
      e13: 0
      e20: 0
      e21: 0
      e22: 1
      e23: 0
      e30: 0
      e31: 0
      e32: 0
      e33: 1
    m_UseCullingMatrixOverride: 0
  m_Cookie: {fileID: 0}
  m_DrawHalo: 0
  m_Flare: {fileID: 0}
  m_RenderMode: 0
  m_CullingMask:
    serializedVersion: 2
    m_Bits: 4294967295
  m_RenderingLayerMask: 1
  m_Lightmapping: 1
  m_LightShadowCasterMode: 0
  m_AreaSize: {x: 1, y: 1}
  m_BounceIntensity: 1
  m_ColorTemperature: 6570
  m_UseColorTemperature: 0
  m_BoundingSphereOverride: {x: 0, y: 0, z: 0, w: 0}
  m_UseBoundingSphereOverride: 0
  m_ShadowRadius: 0
  m_ShadowAngle: 0
--- !u!1001 &1211949768
PrefabInstance:
  m_ObjectHideFlags: 0
  serializedVersion: 2
  m_Modification:
    m_TransformParent: {fileID: 0}
    m_Modifications:
    - target: {fileID: 400000, guid: a2d308598386f4a0797f87a4b95b9dd1, type: 3}
      propertyPath: m_LocalPosition.x
      value: .047662735
      objectReference: {fileID: 0}
    - target: {fileID: 400000, guid: a2d308598386f4a0797f87a4b95b9dd1, type: 3}
      propertyPath: m_LocalPosition.y
      value: 10.4099998
      objectReference: {fileID: 0}
    - target: {fileID: 400000, guid: a2d308598386f4a0797f87a4b95b9dd1, type: 3}
      propertyPath: m_LocalPosition.z
      value: 3.2946887
      objectReference: {fileID: 0}
    - target: {fileID: 400000, guid: a2d308598386f4a0797f87a4b95b9dd1, type: 3}
      propertyPath: m_LocalRotation.x
      value: -.13452132
      objectReference: {fileID: 0}
    - target: {fileID: 400000, guid: a2d308598386f4a0797f87a4b95b9dd1, type: 3}
      propertyPath: m_LocalRotation.y
      value: -.413260669
      objectReference: {fileID: 0}
    - target: {fileID: 400000, guid: a2d308598386f4a0797f87a4b95b9dd1, type: 3}
      propertyPath: m_LocalRotation.z
      value: .0618728362
      objectReference: {fileID: 0}
    - target: {fileID: 400000, guid: a2d308598386f4a0797f87a4b95b9dd1, type: 3}
      propertyPath: m_LocalRotation.w
      value: -.898493946
      objectReference: {fileID: 0}
    m_RemovedComponents: []
  m_SourcePrefab: {fileID: 100100000, guid: a2d308598386f4a0797f87a4b95b9dd1, type: 3}
--- !u!1001 &1877414533
PrefabInstance:
  m_ObjectHideFlags: 0
  serializedVersion: 2
  m_Modification:
    m_TransformParent: {fileID: 0}
    m_Modifications:
    - target: {fileID: 400000, guid: 24be8e1643b8a474fbb57fcda8a1c454, type: 3}
      propertyPath: m_LocalPosition.x
      value: -3.5999999
      objectReference: {fileID: 0}
    - target: {fileID: 400000, guid: 24be8e1643b8a474fbb57fcda8a1c454, type: 3}
      propertyPath: m_LocalPosition.y
      value: 11.75
      objectReference: {fileID: 0}
    - target: {fileID: 400000, guid: 24be8e1643b8a474fbb57fcda8a1c454, type: 3}
      propertyPath: m_LocalPosition.z
      value: 5.88999987
      objectReference: {fileID: 0}
    - target: {fileID: 400000, guid: 24be8e1643b8a474fbb57fcda8a1c454, type: 3}
      propertyPath: m_LocalRotation.x
      value: .301824033
      objectReference: {fileID: 0}
    - target: {fileID: 400000, guid: 24be8e1643b8a474fbb57fcda8a1c454, type: 3}
      propertyPath: m_LocalRotation.y
      value: -.696567714
      objectReference: {fileID: 0}
    - target: {fileID: 400000, guid: 24be8e1643b8a474fbb57fcda8a1c454, type: 3}
      propertyPath: m_LocalRotation.z
      value: -.487742066
      objectReference: {fileID: 0}
    - target: {fileID: 400000, guid: 24be8e1643b8a474fbb57fcda8a1c454, type: 3}
      propertyPath: m_LocalRotation.w
      value: -.431049287
      objectReference: {fileID: 0}
    - target: {fileID: 400000, guid: 24be8e1643b8a474fbb57fcda8a1c454, type: 3}
      propertyPath: m_LocalScale.x
      value: 1
      objectReference: {fileID: 0}
    m_RemovedComponents: []
  m_SourcePrefab: {fileID: 100100000, guid: 24be8e1643b8a474fbb57fcda8a1c454, type: 3}
--- !u!1 &1891617100
GameObject:
  m_ObjectHideFlags: 0
  m_CorrespondingSourceObject: {fileID: 0}
  m_PrefabInstance: {fileID: 0}
  m_PrefabAsset: {fileID: 0}
  serializedVersion: 6
  m_Component:
  - component: {fileID: 1891617102}
  - component: {fileID: 1891617101}
  m_Layer: 0
  m_Name: Directional light
  m_TagString: Untagged
  m_Icon: {fileID: 0}
  m_NavMeshLayer: 0
  m_StaticEditorFlags: 0
  m_IsActive: 1
--- !u!108 &1891617101
Light:
  m_ObjectHideFlags: 0
  m_CorrespondingSourceObject: {fileID: 0}
  m_PrefabInstance: {fileID: 0}
  m_PrefabAsset: {fileID: 0}
  m_GameObject: {fileID: 1891617100}
  m_Enabled: 1
  serializedVersion: 10
  m_Type: 1
  m_Shape: 0
  m_Color: {r: 1, g: 1, b: 1, a: 1}
  m_Intensity: 0.4
  m_Range: 10
  m_SpotAngle: 30
  m_InnerSpotAngle: 21.80208
  m_CookieSize: 10
  m_Shadows:
    m_Type: 0
    m_Resolution: -1
    m_CustomResolution: -1
    m_Strength: 1
    m_Bias: 0.05
    m_NormalBias: 0.4
    m_NearPlane: 0.2
    m_CullingMatrixOverride:
      e00: 1
      e01: 0
      e02: 0
      e03: 0
      e10: 0
      e11: 1
      e12: 0
      e13: 0
      e20: 0
      e21: 0
      e22: 1
      e23: 0
      e30: 0
      e31: 0
      e32: 0
      e33: 1
    m_UseCullingMatrixOverride: 0
  m_Cookie: {fileID: 0}
  m_DrawHalo: 0
  m_Flare: {fileID: 0}
  m_RenderMode: 0
  m_CullingMask:
    serializedVersion: 2
    m_Bits: 4294967295
  m_RenderingLayerMask: 1
  m_Lightmapping: 1
  m_LightShadowCasterMode: 0
  m_AreaSize: {x: 1, y: 1}
  m_BounceIntensity: 1
  m_ColorTemperature: 6570
  m_UseColorTemperature: 0
  m_BoundingSphereOverride: {x: 0, y: 0, z: 0, w: 0}
  m_UseBoundingSphereOverride: 0
  m_ShadowRadius: 0
  m_ShadowAngle: 0
--- !u!4 &1891617102
Transform:
  m_ObjectHideFlags: 0
  m_CorrespondingSourceObject: {fileID: 0}
  m_PrefabInstance: {fileID: 0}
  m_PrefabAsset: {fileID: 0}
  m_GameObject: {fileID: 1891617100}
  m_LocalRotation: {x: -0.7358717, y: 0.027948113, z: -0.16833162, w: 0.6552681}
  m_LocalPosition: {x: 0, y: 0, z: 0}
  m_LocalScale: {x: 1, y: 1, z: 1}
  m_Children: []
  m_Father: {fileID: 98204241}
  m_RootOrder: 1
  m_LocalEulerAnglesHint: {x: 0, y: 0, z: 0}
--- !u!1001 &1962195452
PrefabInstance:
  m_ObjectHideFlags: 0
  serializedVersion: 2
  m_Modification:
    m_TransformParent: {fileID: 0}
    m_Modifications:
    - target: {fileID: 400000, guid: 7b5f2f9ea19c74c659ab8ac969280fb2, type: 3}
      propertyPath: m_LocalPosition.x
      value: 2.5999999
      objectReference: {fileID: 0}
    - target: {fileID: 400000, guid: 7b5f2f9ea19c74c659ab8ac969280fb2, type: 3}
      propertyPath: m_LocalPosition.y
      value: 10.9499998
      objectReference: {fileID: 0}
    - target: {fileID: 400000, guid: 7b5f2f9ea19c74c659ab8ac969280fb2, type: 3}
      propertyPath: m_LocalPosition.z
      value: 5.01909685
      objectReference: {fileID: 0}
    - target: {fileID: 400000, guid: 7b5f2f9ea19c74c659ab8ac969280fb2, type: 3}
      propertyPath: m_LocalRotation.x
      value: -7.25797591e-08
      objectReference: {fileID: 0}
    - target: {fileID: 400000, guid: 7b5f2f9ea19c74c659ab8ac969280fb2, type: 3}
      propertyPath: m_LocalRotation.y
      value: -.96214664
      objectReference: {fileID: 0}
    - target: {fileID: 400000, guid: 7b5f2f9ea19c74c659ab8ac969280fb2, type: 3}
      propertyPath: m_LocalRotation.z
      value: 2.56235182e-07
      objectReference: {fileID: 0}
    - target: {fileID: 400000, guid: 7b5f2f9ea19c74c659ab8ac969280fb2, type: 3}
      propertyPath: m_LocalRotation.w
      value: -.272532344
      objectReference: {fileID: 0}
    m_RemovedComponents: []
  m_SourcePrefab: {fileID: 100100000, guid: 7b5f2f9ea19c74c659ab8ac969280fb2, type: 3}
--- !u!1 &2004933234
GameObject:
  m_ObjectHideFlags: 0
  m_CorrespondingSourceObject: {fileID: 0}
  m_PrefabInstance: {fileID: 0}
  m_PrefabAsset: {fileID: 0}
  serializedVersion: 6
  m_Component:
  - component: {fileID: 2004933240}
  - component: {fileID: 2004933239}
  - component: {fileID: 2004933237}
  - component: {fileID: 2004933236}
  m_Layer: 0
  m_Name: Main Camera
  m_TagString: MainCamera
  m_Icon: {fileID: 0}
  m_NavMeshLayer: 0
  m_StaticEditorFlags: 0
  m_IsActive: 1
--- !u!81 &2004933236
AudioListener:
  m_ObjectHideFlags: 0
  m_CorrespondingSourceObject: {fileID: 0}
  m_PrefabInstance: {fileID: 0}
  m_PrefabAsset: {fileID: 0}
  m_GameObject: {fileID: 2004933234}
  m_Enabled: 1
--- !u!124 &2004933237
Behaviour:
  m_ObjectHideFlags: 0
  m_CorrespondingSourceObject: {fileID: 0}
  m_PrefabInstance: {fileID: 0}
  m_PrefabAsset: {fileID: 0}
  m_GameObject: {fileID: 2004933234}
  m_Enabled: 1
--- !u!20 &2004933239
Camera:
  m_ObjectHideFlags: 0
  m_CorrespondingSourceObject: {fileID: 0}
  m_PrefabInstance: {fileID: 0}
  m_PrefabAsset: {fileID: 0}
  m_GameObject: {fileID: 2004933234}
  m_Enabled: 1
  serializedVersion: 2
  m_ClearFlags: 1
  m_BackGroundColor: {r: 0.5294118, g: 0.5294118, b: 0.5294118, a: 0.019607844}
  m_projectionMatrixMode: 1
  m_GateFitMode: 2
  m_FOVAxisMode: 0
  m_SensorSize: {x: 36, y: 24}
  m_LensShift: {x: 0, y: 0}
  m_FocalLength: 50
  m_NormalizedViewPortRect:
    serializedVersion: 2
    x: 0
    y: 0
    width: 1
    height: 1
  near clip plane: 0.3
  far clip plane: 1000
  field of view: 64
  orthographic: 0
  orthographic size: 5
  m_Depth: -1
  m_CullingMask:
    serializedVersion: 2
    m_Bits: 4294967295
  m_RenderingPath: -1
  m_TargetTexture: {fileID: 0}
  m_TargetDisplay: 0
  m_TargetEye: 3
  m_HDR: 0
  m_AllowMSAA: 1
  m_AllowDynamicResolution: 0
  m_ForceIntoRT: 0
  m_OcclusionCulling: 1
  m_StereoConvergence: 10
  m_StereoSeparation: 0.022
--- !u!4 &2004933240
Transform:
  m_ObjectHideFlags: 0
  m_CorrespondingSourceObject: {fileID: 0}
  m_PrefabInstance: {fileID: 0}
  m_PrefabAsset: {fileID: 0}
  m_GameObject: {fileID: 2004933234}
  m_LocalRotation: {x: 0, y: 0, z: 0, w: 1}
  m_LocalPosition: {x: 0, y: 9.38, z: -0.36969566}
  m_LocalScale: {x: 1, y: 1, z: 1}
  m_Children: []
  m_Father: {fileID: 0}
  m_RootOrder: 2
  m_LocalEulerAnglesHint: {x: 0, y: 0, z: 0}
--- !u!1001 &2073518251
PrefabInstance:
  m_ObjectHideFlags: 0
  serializedVersion: 2
  m_Modification:
    m_TransformParent: {fileID: 0}
    m_Modifications:
    - target: {fileID: 400000, guid: d9d1fbfcf69364ffd8f9c6ade9ce90fe, type: 3}
      propertyPath: m_LocalPosition.x
      value: -2.93311119
      objectReference: {fileID: 0}
    - target: {fileID: 400000, guid: d9d1fbfcf69364ffd8f9c6ade9ce90fe, type: 3}
      propertyPath: m_LocalPosition.y
      value: 6.88999987
      objectReference: {fileID: 0}
    - target: {fileID: 400000, guid: d9d1fbfcf69364ffd8f9c6ade9ce90fe, type: 3}
      propertyPath: m_LocalPosition.z
      value: 7.83771706
      objectReference: {fileID: 0}
    - target: {fileID: 400000, guid: d9d1fbfcf69364ffd8f9c6ade9ce90fe, type: 3}
      propertyPath: m_LocalRotation.x
      value: 2.46565463e-07
      objectReference: {fileID: 0}
    - target: {fileID: 400000, guid: d9d1fbfcf69364ffd8f9c6ade9ce90fe, type: 3}
      propertyPath: m_LocalRotation.y
      value: -.925837517
      objectReference: {fileID: 0}
    - target: {fileID: 400000, guid: d9d1fbfcf69364ffd8f9c6ade9ce90fe, type: 3}
      propertyPath: m_LocalRotation.z
      value: 1.00646687e-07
      objectReference: {fileID: 0}
    - target: {fileID: 400000, guid: d9d1fbfcf69364ffd8f9c6ade9ce90fe, type: 3}
      propertyPath: m_LocalRotation.w
      value: -.377921849
      objectReference: {fileID: 0}
    m_RemovedComponents: []
  m_SourcePrefab: {fileID: 100100000, guid: d9d1fbfcf69364ffd8f9c6ade9ce90fe, type: 3}
