0,0,0
0,0,0
0,0,281.97637828368374
0,0,201.50132312937495
0,0,140.71036230857135
0,0,81.52873146807832
0.1750030517578125,0.6750030517578125,40.82523381475327
0.1750030517578125,0.6750030517578125,18.43494882292201
0.1750030517578125,0.6750030517578125,90.0
0.1750030517578125,1.1750030517578125,130.6012946450045
0.1750030517578125,1.1750030517578125,105.22163716601153
0.1750030517578125,1.6750030517578125,63.43494882292201
0.1750030517578125,2.1750030517578125,135.0
0.1750030517578125,2.6750030517578125,45.0
0.1750030517578125,2.6750030517578125,50.19442890773481
0.1750030517578125,3.1750030517578125,116.56505117707799
0.1750030517578125,3.6750030517578125,83.3797400424064
0.1750030517578125,4.1750030517578125,45.0
0.1750030517578125,3.6750030517578125,45.0
-0.3249969482421875,3.6750030517578125,135.0
-0.8249969482421875,3.6750030517578125,138.6869897645844
-1.3249969482421875,3.6750030517578125,141.27430319041991
-1.8249969482421875,3.6750030517578125,141.89290291166526
-1.8249969482421875,3.1750030517578125,138.44645145583263
-2.3249969482421875,3.1750030517578125,126.86989764584402
-2.3249969482421875,2.6750030517578125,151.84706825934663
-2.3249969482421875,2.1750030517578125,171.57850036668341
-2.8249969482421875,2.1750030517578125,180.0
-2.8249969482421875,1.6750030517578125,175.32125217735785
-2.8249969482421875,1.1750030517578125,164.3781005001399
-2.8249969482421875,1.1750030517578125,143.13010235415598
-2.8249969482421875,0.6750030517578125,210.96375653207352
-2.8249969482421875,0.6750030517578125,141.34019174590992
-3.3249969482421875,0.6750030517578125,254.05460409907715
-3.3249969482421875,0.1750030517578125,197.69739792249354
-3.3249969482421875,-0.3249969482421875,135.0
-3.3249969482421875,-0.8249969482421875,135.0
-3.3249969482421875,-1.3249969482421875,169.67874782264215
-2.8249969482421875,-1.3249969482421875,201.40442508839908
-2.3249969482421875,-1.3249969482421875,225.0
-2.3249969482421875,-1.3249969482421875,233.13010235415598
-2.3249969482421875,-1.8249969482421875,270.0
-2.3249969482421875,-2.3249969482421875,268.1075355583949
-2.3249969482421875,-2.8249969482421875,265.7531685502911
-1.8249969482421875,-2.8249969482421875,262.49003121088526
-1.3249969482421875,-2.8249969482421875,252.96249001690364
-1.3249969482421875,-2.8249969482421875,233.13010235415598
-0.8249969482421875,-2.8249969482421875,315.0
-0.8249969482421875,-3.3249969482421875,231.3401917459099
-0.3249969482421875,-3.3249969482421875,231.3401917459099
0.1750030517578125,-3.3249969482421875,225.0
0.1750030517578125,-3.8249969482421875,225.0
0.6750030517578125,-3.8249969482421875,315.0
1.1750030517578125,-3.8249969482421875,324.0
1.6750030517578125,-3.8249969482421875,333.0
1.6750030517578125,-3.3249969482421875,342.0
1.6750030517578125,-2.8249969482421875,341.782525588539
1.6750030517578125,-2.3249969482421875,326.30993247402023
2.1750030517578125,-2.3249969482421875,0.0
2.6750030517578125,-2.3249969482421875,358.1075355583949
3.1750030517578125,-2.3249969482421875,355.7531685502911
3.1750030517578125,-1.8249969482421875,352.49003121088526
3.1750030517578125,-1.3249969482421875,342.96249001690364
3.1750030517578125,-1.3249969482421875,323.13010235415595
3.1750030517578125,-0.8249969482421875,45.0
3.6750030517578125,-0.8249969482421875,321.3401917459099
3.6750030517578125,-0.3249969482421875,321.3401917459099
3.6750030517578125,0.1750030517578125,315.0
3.6750030517578125,0.6750030517578125,336.6869897645844
3.6750030517578125,1.1750030517578125,357.2743031904199
3.6750030517578125,1.6750030517578125,15.89290291166526
3.1750030517578125,1.6750030517578125,30.44645145583263
3.6750030517578125,1.6750030517578125,36.86989764584402
4.1750030517578125,1.6750030517578125,34.23633352828373
4.6750030517578125,1.6750030517578125,32.163846187961745
5.1750030517578125,1.6750030517578125,31.044087185784996
5.6750030517578125,1.6750030517578125,31.705582270833695
6.1750030517578125,1.6750030517578125,36.137054847222466
6.6750030517578125,1.6750030517578125,49.78600183507224
6.6750030517578125,1.6750030517578125,90.0
7.1750030517578125,1.6750030517578125,333.434948822922
7.6750030517578125,1.6750030517578125,90.0
7.6750030517578125,2.1750030517578125,90.0
7.6750030517578125,2.6750030517578125,91.89246444160513
7.6750030517578125,3.1750030517578125,94.2468314497089
8.175003051757812,3.1750030517578125,97.50996878911477
8.175003051757812,3.6750030517578125,107.03750998309638
8.175003051757812,3.6750030517578125,123.69006752597979
8.175003051757812,4.1750030517578125,30.96375653207352
8.175003051757812,4.6750030517578125,123.69006752597979
8.175003051757812,5.1750030517578125,123.69006752597979
8.175003051757812,5.6750030517578125,135.0
8.175003051757812,6.1750030517578125,135.0
8.175003051757812,6.6750030517578125,153.434948822922
8.175003051757812,6.6750030517578125,180.0
8.175003051757812,7.1750030517578125,78.69006752597979
8.175003051757812,7.6750030517578125,213.69006752597977
8.175003051757812,7.6750030517578125,180.0
7.6750030517578125,7.6750030517578125,9.462322208025617
7.1750030517578125,7.6750030517578125,325.6058025230008
7.1750030517578125,8.175003051757812,283.21551795630785
7.1750030517578125,8.675003051757812,248.4527927411438
7.1750030517578125,8.675003051757812,225.0
7.1750030517578125,9.175003051757812,135.0
7.1750030517578125,9.175003051757812,218.65980825409008
7.1750030517578125,9.175003051757812,90.0
6.6750030517578125,9.175003051757812,45.0
6.6750030517578125,9.675003051757812,131.82990412704504
6.6750030517578125,10.175003051757812,225.0
6.6750030517578125,10.175003051757812,225.0
6.6750030517578125,10.675003051757812,135.0
6.6750030517578125,10.675003051757812,90.0
6.6750030517578125,11.175003051757812,35.53767779197438
6.6750030517578125,11.675003051757812,38.65980825409009
7.1750030517578125,11.675003051757812,135.0
7.6750030517578125,11.675003051757812,0.0
8.175003051757812,11.675003051757812,0.0
8.675003051757812,11.675003051757812,0.0
9.175003051757812,11.675003051757812,333.434948822922
9.175003051757812,11.175003051757812,333.434948822922
9.675003051757812,11.175003051757812,0.0
9.675003051757812,10.675003051757812,30.96375653207352
10.175003051757812,10.675003051757812,352.98187826603674
10.675003051757812,10.675003051757812,310.6012946450045
10.675003051757812,10.175003051757812,302.0053832080835
10.675003051757812,9.675003051757812,300.19193919774835
10.675003051757812,9.175003051757812,299.62327164841275
10.675003051757812,8.675003051757812,302.0053832080835
10.675003051757812,8.175003051757812,300.19193919774835
10.675003051757812,7.6750030517578125,299.62327164841275
10.675003051757812,7.1750030517578125,302.0053832080835
10.675003051757812,6.6750030517578125,302.0053832080835
10.675003051757812,6.1750030517578125,296.565051177078
10.675003051757812,5.6750030517578125,288.434948822922
10.675003051757812,5.1750030517578125,288.434948822922
10.675003051757812,4.6750030517578125,303.69006752597977
10.675003051757812,4.1750030517578125,303.69006752597977
10.675003051757812,3.6750030517578125,306.1749378900349
10.675003051757812,3.1750030517578125,315.0
11.175003051757812,3.1750030517578125,315.0
11.175003051757812,2.6750030517578125,288.434948822922
11.175003051757812,2.1750030517578125,276.3401917459099
11.175003051757812,1.6750030517578125,270.0
11.175003051757812,1.1750030517578125,270.0
11.175003051757812,0.6750030517578125,283.282525588539
11.175003051757812,0.1750030517578125,300.9637565320735
11.175003051757812,-0.3249969482421875,300.9637565320735
11.175003051757812,-0.8249969482421875,303.91682708895877
11.175003051757812,-0.8249969482421875,315.0
11.175003051757812,-1.3249969482421875,231.3401917459099
11.175003051757812,-1.8249969482421875,306.86989764584405
11.175003051757812,-2.3249969482421875,301.717474411461
11.175003051757812,-2.8249969482421875,300.9637565320735
11.175003051757812,-2.8249969482421875,315.0
11.175003051757812,-3.3249969482421875,236.30993247402023
11.175003051757812,-3.8249969482421875,306.86989764584405
11.175003051757812,-4.3249969482421875,306.86989764584405
11.175003051757812,-4.8249969482421875,315.0
11.175003051757812,-4.8249969482421875,315.0
11.175003051757812,-4.8249969482421875,261.86989764584405
11.175003051757812,-5.3249969482421875,219.80557109226518
11.175003051757812,-5.8249969482421875,300.9637565320735
11.175003051757812,-6.3249969482421875,300.9637565320735
11.175003051757812,-6.8249969482421875,303.91682708895877
11.175003051757812,-6.8249969482421875,315.0
11.175003051757812,-7.3249969482421875,236.30993247402023
11.175003051757812,-7.3249969482421875,303.69006752597977
11.175003051757812,-7.8249969482421875,186.3401917459099
11.175003051757812,-7.8249969482421875,243.43494882292202
11.175003051757812,-8.324996948242188,282.5288077091515
11.175003051757812,-8.324996948242188,243.43494882292202
11.175003051757812,-8.824996948242188,198.434948822922
11.175003051757812,-8.824996948242188,198.434948822922
11.175003051757812,-9.324996948242188,243.43494882292202
11.175003051757812,-9.324996948242188,243.43494882292202
11.175003051757812,-9.324996948242188,198.434948822922
10.675003051757812,-9.324996948242188,300.9637565320735
10.675003051757812,-9.324996948242188,229.3987053549955
10.675003051757812,-9.824996948242188,186.3401917459099
10.675003051757812,-10.324996948242188,198.434948822922
10.675003051757812,-10.824996948242188,198.434948822922
10.175003051757812,-10.824996948242188,198.434948822922
10.175003051757812,-10.324996948242188,206.565051177078
10.175003051757812,-9.824996948242188,161.565051177078
10.175003051757812,-9.824996948242188,161.565051177078
9.675003051757812,-9.824996948242188,220.60129464500446
9.675003051757812,-9.824996948242188,180.0
9.675003051757812,-9.324996948242188,139.39870535499554
9.175003051757812,-9.324996948242188,161.565051177078
9.175003051757812,-9.324996948242188,180.0
9.175003051757812,-9.824996948242188,212.0053832080835
9.175003051757812,-9.824996948242188,198.434948822922
9.175003051757812,-10.324996948242188,147.9946167919165
9.175003051757812,-10.824996948242188,198.434948822922
8.675003051757812,-10.824996948242188,198.434948822922
8.675003051757812,-10.324996948242188,130.6012946450045
8.675003051757812,-9.824996948242188,161.565051177078
8.675003051757812,-9.824996948242188,161.565051177078
8.175003051757812,-9.824996948242188,225.0
8.175003051757812,-9.824996948242188,220.60129464500446
8.175003051757812,-9.324996948242188,180.0
7.6750030517578125,-9.324996948242188,161.565051177078
7.6750030517578125,-9.824996948242188,153.9374918255491
7.6750030517578125,-9.824996948242188,140.19442890773482
7.1750030517578125,-9.824996948242188,206.565051177078
7.1750030517578125,-10.324996948242188,225.0
6.6750030517578125,-10.324996948242188,135.0
6.6750030517578125,-10.324996948242188,135.0
6.6750030517578125,-9.824996948242188,206.565051177078
6.6750030517578125,-9.824996948242188,220.60129464500446
6.1750030517578125,-9.824996948242188,135.0
6.1750030517578125,-10.324996948242188,180.0
6.1750030517578125,-10.824996948242188,198.434948822922
5.6750030517578125,-10.824996948242188,198.434948822922
5.6750030517578125,-10.324996948242188,180.0
5.1750030517578125,-10.324996948242188,161.565051177078
4.6750030517578125,-10.324996948242188,180.0
4.6750030517578125,-9.824996948242188,199.90278554613258
4.1750030517578125,-9.824996948242188,225.0
4.1750030517578125,-9.824996948242188,225.0
4.1750030517578125,-10.324996948242188,180.0
4.1750030517578125,-10.324996948242188,198.434948822922
4.1750030517578125,-10.824996948242188,220.60129464500446
4.1750030517578125,-11.324996948242188,212.0053832080835
3.6750030517578125,-11.324996948242188,198.434948822922
3.6750030517578125,-10.824996948242188,186.3401917459099
3.6750030517578125,-10.324996948242188,161.565051177078
3.1750030517578125,-10.324996948242188,161.565051177078
3.1750030517578125,-10.324996948242188,180.0
2.6750030517578125,-10.324996948242188,90.0
2.6750030517578125,-10.324996948242188,180.0
2.6750030517578125,-10.824996948242188,220.60129464500446
2.1750030517578125,-10.824996948242188,198.434948822922
2.1750030517578125,-10.824996948242188,180.0
2.1750030517578125,-10.324996948242188,147.9946167919165
2.1750030517578125,-10.324996948242188,161.565051177078
1.6750030517578125,-10.324996948242188,212.0053832080835
1.6750030517578125,-10.824996948242188,186.3401917459099
1.1750030517578125,-10.824996948242188,198.434948822922
1.1750030517578125,-10.824996948242188,180.0
1.1750030517578125,-10.324996948242188,147.9946167919165
1.1750030517578125,-9.824996948242188,161.565051177078
1.1750030517578125,-9.324996948242188,161.565051177078
1.1750030517578125,-8.824996948242188,161.565051177078
0.6750030517578125,-8.824996948242188,161.565051177078
0.1750030517578125,-8.824996948242188,173.6598082540901
0.1750030517578125,-8.824996948242188,180.0
0.1750030517578125,-9.324996948242188,237.99461679191648
0.1750030517578125,-9.324996948242188,229.3987053549955
0.1750030517578125,-9.824996948242188,198.434948822922
0.1750030517578125,-10.324996948242188,198.434948822922
0.1750030517578125,-10.824996948242188,198.434948822922
-0.3249969482421875,-10.824996948242188,198.434948822922
-0.3249969482421875,-10.324996948242188,180.0
-0.3249969482421875,-9.824996948242188,161.565051177078
-0.3249969482421875,-9.324996948242188,161.565051177078
-0.8249969482421875,-9.324996948242188,161.565051177078
-0.8249969482421875,-9.824996948242188,180.0
-0.8249969482421875,-10.324996948242188,198.434948822922
-0.8249969482421875,-10.824996948242188,198.434948822922
-1.3249969482421875,-10.824996948242188,198.434948822922
-1.3249969482421875,-10.324996948242188,130.6012946450045
-1.3249969482421875,-9.824996948242188,161.565051177078
-1.3249969482421875,-9.824996948242188,161.565051177078
-1.8249969482421875,-9.824996948242188,225.0
-1.8249969482421875,-9.824996948242188,220.60129464500446
-1.8249969482421875,-10.324996948242188,180.0
-1.8249969482421875,-10.324996948242188,198.434948822922
-1.8249969482421875,-10.824996948242188,139.39870535499554
-2.3249969482421875,-10.824996948242188,198.434948822922
-2.3249969482421875,-10.324996948242188,180.0
-2.8249969482421875,-10.324996948242188,161.565051177078
-3.3249969482421875,-10.324996948242188,135.0
-3.3249969482421875,-10.324996948242188,135.0
-3.3249969482421875,-9.824996948242188,225.0
-3.3249969482421875,-9.824996948242188,225.0
-3.8249969482421875,-9.824996948242188,147.9946167919165
-3.8249969482421875,-9.824996948242188,135.0
-3.8249969482421875,-10.324996948242188,186.3401917459099
-3.8249969482421875,-10.824996948242188,198.434948822922
-4.3249969482421875,-10.824996948242188,198.434948822922
-4.3249969482421875,-10.324996948242188,180.0
-4.3249969482421875,-9.824996948242188,161.565051177078
-4.3249969482421875,-9.324996948242188,161.565051177078
-4.3249969482421875,-8.824996948242188,161.565051177078
-4.8249969482421875,-8.824996948242188,161.565051177078
-4.8249969482421875,-8.324996948242188,144.46232220802563
-5.3249969482421875,-8.324996948242188,143.92883554548928
-5.8249969482421875,-8.324996948242188,142.65328761041937
-6.3249969482421875,-8.324996948242188,140.32104105103116
-6.8249969482421875,-8.324996948242188,136.44958414723962
-6.8249969482421875,-8.324996948242188,130.28754048201768
-6.8249969482421875,-7.8249969482421875,189.46232220802563
-7.3249969482421875,-7.8249969482421875,165.16323186437643
-7.8249969482421875,-7.8249969482421875,134.59973766615144
-7.8249969482421875,-7.3249969482421875,90.0
-7.8249969482421875,-6.8249969482421875,87.17251688149494
-8.324996948242188,-6.8249969482421875,83.4362634316878
-8.324996948242188,-6.3249969482421875,73.43560612730491
-8.324996948242188,-5.8249969482421875,56.309932474020215
-8.324996948242188,-5.3249969482421875,56.309932474020215
-8.324996948242188,-4.8249969482421875,56.309932474020215
-8.324996948242188,-4.3249969482421875,45.0
-8.324996948242188,-4.3249969482421875,45.0
-8.324996948242188,-4.8249969482421875,168.6900675259798
-8.324996948242188,-5.3249969482421875,198.434948822922
-8.324996948242188,-5.8249969482421875,198.434948822922
-8.324996948242188,-6.3249969482421875,198.434948822922
-8.324996948242188,-6.8249969482421875,198.434948822922
-8.324996948242188,-6.8249969482421875,198.434948822922
-8.324996948242188,-7.3249969482421875,257.4711922908485
-8.324996948242188,-7.8249969482421875,198.434948822922
-8.324996948242188,-8.324996948242188,243.43494882292202
-8.324996948242188,-8.824996948242188,198.434948822922
-8.324996948242188,-8.824996948242188,198.434948822922
-8.324996948242188,-9.324996948242188,243.43494882292202
-8.324996948242188,-9.324996948242188,243.43494882292202
-8.324996948242188,-9.824996948242188,198.434948822922
-8.324996948242188,-10.324996948242188,198.434948822922
-8.824996948242188,-10.324996948242188,198.434948822922
-8.824996948242188,-10.324996948242188,180.0
-9.324996948242188,-10.324996948242188,270.0
-9.824996948242188,-10.324996948242188,226.27135827809678
-10.324996948242188,-10.324996948242188,180.6356791390484
-10.324996948242188,-9.824996948242188,130.6012946450045
-10.324996948242188,-9.324996948242188,130.6012946450045
-10.324996948242188,-8.824996948242188,128.29755227199627
-10.324996948242188,-8.324996948242188,127.58372495892014
-10.324996948242188,-7.8249969482421875,130.6012946450045
-10.324996948242188,-7.3249969482421875,128.29755227199627
-10.324996948242188,-6.8249969482421875,127.58372495892014
-10.324996948242188,-6.3249969482421875,130.6012946450045
-10.324996948242188,-5.8249969482421875,130.6012946450045
-10.324996948242188,-5.3249969482421875,122.0053832080835
-10.324996948242188,-4.8249969482421875,116.56505117707799
-10.324996948242188,-4.3249969482421875,119.55592671537678
-10.324996948242188,-3.8249969482421875,124.680748903821
-10.324996948242188,-3.3249969482421875,135.0
-10.324996948242188,-3.3249969482421875,135.0
-10.324996948242188,-3.3249969482421875,82.8749836510982
-10.324996948242188,-2.8249969482421875,0.0
-10.324996948242188,-2.8249969482421875,63.43494882292201
-10.324996948242188,-2.3249969482421875,102.52880770915151
-10.324996948242188,-1.8249969482421875,116.56505117707799
-10.324996948242188,-1.8249969482421875,116.56505117707799
-10.324996948242188,-1.3249969482421875,77.47119229084849
-10.324996948242188,-0.8249969482421875,90.0
-10.324996948242188,-0.3249969482421875,116.56505117707799
-10.324996948242188,-0.3249969482421875,116.56505117707799
-10.324996948242188,0.1750030517578125,63.43494882292201
-10.324996948242188,0.6750030517578125,135.0
-10.324996948242188,0.6750030517578125,135.0
-10.324996948242188,0.6750030517578125,90.0
-10.324996948242188,1.1750030517578125,49.398705354995535
-10.324996948242188,1.1750030517578125,63.43494882292201
-10.324996948242188,1.6750030517578125,90.0
-10.324996948242188,1.6750030517578125,116.56505117707799
-10.324996948242188,2.1750030517578125,49.398705354995535
-10.324996948242188,2.1750030517578125,63.43494882292201
-10.324996948242188,2.6750030517578125,116.56505117707799
-10.324996948242188,2.6750030517578125,129.8055710922652
-10.324996948242188,3.1750030517578125,63.43494882292201
-10.324996948242188,3.6750030517578125,45.0
-10.324996948242188,4.1750030517578125,135.0
-10.824996948242188,4.1750030517578125,135.0
-10.824996948242188,3.6750030517578125,135.0
-10.324996948242188,3.6750030517578125,129.8055710922652
-9.824996948242188,3.6750030517578125,108.48417497654181
-9.324996948242188,3.6750030517578125,88.00439402667585
-8.824996948242188,3.6750030517578125,68.99084819514174
-8.324996948242188,3.6750030517578125,52.93037292049288
-8.324996948242188,4.1750030517578125,45.0
-8.324996948242188,4.6750030517578125,48.6869897645844
-8.324996948242188,5.1750030517578125,51.27430319041992
-8.324996948242188,5.6750030517578125,51.892902911665274
-8.324996948242188,6.1750030517578125,48.44645145583264
-8.324996948242188,6.6750030517578125,33.690067525979785
-8.324996948242188,6.6750030517578125,0.0
-8.324996948242188,7.1750030517578125,104.03624346792648
-8.324996948242188,7.6750030517578125,0.0
-8.324996948242188,7.6750030517578125,0.0
-7.8249969482421875,7.6750030517578125,156.80140948635182
-7.3249969482421875,7.6750030517578125,123.17914109427741
-6.8249969482421875,7.6750030517578125,89.55687270220301
-6.8249969482421875,8.175003051757812,55.02583397882652
-6.8249969482421875,8.675003051757812,14.230391400874275
-6.8249969482421875,9.175003051757812,323.13010235415595
-6.8249969482421875,9.175003051757812,321.3401917459099
-6.3249969482421875,9.175003051757812,98.13010235415595
-6.3249969482421875,9.675003051757812,29.735147050032936
-6.3249969482421875,10.175003051757812,315.0
-6.3249969482421875,10.675003051757812,42.40278554613258
-5.8249969482421875,10.675003051757812,135.0
-5.8249969482421875,10.175003051757812,80.78252558853899
-5.8249969482421875,10.175003051757812,32.005383208083494
-5.8249969482421875,10.675003051757812,353.6598082540901
-5.8249969482421875,11.175003051757812,18.434948822922024
-5.8249969482421875,11.675003051757812,29.68494882292202
-5.3249969482421875,11.675003051757812,38.559943373288085
-4.8249969482421875,11.675003051757812,0.0
-4.3249969482421875,11.675003051757812,90.0
-3.8249969482421875,11.675003051757812,75.6869897645844
-3.3249969482421875,11.675003051757812,62.215594695026255
-2.8249969482421875,11.675003051757812,50.3320801890435
-2.3249969482421875,11.675003051757812,42.01107385751165
-2.3249969482421875,11.675003051757812,45.0
-2.3249969482421875,11.675003051757812,0.0
-1.8249969482421875,11.675003051757812,315.0
-1.8249969482421875,11.675003051757812,30.963756532073546
-1.3249969482421875,11.675003051757812,251.56505117707798
-0.8249969482421875,11.675003051757812,30.963756532073546
-0.3249969482421875,11.675003051757812,26.7874872956897
-0.3249969482421875,11.175003051757812,24.294448391020758
-0.3249969482421875,10.675003051757812,30.96375653207352
-0.3249969482421875,10.175003051757812,4.371146076618899
0.1750030517578125,10.175003051757812,339.6855730383094
0.6750030517578125,10.175003051757812,310.6012946450045
0.1750030517578125,10.175003051757812,310.6012946450045
-0.3249969482421875,10.175003051757812,301.3991144705927
-0.8249969482421875,10.175003051757812,292.17309443566285
-1.3249969482421875,10.175003051757812,282.91900237490756
-1.8249969482421875,10.175003051757812,273.6315217095029
-2.3249969482421875,10.175003051757812,264.30387186183026
-2.8249969482421875,10.175003051757812,254.92725245484468
-3.3249969482421875,10.175003051757812,245.49000442636844
-3.8249969482421875,10.175003051757812,235.976296963553
-4.3249969482421875,10.175003051757812,226.36397847247113
-4.8249969482421875,10.175003051757812,216.6208558808906
-5.3249969482421875,10.175003051757812,206.69776134632917
-5.8249969482421875,10.175003051757812,196.51426014276527
-6.3249969482421875,10.175003051757812,185.9244671941576
-6.8249969482421875,10.175003051757812,174.612611480082
-6.8249969482421875,10.675003051757812,161.565051177078
-6.8249969482421875,11.175003051757812,161.565051177078
-7.3249969482421875,11.175003051757812,161.565051177078
-7.8249969482421875,11.175003051757812,167.47119229084848
-8.324996948242188,11.175003051757812,180.0
-8.824996948242188,11.175003051757812,180.0
-8.824996948242188,10.675003051757812,180.0
-8.324996948242188,10.675003051757812,198.434948822922
-7.8249969482421875,10.675003051757812,200.49758280857694
-7.3249969482421875,10.675003051757812,202.54226882985236
-7.3249969482421875,10.175003051757812,204.56801618429122
-6.8249969482421875,10.175003051757812,206.61305292161916
-6.8249969482421875,9.675003051757812,208.63769486297238
-6.3249969482421875,9.675003051757812,210.68312380791522
-6.3249969482421875,9.175003051757812,212.70652720944483
-5.8249969482421875,9.175003051757812,214.75239666525593
-5.8249969482421875,8.675003051757812,216.77440613478322
-5.3249969482421875,8.675003051757812,218.8207726736419
-5.3249969482421875,8.175003051757812,220.84120569685948
-4.8249969482421875,8.175003051757812,222.8881360077973
-4.3249969482421875,8.175003051757812,224.90677676273387
-3.8249969482421875,8.175003051757812,226.89520087716036
-3.3249969482421875,8.175003051757812,228.85133776144897
-2.8249969482421875,8.175003051757812,230.77296467115244
-2.8249969482421875,7.6750030517578125,232.65769827751032
-2.8249969482421875,7.1750030517578125,234.57349099213508
-2.3249969482421875,7.1750030517578125,236.52292185502915
-1.8249969482421875,7.1750030517578125,238.42997638627853
-1.8249969482421875,6.6750030517578125,240.29143508605432
-1.8249969482421875,6.1750030517578125,242.1905565629442
-1.8249969482421875,5.6750030517578125,244.1308523053233
-1.8249969482421875,5.1750030517578125,246.11622545330113
-1.8249969482421875,4.6750030517578125,248.15101545202145
-1.3249969482421875,4.6750030517578125,250.2400462191458
-1.3249969482421875,4.1750030517578125,252.269476655109
-0.8249969482421875,4.1750030517578125,254.3604940999387
-0.8249969482421875,3.6750030517578125,256.3834103719794
-0.3249969482421875,3.6750030517578125,258.47686000155153
-0.3249969482421875,3.1750030517578125,260.4917505053214
0.1750030517578125,3.1750030517578125,262.5882216397321
0.1750030517578125,2.6750030517578125,264.5930683724373
0.6750030517578125,2.6750030517578125,266.6933571902524
0.6750030517578125,2.1750030517578125,268.68540457667626
1.1750030517578125,2.1750030517578125,270.7906134595546
1.1750030517578125,1.6750030517578125,272.7659980093898
1.6750030517578125,1.6750030517578125,274.8776981089203
1.6750030517578125,1.1750030517578125,276.83083044507276
2.1750030517578125,1.1750030517578125,278.95133986479095
2.1750030517578125,0.6750030517578125,280.87382218666033
2.6750030517578125,0.6750030517578125,283.00670829999405
2.6750030517578125,0.1750030517578125,284.8853227577084
3.1750030517578125,0.1750030517578125,287.0363711321578
3.1750030517578125,-0.3249969482421875,288.84905755622293
3.6750030517578125,-0.3249969482421875,291.028302759871
3.6750030517578125,-0.8249969482421875,292.735327153725
4.1750030517578125,-0.8249969482421875,294.9617944383525
4.1750030517578125,-1.3249969482421875,296.48379597343444
4.6750030517578125,-1.3249969482421875,298.7983214767551
4.6750030517578125,-1.8249969482421875,299.95140378662495
5.1750030517578125,-1.8249969482421875,302.4595031555208
5.6750030517578125,-1.8249969482421875,302.7056160296126
6.1750030517578125,-1.8249969482421875,299.13794922793994
6.6750030517578125,-1.8249969482421875,289.4252994852933
7.1750030517578125,-1.8249969482421875,270.49517533118564
7.1750030517578125,-2.3249969482421875,236.30993247402023
7.1750030517578125,-2.8249969482421875,241.90496623701011
7.6750030517578125,-2.8249969482421875,246.5912296686979
8.175003051757812,-2.8249969482421875,245.01308924580997
