<?xml version="1.0" encoding="UTF-8" standalone="no"?>
<!-- Created with Inkscape (http://www.inkscape.org/) -->

<svg
   xmlns:osb="http://www.openswatchbook.org/uri/2009/osb"
   xmlns:dc="http://purl.org/dc/elements/1.1/"
   xmlns:cc="http://creativecommons.org/ns#"
   xmlns:rdf="http://www.w3.org/1999/02/22-rdf-syntax-ns#"
   xmlns:svg="http://www.w3.org/2000/svg"
   xmlns="http://www.w3.org/2000/svg"
   xmlns:sodipodi="http://sodipodi.sourceforge.net/DTD/sodipodi-0.dtd"
   xmlns:inkscape="http://www.inkscape.org/namespaces/inkscape"
   width="123.41657mm"
   height="88.40625mm"
   viewBox="0 0 123.41658 88.40625"
   version="1.1"
   id="svg8"
   inkscape:version="0.92.3 (2405546, 2018-03-11)"
   sodipodi:docname="statemachine.svg">
  <defs
     id="defs2">
    <marker
       inkscape:isstock="true"
       style="overflow:visible"
       id="marker26429"
       refX="0"
       refY="0"
       orient="auto"
       inkscape:stockid="Arrow2Mstart">
      <path
         transform="scale(0.6)"
         d="M 8.7185878,4.0337352 -2.2072895,0.01601326 8.7185884,-4.0017078 c -1.7454984,2.3720609 -1.7354408,5.6174519 -6e-7,8.035443 z"
         style="fill:#000000;fill-opacity:1;fill-rule:evenodd;stroke:#000000;stroke-width:0.625;stroke-linejoin:round;stroke-opacity:1"
         id="path26427"
         inkscape:connector-curvature="0" />
    </marker>
    <marker
       inkscape:stockid="Arrow2Mstart"
       orient="auto"
       refY="0"
       refX="0"
       id="Arrow2Mstart"
       style="overflow:visible"
       inkscape:isstock="true"
       inkscape:collect="always">
      <path
         id="path1491"
         style="fill:#000000;fill-opacity:1;fill-rule:evenodd;stroke:#000000;stroke-width:0.625;stroke-linejoin:round;stroke-opacity:1"
         d="M 8.7185878,4.0337352 -2.2072895,0.01601326 8.7185884,-4.0017078 c -1.7454984,2.3720609 -1.7354408,5.6174519 -6e-7,8.035443 z"
         transform="scale(0.6)"
         inkscape:connector-curvature="0" />
    </marker>
    <marker
       inkscape:isstock="true"
       style="overflow:visible"
       id="marker13633"
       refX="0"
       refY="0"
       orient="auto"
       inkscape:stockid="Arrow2Mend">
      <path
         transform="scale(-0.6)"
         d="M 8.7185878,4.0337352 -2.2072895,0.01601326 8.7185884,-4.0017078 c -1.7454984,2.3720609 -1.7354408,5.6174519 -6e-7,8.035443 z"
         style="fill:#000000;fill-opacity:1;fill-rule:evenodd;stroke:#000000;stroke-width:0.625;stroke-linejoin:round;stroke-opacity:1"
         id="path13631"
         inkscape:connector-curvature="0" />
    </marker>
    <marker
       inkscape:isstock="true"
       style="overflow:visible"
       id="marker13509"
       refX="0"
       refY="0"
       orient="auto"
       inkscape:stockid="Arrow2Mend">
      <path
         transform="scale(-0.6)"
         d="M 8.7185878,4.0337352 -2.2072895,0.01601326 8.7185884,-4.0017078 c -1.7454984,2.3720609 -1.7354408,5.6174519 -6e-7,8.035443 z"
         style="fill:#000000;fill-opacity:1;fill-rule:evenodd;stroke:#000000;stroke-width:0.625;stroke-linejoin:round;stroke-opacity:1"
         id="path13507"
         inkscape:connector-curvature="0" />
    </marker>
    <marker
       inkscape:isstock="true"
       style="overflow:visible"
       id="marker13391"
       refX="0"
       refY="0"
       orient="auto"
       inkscape:stockid="Arrow2Mend">
      <path
         transform="scale(-0.6)"
         d="M 8.7185878,4.0337352 -2.2072895,0.01601326 8.7185884,-4.0017078 c -1.7454984,2.3720609 -1.7354408,5.6174519 -6e-7,8.035443 z"
         style="fill:#000000;fill-opacity:1;fill-rule:evenodd;stroke:#000000;stroke-width:0.625;stroke-linejoin:round;stroke-opacity:1"
         id="path13389"
         inkscape:connector-curvature="0" />
    </marker>
    <marker
       inkscape:isstock="true"
       style="overflow:visible"
       id="marker13279"
       refX="0"
       refY="0"
       orient="auto"
       inkscape:stockid="Arrow2Mend">
      <path
         transform="scale(-0.6)"
         d="M 8.7185878,4.0337352 -2.2072895,0.01601326 8.7185884,-4.0017078 c -1.7454984,2.3720609 -1.7354408,5.6174519 -6e-7,8.035443 z"
         style="fill:#000000;fill-opacity:1;fill-rule:evenodd;stroke:#000000;stroke-width:0.625;stroke-linejoin:round;stroke-opacity:1"
         id="path13277"
         inkscape:connector-curvature="0" />
    </marker>
    <marker
       inkscape:isstock="true"
       style="overflow:visible"
       id="marker13173"
       refX="0"
       refY="0"
       orient="auto"
       inkscape:stockid="Arrow2Mend">
      <path
         transform="scale(-0.6)"
         d="M 8.7185878,4.0337352 -2.2072895,0.01601326 8.7185884,-4.0017078 c -1.7454984,2.3720609 -1.7354408,5.6174519 -6e-7,8.035443 z"
         style="fill:#000000;fill-opacity:1;fill-rule:evenodd;stroke:#000000;stroke-width:0.625;stroke-linejoin:round;stroke-opacity:1"
         id="path13171"
         inkscape:connector-curvature="0" />
    </marker>
    <marker
       inkscape:isstock="true"
       style="overflow:visible"
       id="marker13073"
       refX="0"
       refY="0"
       orient="auto"
       inkscape:stockid="Arrow2Mend">
      <path
         transform="scale(-0.6)"
         d="M 8.7185878,4.0337352 -2.2072895,0.01601326 8.7185884,-4.0017078 c -1.7454984,2.3720609 -1.7354408,5.6174519 -6e-7,8.035443 z"
         style="fill:#000000;fill-opacity:1;fill-rule:evenodd;stroke:#000000;stroke-width:0.625;stroke-linejoin:round;stroke-opacity:1"
         id="path13071"
         inkscape:connector-curvature="0" />
    </marker>
    <marker
       inkscape:isstock="true"
       style="overflow:visible"
       id="marker13063"
       refX="0"
       refY="0"
       orient="auto"
       inkscape:stockid="Arrow2Mend">
      <path
         transform="scale(-0.6)"
         d="M 8.7185878,4.0337352 -2.2072895,0.01601326 8.7185884,-4.0017078 c -1.7454984,2.3720609 -1.7354408,5.6174519 -6e-7,8.035443 z"
         style="fill:#000000;fill-opacity:1;fill-rule:evenodd;stroke:#000000;stroke-width:0.625;stroke-linejoin:round;stroke-opacity:1"
         id="path13061"
         inkscape:connector-curvature="0" />
    </marker>
    <marker
       inkscape:stockid="Arrow2Mend"
       orient="auto"
       refY="0"
       refX="0"
       id="Arrow2Mend"
       style="overflow:visible"
       inkscape:isstock="true"
       inkscape:collect="always">
      <path
         id="path1494"
         style="fill:#000000;fill-opacity:1;fill-rule:evenodd;stroke:#000000;stroke-width:0.625;stroke-linejoin:round;stroke-opacity:1"
         d="M 8.7185878,4.0337352 -2.2072895,0.01601326 8.7185884,-4.0017078 c -1.7454984,2.3720609 -1.7354408,5.6174519 -6e-7,8.035443 z"
         transform="scale(-0.6)"
         inkscape:connector-curvature="0" />
    </marker>
    <marker
       inkscape:stockid="Arrow2Lend"
       orient="auto"
       refY="0"
       refX="0"
       id="marker11237"
       style="overflow:visible"
       inkscape:isstock="true">
      <path
         id="path11235"
         style="fill:#000000;fill-opacity:1;fill-rule:evenodd;stroke:#000000;stroke-width:0.625;stroke-linejoin:round;stroke-opacity:1"
         d="M 8.7185878,4.0337352 -2.2072895,0.01601326 8.7185884,-4.0017078 c -1.7454984,2.3720609 -1.7354408,5.6174519 -6e-7,8.035443 z"
         transform="matrix(-1.1,0,0,-1.1,-1.1,0)"
         inkscape:connector-curvature="0" />
    </marker>
    <marker
       inkscape:isstock="true"
       style="overflow:visible"
       id="marker10877"
       refX="0"
       refY="0"
       orient="auto"
       inkscape:stockid="Arrow2Lend">
      <path
         transform="matrix(-1.1,0,0,-1.1,-1.1,0)"
         d="M 8.7185878,4.0337352 -2.2072895,0.01601326 8.7185884,-4.0017078 c -1.7454984,2.3720609 -1.7354408,5.6174519 -6e-7,8.035443 z"
         style="fill:#000000;fill-opacity:1;fill-rule:evenodd;stroke:#000000;stroke-width:0.625;stroke-linejoin:round;stroke-opacity:1"
         id="path10875"
         inkscape:connector-curvature="0" />
    </marker>
    <marker
       inkscape:stockid="Arrow2Lend"
       orient="auto"
       refY="0"
       refX="0"
       id="marker5404"
       style="overflow:visible"
       inkscape:isstock="true">
      <path
         id="path5402"
         style="fill:#000000;fill-opacity:1;fill-rule:evenodd;stroke:#000000;stroke-width:0.625;stroke-linejoin:round;stroke-opacity:1"
         d="M 8.7185878,4.0337352 -2.2072895,0.01601326 8.7185884,-4.0017078 c -1.7454984,2.3720609 -1.7354408,5.6174519 -6e-7,8.035443 z"
         transform="matrix(-1.1,0,0,-1.1,-1.1,0)"
         inkscape:connector-curvature="0" />
    </marker>
    <linearGradient
       id="linearGradient5116"
       osb:paint="solid">
      <stop
         style="stop-color:#f2f2f2;stop-opacity:1;"
         offset="0"
         id="stop5114" />
    </linearGradient>
    <marker
       inkscape:stockid="Arrow2Lstart"
       orient="auto"
       refY="0"
       refX="0"
       id="Arrow2Lstart"
       style="overflow:visible"
       inkscape:isstock="true">
      <path
         id="path1485"
         style="fill:#000000;fill-opacity:1;fill-rule:evenodd;stroke:#000000;stroke-width:0.625;stroke-linejoin:round;stroke-opacity:1"
         d="M 8.7185878,4.0337352 -2.2072895,0.01601326 8.7185884,-4.0017078 c -1.7454984,2.3720609 -1.7354408,5.6174519 -6e-7,8.035443 z"
         transform="matrix(1.1,0,0,1.1,1.1,0)"
         inkscape:connector-curvature="0" />
    </marker>
    <marker
       inkscape:stockid="Arrow2Lend"
       orient="auto"
       refY="0"
       refX="0"
       id="Arrow2Lend"
       style="overflow:visible"
       inkscape:isstock="true">
      <path
         id="path1488"
         style="fill:#000000;fill-opacity:1;fill-rule:evenodd;stroke:#000000;stroke-width:0.625;stroke-linejoin:round;stroke-opacity:1"
         d="M 8.7185878,4.0337352 -2.2072895,0.01601326 8.7185884,-4.0017078 c -1.7454984,2.3720609 -1.7354408,5.6174519 -6e-7,8.035443 z"
         transform="matrix(-1.1,0,0,-1.1,-1.1,0)"
         inkscape:connector-curvature="0" />
    </marker>
    <marker
       inkscape:stockid="Arrow1Lend"
       orient="auto"
       refY="0"
       refX="0"
       id="Arrow1Lend"
       style="overflow:visible"
       inkscape:isstock="true">
      <path
         id="path1470"
         d="M 0,0 5,-5 -12.5,0 5,5 Z"
         style="fill:#000000;fill-opacity:1;fill-rule:evenodd;stroke:#000000;stroke-width:1.00000003pt;stroke-opacity:1"
         transform="matrix(-0.8,0,0,-0.8,-10,0)"
         inkscape:connector-curvature="0" />
    </marker>
    <clipPath
       clipPathUnits="userSpaceOnUse"
       id="clipPath5295">
      <g
         id="g5299"
         transform="translate(-2.5876687,-14.605948)"
         style="stroke-width:0.99999994">
        <rect
           ry="2.1647737"
           y="118.90462"
           x="132.61429"
           height="11.906247"
           width="18.520832"
           id="rect5297"
           style="opacity:1;fill:#00f2f2;fill-opacity:0.22790701;stroke:none;stroke-width:0.49999997;stroke-linejoin:round;stroke-miterlimit:4;stroke-dasharray:none;stroke-dashoffset:0;stroke-opacity:1" />
      </g>
    </clipPath>
    <clipPath
       clipPathUnits="userSpaceOnUse"
       id="clipPath5295-0">
      <g
         id="g5299-9"
         transform="translate(-2.5876687,-14.605948)"
         style="stroke-width:0.99999994">
        <rect
           ry="2.1647737"
           y="118.90462"
           x="132.61429"
           height="11.906247"
           width="18.520832"
           id="rect5297-0"
           style="opacity:1;fill:#00f2f2;fill-opacity:0.22790701;stroke:none;stroke-width:0.49999997;stroke-linejoin:round;stroke-miterlimit:4;stroke-dasharray:none;stroke-dashoffset:0;stroke-opacity:1" />
      </g>
    </clipPath>
    <clipPath
       clipPathUnits="userSpaceOnUse"
       id="clipPath5295-7">
      <g
         id="g5299-0"
         transform="translate(-2.5876687,-14.605948)"
         style="stroke-width:0.99999994">
        <rect
           ry="2.1647737"
           y="118.90462"
           x="132.61429"
           height="11.906247"
           width="18.520832"
           id="rect5297-2"
           style="opacity:1;fill:#00f2f2;fill-opacity:0.22790701;stroke:none;stroke-width:0.49999997;stroke-linejoin:round;stroke-miterlimit:4;stroke-dasharray:none;stroke-dashoffset:0;stroke-opacity:1" />
      </g>
    </clipPath>
    <clipPath
       clipPathUnits="userSpaceOnUse"
       id="clipPath5295-9">
      <g
         id="g5299-93"
         transform="translate(-2.5876687,-14.605948)"
         style="stroke-width:0.99999994">
        <rect
           ry="2.1647737"
           y="118.90462"
           x="132.61429"
           height="11.906247"
           width="18.520832"
           id="rect5297-9"
           style="opacity:1;fill:#00f2f2;fill-opacity:0.22790701;stroke:none;stroke-width:0.49999997;stroke-linejoin:round;stroke-miterlimit:4;stroke-dasharray:none;stroke-dashoffset:0;stroke-opacity:1" />
      </g>
    </clipPath>
    <marker
       inkscape:stockid="Arrow2Lend"
       orient="auto"
       refY="0"
       refX="0"
       id="marker5404-2"
       style="overflow:visible"
       inkscape:isstock="true">
      <path
         inkscape:connector-curvature="0"
         id="path5402-8"
         style="fill:#000000;fill-opacity:1;fill-rule:evenodd;stroke:#000000;stroke-width:0.625;stroke-linejoin:round;stroke-opacity:1"
         d="M 8.7185878,4.0337352 -2.2072895,0.01601326 8.7185884,-4.0017078 c -1.7454984,2.3720609 -1.7354408,5.6174519 -6e-7,8.035443 z"
         transform="matrix(-1.1,0,0,-1.1,-1.1,0)" />
    </marker>
    <marker
       inkscape:stockid="Arrow2Lend"
       orient="auto"
       refY="0"
       refX="0"
       id="marker5404-2-7"
       style="overflow:visible"
       inkscape:isstock="true">
      <path
         inkscape:connector-curvature="0"
         id="path5402-8-5"
         style="fill:#000000;fill-opacity:1;fill-rule:evenodd;stroke:#000000;stroke-width:0.625;stroke-linejoin:round;stroke-opacity:1"
         d="M 8.7185878,4.0337352 -2.2072895,0.01601326 8.7185884,-4.0017078 c -1.7454984,2.3720609 -1.7354408,5.6174519 -6e-7,8.035443 z"
         transform="matrix(-1.1,0,0,-1.1,-1.1,0)" />
    </marker>
    <marker
       inkscape:stockid="Arrow2Lend"
       orient="auto"
       refY="0"
       refX="0"
       id="marker5404-2-7-0"
       style="overflow:visible"
       inkscape:isstock="true">
      <path
         inkscape:connector-curvature="0"
         id="path5402-8-5-4"
         style="fill:#000000;fill-opacity:1;fill-rule:evenodd;stroke:#000000;stroke-width:0.625;stroke-linejoin:round;stroke-opacity:1"
         d="M 8.7185878,4.0337352 -2.2072895,0.01601326 8.7185884,-4.0017078 c -1.7454984,2.3720609 -1.7354408,5.6174519 -6e-7,8.035443 z"
         transform="matrix(-1.1,0,0,-1.1,-1.1,0)" />
    </marker>
    <marker
       inkscape:stockid="Arrow2Lend"
       orient="auto"
       refY="0"
       refX="0"
       id="marker5404-2-7-9"
       style="overflow:visible"
       inkscape:isstock="true">
      <path
         inkscape:connector-curvature="0"
         id="path5402-8-5-6"
         style="fill:#000000;fill-opacity:1;fill-rule:evenodd;stroke:#000000;stroke-width:0.625;stroke-linejoin:round;stroke-opacity:1"
         d="M 8.7185878,4.0337352 -2.2072895,0.01601326 8.7185884,-4.0017078 c -1.7454984,2.3720609 -1.7354408,5.6174519 -6e-7,8.035443 z"
         transform="matrix(-1.1,0,0,-1.1,-1.1,0)" />
    </marker>
    <marker
       inkscape:stockid="Arrow2Lend"
       orient="auto"
       refY="0"
       refX="0"
       id="marker5404-2-7-0-9"
       style="overflow:visible"
       inkscape:isstock="true">
      <path
         inkscape:connector-curvature="0"
         id="path5402-8-5-4-6"
         style="fill:#000000;fill-opacity:1;fill-rule:evenodd;stroke:#000000;stroke-width:0.625;stroke-linejoin:round;stroke-opacity:1"
         d="M 8.7185878,4.0337352 -2.2072895,0.01601326 8.7185884,-4.0017078 c -1.7454984,2.3720609 -1.7354408,5.6174519 -6e-7,8.035443 z"
         transform="matrix(-1.1,0,0,-1.1,-1.1,0)" />
    </marker>
    <marker
       inkscape:stockid="Arrow2Lend"
       orient="auto"
       refY="0"
       refX="0"
       id="marker5404-2-7-0-9-5"
       style="overflow:visible"
       inkscape:isstock="true">
      <path
         inkscape:connector-curvature="0"
         id="path5402-8-5-4-6-9"
         style="fill:#000000;fill-opacity:1;fill-rule:evenodd;stroke:#000000;stroke-width:0.625;stroke-linejoin:round;stroke-opacity:1"
         d="M 8.7185878,4.0337352 -2.2072895,0.01601326 8.7185884,-4.0017078 c -1.7454984,2.3720609 -1.7354408,5.6174519 -6e-7,8.035443 z"
         transform="matrix(-1.1,0,0,-1.1,-1.1,0)" />
    </marker>
    <marker
       inkscape:isstock="true"
       style="overflow:visible"
       id="marker13073-7"
       refX="0"
       refY="0"
       orient="auto"
       inkscape:stockid="Arrow2Mend">
      <path
         inkscape:connector-curvature="0"
         transform="scale(-0.6)"
         d="M 8.7185878,4.0337352 -2.2072895,0.01601326 8.7185884,-4.0017078 c -1.7454984,2.3720609 -1.7354408,5.6174519 -6e-7,8.035443 z"
         style="fill:#000000;fill-opacity:1;fill-rule:evenodd;stroke:#000000;stroke-width:0.625;stroke-linejoin:round;stroke-opacity:1"
         id="path13071-0" />
    </marker>
    <marker
       inkscape:isstock="true"
       style="overflow:visible"
       id="marker13073-7-8"
       refX="0"
       refY="0"
       orient="auto"
       inkscape:stockid="Arrow2Mend">
      <path
         inkscape:connector-curvature="0"
         transform="scale(-0.6)"
         d="M 8.7185878,4.0337352 -2.2072895,0.01601326 8.7185884,-4.0017078 c -1.7454984,2.3720609 -1.7354408,5.6174519 -6e-7,8.035443 z"
         style="fill:#000000;fill-opacity:1;fill-rule:evenodd;stroke:#000000;stroke-width:0.625;stroke-linejoin:round;stroke-opacity:1"
         id="path13071-0-5" />
    </marker>
    <marker
       inkscape:isstock="true"
       style="overflow:visible"
       id="marker13073-7-7"
       refX="0"
       refY="0"
       orient="auto"
       inkscape:stockid="Arrow2Mend">
      <path
         inkscape:connector-curvature="0"
         transform="scale(-0.6)"
         d="M 8.7185878,4.0337352 -2.2072895,0.01601326 8.7185884,-4.0017078 c -1.7454984,2.3720609 -1.7354408,5.6174519 -6e-7,8.035443 z"
         style="fill:#000000;fill-opacity:1;fill-rule:evenodd;stroke:#000000;stroke-width:0.625;stroke-linejoin:round;stroke-opacity:1"
         id="path13071-0-8" />
    </marker>
    <marker
       inkscape:isstock="true"
       style="overflow:visible"
       id="marker13073-7-5"
       refX="0"
       refY="0"
       orient="auto"
       inkscape:stockid="Arrow2Mend">
      <path
         inkscape:connector-curvature="0"
         transform="scale(-0.6)"
         d="M 8.7185878,4.0337352 -2.2072895,0.01601326 8.7185884,-4.0017078 c -1.7454984,2.3720609 -1.7354408,5.6174519 -6e-7,8.035443 z"
         style="fill:#000000;fill-opacity:1;fill-rule:evenodd;stroke:#000000;stroke-width:0.625;stroke-linejoin:round;stroke-opacity:1"
         id="path13071-0-2" />
    </marker>
    <marker
       inkscape:isstock="true"
       style="overflow:visible"
       id="marker13073-7-72"
       refX="0"
       refY="0"
       orient="auto"
       inkscape:stockid="Arrow2Mend">
      <path
         inkscape:connector-curvature="0"
         transform="scale(-0.6)"
         d="M 8.7185878,4.0337352 -2.2072895,0.01601326 8.7185884,-4.0017078 c -1.7454984,2.3720609 -1.7354408,5.6174519 -6e-7,8.035443 z"
         style="fill:#000000;fill-opacity:1;fill-rule:evenodd;stroke:#000000;stroke-width:0.625;stroke-linejoin:round;stroke-opacity:1"
         id="path13071-0-57" />
    </marker>
    <marker
       inkscape:isstock="true"
       style="overflow:visible"
       id="marker13073-7-8-1"
       refX="0"
       refY="0"
       orient="auto"
       inkscape:stockid="Arrow2Mend">
      <path
         inkscape:connector-curvature="0"
         transform="scale(-0.6)"
         d="M 8.7185878,4.0337352 -2.2072895,0.01601326 8.7185884,-4.0017078 c -1.7454984,2.3720609 -1.7354408,5.6174519 -6e-7,8.035443 z"
         style="fill:#000000;fill-opacity:1;fill-rule:evenodd;stroke:#000000;stroke-width:0.625;stroke-linejoin:round;stroke-opacity:1"
         id="path13071-0-5-7" />
    </marker>
    <marker
       inkscape:isstock="true"
       style="overflow:visible"
       id="marker13073-7-72-9"
       refX="0"
       refY="0"
       orient="auto"
       inkscape:stockid="Arrow2Mend">
      <path
         inkscape:connector-curvature="0"
         transform="scale(-0.6)"
         d="M 8.7185878,4.0337352 -2.2072895,0.01601326 8.7185884,-4.0017078 c -1.7454984,2.3720609 -1.7354408,5.6174519 -6e-7,8.035443 z"
         style="fill:#000000;fill-opacity:1;fill-rule:evenodd;stroke:#000000;stroke-width:0.625;stroke-linejoin:round;stroke-opacity:1"
         id="path13071-0-57-6" />
    </marker>
    <marker
       inkscape:isstock="true"
       style="overflow:visible"
       id="marker26429-9"
       refX="0"
       refY="0"
       orient="auto"
       inkscape:stockid="Arrow2Mstart">
      <path
         inkscape:connector-curvature="0"
         transform="scale(0.6)"
         d="M 8.7185878,4.0337352 -2.2072895,0.01601326 8.7185884,-4.0017078 c -1.7454984,2.3720609 -1.7354408,5.6174519 -6e-7,8.035443 z"
         style="fill:#000000;fill-opacity:1;fill-rule:evenodd;stroke:#000000;stroke-width:0.625;stroke-linejoin:round;stroke-opacity:1"
         id="path26427-8" />
    </marker>
    <marker
       inkscape:isstock="true"
       style="overflow:visible"
       id="marker13073-7-72-9-7"
       refX="0"
       refY="0"
       orient="auto"
       inkscape:stockid="Arrow2Mend">
      <path
         inkscape:connector-curvature="0"
         transform="scale(-0.6)"
         d="M 8.7185878,4.0337352 -2.2072895,0.01601326 8.7185884,-4.0017078 c -1.7454984,2.3720609 -1.7354408,5.6174519 -6e-7,8.035443 z"
         style="fill:#000000;fill-opacity:1;fill-rule:evenodd;stroke:#000000;stroke-width:0.625;stroke-linejoin:round;stroke-opacity:1"
         id="path13071-0-57-6-7" />
    </marker>
    <marker
       inkscape:isstock="true"
       style="overflow:visible"
       id="marker26429-6"
       refX="0"
       refY="0"
       orient="auto"
       inkscape:stockid="Arrow2Mstart">
      <path
         inkscape:connector-curvature="0"
         transform="scale(0.6)"
         d="M 8.7185878,4.0337352 -2.2072895,0.01601326 8.7185884,-4.0017078 c -1.7454984,2.3720609 -1.7354408,5.6174519 -6e-7,8.035443 z"
         style="fill:#000000;fill-opacity:1;fill-rule:evenodd;stroke:#000000;stroke-width:0.625;stroke-linejoin:round;stroke-opacity:1"
         id="path26427-5" />
    </marker>
    <marker
       inkscape:isstock="true"
       style="overflow:visible"
       id="marker13073-7-72-9-2"
       refX="0"
       refY="0"
       orient="auto"
       inkscape:stockid="Arrow2Mend">
      <path
         inkscape:connector-curvature="0"
         transform="scale(-0.6)"
         d="M 8.7185878,4.0337352 -2.2072895,0.01601326 8.7185884,-4.0017078 c -1.7454984,2.3720609 -1.7354408,5.6174519 -6e-7,8.035443 z"
         style="fill:#000000;fill-opacity:1;fill-rule:evenodd;stroke:#000000;stroke-width:0.625;stroke-linejoin:round;stroke-opacity:1"
         id="path13071-0-57-6-8" />
    </marker>
    <marker
       inkscape:isstock="true"
       style="overflow:visible"
       id="marker26429-0"
       refX="0"
       refY="0"
       orient="auto"
       inkscape:stockid="Arrow2Mstart">
      <path
         inkscape:connector-curvature="0"
         transform="scale(0.6)"
         d="M 8.7185878,4.0337352 -2.2072895,0.01601326 8.7185884,-4.0017078 c -1.7454984,2.3720609 -1.7354408,5.6174519 -6e-7,8.035443 z"
         style="fill:#000000;fill-opacity:1;fill-rule:evenodd;stroke:#000000;stroke-width:0.625;stroke-linejoin:round;stroke-opacity:1"
         id="path26427-6" />
    </marker>
    <marker
       inkscape:isstock="true"
       style="overflow:visible"
       id="marker13073-7-72-9-4"
       refX="0"
       refY="0"
       orient="auto"
       inkscape:stockid="Arrow2Mend">
      <path
         inkscape:connector-curvature="0"
         transform="scale(-0.6)"
         d="M 8.7185878,4.0337352 -2.2072895,0.01601326 8.7185884,-4.0017078 c -1.7454984,2.3720609 -1.7354408,5.6174519 -6e-7,8.035443 z"
         style="fill:#000000;fill-opacity:1;fill-rule:evenodd;stroke:#000000;stroke-width:0.625;stroke-linejoin:round;stroke-opacity:1"
         id="path13071-0-57-6-9" />
    </marker>
    <marker
       inkscape:isstock="true"
       style="overflow:visible"
       id="marker26429-65"
       refX="0"
       refY="0"
       orient="auto"
       inkscape:stockid="Arrow2Mstart">
      <path
         inkscape:connector-curvature="0"
         transform="scale(0.6)"
         d="M 8.7185878,4.0337352 -2.2072895,0.01601326 8.7185884,-4.0017078 c -1.7454984,2.3720609 -1.7354408,5.6174519 -6e-7,8.035443 z"
         style="fill:#000000;fill-opacity:1;fill-rule:evenodd;stroke:#000000;stroke-width:0.625;stroke-linejoin:round;stroke-opacity:1"
         id="path26427-9" />
    </marker>
    <marker
       inkscape:isstock="true"
       style="overflow:visible"
       id="marker13073-7-72-9-6"
       refX="0"
       refY="0"
       orient="auto"
       inkscape:stockid="Arrow2Mend">
      <path
         inkscape:connector-curvature="0"
         transform="scale(-0.6)"
         d="M 8.7185878,4.0337352 -2.2072895,0.01601326 8.7185884,-4.0017078 c -1.7454984,2.3720609 -1.7354408,5.6174519 -6e-7,8.035443 z"
         style="fill:#000000;fill-opacity:1;fill-rule:evenodd;stroke:#000000;stroke-width:0.625;stroke-linejoin:round;stroke-opacity:1"
         id="path13071-0-57-6-2" />
    </marker>
    <marker
       inkscape:isstock="true"
       style="overflow:visible"
       id="marker13279-8"
       refX="0"
       refY="0"
       orient="auto"
       inkscape:stockid="Arrow2Mend">
      <path
         transform="scale(-0.6)"
         d="M 8.7185878,4.0337352 -2.2072895,0.01601326 8.7185884,-4.0017078 c -1.7454984,2.3720609 -1.7354408,5.6174519 -6e-7,8.035443 z"
         style="fill:#000000;fill-opacity:1;fill-rule:evenodd;stroke:#000000;stroke-width:0.625;stroke-linejoin:round;stroke-opacity:1"
         id="path13277-7"
         inkscape:connector-curvature="0" />
    </marker>
    <marker
       inkscape:isstock="true"
       style="overflow:visible"
       id="marker13279-7"
       refX="0"
       refY="0"
       orient="auto"
       inkscape:stockid="Arrow2Mend">
      <path
         transform="scale(-0.6)"
         d="M 8.7185878,4.0337352 -2.2072895,0.01601326 8.7185884,-4.0017078 c -1.7454984,2.3720609 -1.7354408,5.6174519 -6e-7,8.035443 z"
         style="fill:#000000;fill-opacity:1;fill-rule:evenodd;stroke:#000000;stroke-width:0.625;stroke-linejoin:round;stroke-opacity:1"
         id="path13277-0"
         inkscape:connector-curvature="0" />
    </marker>
    <marker
       inkscape:isstock="true"
       style="overflow:visible"
       id="marker13173-2"
       refX="0"
       refY="0"
       orient="auto"
       inkscape:stockid="Arrow2Mend">
      <path
         transform="scale(-0.6)"
         d="M 8.7185878,4.0337352 -2.2072895,0.01601326 8.7185884,-4.0017078 c -1.7454984,2.3720609 -1.7354408,5.6174519 -6e-7,8.035443 z"
         style="fill:#000000;fill-opacity:1;fill-rule:evenodd;stroke:#000000;stroke-width:0.625;stroke-linejoin:round;stroke-opacity:1"
         id="path13171-9"
         inkscape:connector-curvature="0" />
    </marker>
  </defs>
  <sodipodi:namedview
     id="base"
     pagecolor="#ffffff"
     bordercolor="#666666"
     borderopacity="1.0"
     inkscape:pageopacity="0.0"
     inkscape:pageshadow="2"
     inkscape:zoom="1.979899"
     inkscape:cx="274.93702"
     inkscape:cy="204.23255"
     inkscape:document-units="mm"
     inkscape:current-layer="layer1"
     showgrid="false"
     inkscape:snap-bbox="true"
     inkscape:snap-object-midpoints="true"
     inkscape:snap-others="false"
     showguides="false"
     inkscape:guide-bbox="true"
     inkscape:snap-bbox-midpoints="true"
     inkscape:window-width="1920"
     inkscape:window-height="2132"
     inkscape:window-x="5760"
     inkscape:window-y="0"
     inkscape:window-maximized="0"
     inkscape:snap-global="true"
     fit-margin-top="0"
     fit-margin-left="0"
     fit-margin-right="0"
     fit-margin-bottom="0">
    <inkscape:grid
       type="xygrid"
       id="grid815"
       originx="-16.120465"
       originy="-135.79689" />
    <sodipodi:guide
       position="7.8001583,24.203122"
       orientation="0,1"
       id="guide1412"
       inkscape:locked="false"
       inkscape:label=""
       inkscape:color="rgb(0,0,255)" />
    <sodipodi:guide
       position="-31.622098,6.2031209"
       orientation="0,1"
       id="guide1414"
       inkscape:locked="false"
       inkscape:label=""
       inkscape:color="rgb(0,0,255)" />
    <sodipodi:guide
       position="13.813722,32.449292"
       orientation="1,0"
       id="guide1416"
       inkscape:locked="false" />
    <sodipodi:guide
       position="38.803424,30.444772"
       orientation="1,0"
       id="guide1418"
       inkscape:locked="false" />
    <sodipodi:guide
       position="63.926761,29.509332"
       orientation="1,0"
       id="guide1420"
       inkscape:locked="false" />
    <sodipodi:guide
       position="88.91646,36.191072"
       orientation="1,0"
       id="guide1422"
       inkscape:locked="false" />
    <sodipodi:guide
       position="113.90616,38.730132"
       orientation="1,0"
       id="guide1424"
       inkscape:locked="false" />
    <sodipodi:guide
       position="-28.949402,46.203123"
       orientation="0,1"
       id="guide1426"
       inkscape:locked="false"
       inkscape:label=""
       inkscape:color="rgb(0,0,255)" />
    <sodipodi:guide
       position="-4.8951443,64.203123"
       orientation="0,1"
       id="guide1428"
       inkscape:locked="false"
       inkscape:label=""
       inkscape:color="rgb(0,0,255)" />
    <sodipodi:guide
       position="7.2656192,82.203124"
       orientation="0,1"
       id="guide1430"
       inkscape:locked="false"
       inkscape:label=""
       inkscape:color="rgb(0,0,255)" />
    <sodipodi:guide
       position="-14.516848,100.20312"
       orientation="0,1"
       id="guide1432"
       inkscape:locked="false"
       inkscape:label=""
       inkscape:color="rgb(0,0,255)" />
    <sodipodi:guide
       position="-11.175978,136.55078"
       orientation="1,0"
       id="guide1434"
       inkscape:locked="false" />
    <sodipodi:guide
       position="138.89587,92.451305"
       orientation="1,0"
       id="guide1436"
       inkscape:locked="false" />
    <sodipodi:guide
       position="-3.7417442,-11.820691"
       orientation="0,1"
       id="guide1775"
       inkscape:locked="false" />
    <sodipodi:guide
       position="-21.198586,42.203123"
       orientation="0,1"
       id="guide1993"
       inkscape:locked="false"
       inkscape:label=""
       inkscape:color="rgb(0,0,255)" />
  </sodipodi:namedview>
  <metadata
     id="metadata5">
    <rdf:RDF>
      <cc:Work
         rdf:about="">
        <dc:format>image/svg+xml</dc:format>
        <dc:type
           rdf:resource="http://purl.org/dc/dcmitype/StillImage" />
        <dc:title></dc:title>
      </cc:Work>
    </rdf:RDF>
  </metadata>
  <g
     inkscape:label="Layer 1"
     inkscape:groupmode="layer"
     id="layer1"
     transform="translate(-16.120464,-72.796877)">
    <path
       style="fill:none;stroke:#000000;stroke-width:0.35;stroke-linecap:butt;stroke-linejoin:miter;stroke-miterlimit:4;stroke-dasharray:none;stroke-opacity:1;marker-end:url(#marker13391)"
       d="m 16.120464,78.998728 h 4.152627"
       id="path5400"
       inkscape:connector-curvature="0" />
    <path
       style="fill:none;stroke:#000000;stroke-width:0.35;stroke-linecap:butt;stroke-linejoin:miter;stroke-miterlimit:2;stroke-dasharray:none;stroke-opacity:1;marker-end:url(#Arrow2Mend)"
       d="m 38.954038,79.004669 h 6.097929"
       id="path5400-6"
       inkscape:connector-curvature="0" />
    <path
       style="fill:none;stroke:#000000;stroke-width:0.35;stroke-linecap:butt;stroke-linejoin:miter;stroke-opacity:1;marker-end:url(#marker13279);stroke-miterlimit:4;stroke-dasharray:none"
       d="m 46.29858,84.36827 -7.252325,7.252334"
       id="path10867"
       inkscape:connector-curvature="0" />
    <g
       id="g1408"
       transform="translate(8.7675198,30.046877)">
      <rect
         ry="2.2113535"
         y="43"
         x="11.90625"
         height="11.906247"
         width="18.520832"
         id="rect823"
         style="opacity:1;fill:#f2f2f2;fill-opacity:1;stroke:#646464;stroke-width:0.5;stroke-linejoin:round;stroke-miterlimit:4;stroke-dasharray:2.00000006, 2.00000006;stroke-dashoffset:0;stroke-opacity:1" />
      <text
         id="text827"
         y="49.895359"
         x="14.594286"
         style="font-style:normal;font-weight:normal;font-size:10.58333302px;line-height:1.25;font-family:sans-serif;letter-spacing:0px;word-spacing:0px;fill:#000000;fill-opacity:1;stroke:none;stroke-width:0.26458332"
         xml:space="preserve"><tspan
           style="font-style:normal;font-variant:normal;font-weight:normal;font-stretch:normal;font-size:3.52777767px;font-family:sans-serif;-inkscape-font-specification:sans-serif;stroke-width:0.26458332"
           y="49.895359"
           x="14.594286"
           id="tspan825"
           sodipodi:role="line">Startup</tspan></text>
    </g>
    <path
       style="fill:none;stroke:#000000;stroke-width:0.35;stroke-linecap:butt;stroke-linejoin:miter;stroke-miterlimit:4;stroke-dasharray:none;stroke-opacity:1;marker-end:url(#marker13073-7-72)"
       d="M 70.81253,154.99745 H 64.7146"
       id="path5400-6-8-7-9"
       inkscape:connector-curvature="0" />
    <path
       style="fill:none;stroke:#000000;stroke-width:0.35;stroke-linecap:butt;stroke-linejoin:miter;stroke-miterlimit:4;stroke-dasharray:none;stroke-opacity:1;marker-end:url(#marker13073-7-8-1)"
       d="m 54.923887,149.37526 v -6.09793"
       id="path5400-6-8-7-8-3"
       inkscape:connector-curvature="0" />
    <path
       style="fill:none;stroke:#000000;stroke-width:0.35;stroke-linecap:butt;stroke-linejoin:miter;stroke-miterlimit:4;stroke-dasharray:none;stroke-opacity:1;marker-start:url(#marker26429);marker-end:url(#marker13073-7-72-9)"
       d="M 45.240309,155 H 39.685255"
       id="path5400-6-8-7-9-9"
       inkscape:connector-curvature="0" />
    <g
       id="g1317"
       transform="translate(-6.9490093,2.592821)">
      <rect
         ry="2.1647737"
         y="146.45406"
         x="52.61248"
         height="11.906247"
         width="18.520832"
         id="rect823-6"
         style="opacity:1;fill:#f2f2f2;fill-opacity:1;stroke:#646464;stroke-width:0.5;stroke-linejoin:round;stroke-miterlimit:4;stroke-dasharray:none;stroke-dashoffset:0;stroke-opacity:1" />
      <g
         transform="translate(38.306556,71.209418)"
         id="g910">
        <text
           xml:space="preserve"
           style="font-style:normal;font-weight:normal;font-size:10.58333302px;line-height:1.25;font-family:sans-serif;letter-spacing:0px;word-spacing:0px;fill:#000000;fill-opacity:1;stroke:none;stroke-width:0.26458332"
           x="17.229088"
           y="80.384842"
           id="text827-1"><tspan
             sodipodi:role="line"
             x="17.229088"
             y="80.384842"
             style="font-style:normal;font-variant:normal;font-weight:normal;font-stretch:normal;font-size:3.52777767px;font-family:sans-serif;-inkscape-font-specification:sans-serif;writing-mode:lr-tb;stroke-width:0.26458332"
             id="tspan884">Wait at</tspan></text>
        <text
           xml:space="preserve"
           style="font-style:normal;font-weight:normal;font-size:10.58333302px;line-height:1.25;font-family:sans-serif;letter-spacing:0px;word-spacing:0px;fill:#000000;fill-opacity:1;stroke:none;stroke-width:0.26458332"
           x="16.821705"
           y="83.957169"
           id="text827-1-3"><tspan
             sodipodi:role="line"
             x="16.821705"
             y="83.957169"
             style="font-style:normal;font-variant:normal;font-weight:normal;font-stretch:normal;font-size:3.52777767px;font-family:sans-serif;-inkscape-font-specification:sans-serif;writing-mode:lr-tb;stroke-width:0.26458332"
             id="tspan884-8">Dropoff</tspan></text>
      </g>
    </g>
    <path
       style="fill:none;stroke:#000000;stroke-width:0.35;stroke-linecap:butt;stroke-linejoin:miter;stroke-miterlimit:4;stroke-dasharray:none;stroke-opacity:1;marker-end:url(#marker13073-7)"
       d="M 80.047222,124.39107 V 130.489"
       id="path5400-6-8-7"
       inkscape:connector-curvature="0" />
    <path
       style="fill:none;stroke:#000000;stroke-width:0.35;stroke-linecap:butt;stroke-linejoin:miter;stroke-opacity:1;marker-start:url(#Arrow2Mstart);stroke-miterlimit:4;stroke-dasharray:none"
       d="M 79.747279,103.53236 54.916398,131.03619"
       id="path2181"
       inkscape:connector-curvature="0" />
    <path
       style="fill:none;stroke:#000000;stroke-width:0.35;stroke-linecap:butt;stroke-linejoin:miter;stroke-opacity:1;marker-end:url(#marker13633);stroke-miterlimit:4;stroke-dasharray:none"
       d="m 80.060361,103.18235 24.709119,27.55983"
       id="path2183"
       inkscape:connector-curvature="0" />
    <path
       style="fill:none;stroke:#000000;stroke-width:0.35;stroke-linecap:butt;stroke-linejoin:miter;stroke-miterlimit:4;stroke-dasharray:none;stroke-opacity:1;marker-end:url(#marker13073-7-8)"
       d="m 105.03692,142.46491 v 6.09793"
       id="path5400-6-8-7-8"
       inkscape:connector-curvature="0" />
    <path
       style="fill:none;stroke:#000000;stroke-width:0.35;stroke-linecap:butt;stroke-linejoin:miter;stroke-miterlimit:4;stroke-dasharray:none;stroke-opacity:1;marker-start:url(#marker26429-6);marker-end:url(#marker13073-7-72-9-2)"
       d="M 95.302898,137 H 89.747844"
       id="path5400-6-8-7-9-9-4"
       inkscape:connector-curvature="0" />
    <g
       id="g1357"
       transform="translate(-3.474511,9.0479831)">
      <rect
         ry="2.1647737"
         y="121.99889"
         x="99.251015"
         height="11.906247"
         width="18.520832"
         id="rect823-6-8"
         style="opacity:1;fill:#f2f2f2;fill-opacity:1;stroke:#646464;stroke-width:0.5;stroke-linejoin:round;stroke-miterlimit:4;stroke-dasharray:2.00000006, 2.00000006;stroke-dashoffset:0;stroke-opacity:1" />
      <g
         transform="translate(85.918328,46.723246)"
         id="g910-2">
        <text
           xml:space="preserve"
           style="font-style:normal;font-weight:normal;font-size:10.58333302px;line-height:1.25;font-family:sans-serif;letter-spacing:0px;word-spacing:0px;fill:#000000;fill-opacity:1;stroke:none;stroke-width:0.26458332"
           x="17.811308"
           y="80.384842"
           id="text827-1-7"><tspan
             sodipodi:role="line"
             x="17.811308"
             y="80.384842"
             style="font-style:normal;font-variant:normal;font-weight:normal;font-stretch:normal;font-size:3.52777767px;font-family:sans-serif;-inkscape-font-specification:sans-serif;writing-mode:lr-tb;stroke-width:0.26458332"
             id="tspan884-0">Go to</tspan></text>
        <text
           xml:space="preserve"
           style="font-style:normal;font-weight:normal;font-size:10.58333302px;line-height:1.25;font-family:sans-serif;letter-spacing:0px;word-spacing:0px;fill:#000000;fill-opacity:1;stroke:none;stroke-width:0.26458332"
           x="16.821705"
           y="83.957169"
           id="text827-1-3-5"><tspan
             sodipodi:role="line"
             x="16.821705"
             y="83.957169"
             style="font-style:normal;font-variant:normal;font-weight:normal;font-stretch:normal;font-size:3.52777767px;font-family:sans-serif;-inkscape-font-specification:sans-serif;writing-mode:lr-tb;stroke-width:0.26458332"
             id="tspan884-8-2">Pickup</tspan></text>
      </g>
    </g>
    <path
       style="fill:none;stroke:#000000;stroke-width:0.35;stroke-linecap:butt;stroke-linejoin:miter;stroke-miterlimit:4;stroke-dasharray:none;stroke-opacity:1;marker-end:url(#marker13073-7-5)"
       d="m 95.947944,154.99745 h -6.09793"
       id="path5400-6-8-7-85"
       inkscape:connector-curvature="0" />
    <path
       style="fill:none;stroke:#000000;stroke-width:0.35;stroke-linecap:butt;stroke-linejoin:miter;stroke-miterlimit:4;stroke-dasharray:none;stroke-opacity:1;marker-start:url(#marker26429-65);marker-end:url(#marker13073-7-72-9-6)"
       d="m 80.047222,148.65313 v -5.0953"
       id="path5400-6-8-7-9-9-8"
       inkscape:connector-curvature="0" />
    <g
       id="g1378"
       transform="translate(-5.6126617,1.456911)">
      <rect
         ry="2.1647737"
         y="147.58997"
         x="76.399467"
         height="11.906247"
         width="18.520832"
         id="rect823-6-8-6"
         style="opacity:1;fill:#f2f2f2;fill-opacity:1;stroke:#646464;stroke-width:0.5;stroke-linejoin:round;stroke-miterlimit:4;stroke-dasharray:2.00000006, 2.00000006;stroke-dashoffset:0;stroke-opacity:1" />
      <g
         transform="translate(62.093542,72.314308)"
         id="g910-2-1">
        <text
           xml:space="preserve"
           style="font-style:normal;font-weight:normal;font-size:10.58333302px;line-height:1.25;font-family:sans-serif;letter-spacing:0px;word-spacing:0px;fill:#000000;fill-opacity:1;stroke:none;stroke-width:0.26458332"
           x="18.784548"
           y="80.384842"
           id="text827-1-7-1"><tspan
             sodipodi:role="line"
             x="18.784548"
             y="80.384842"
             style="font-style:normal;font-variant:normal;font-weight:normal;font-stretch:normal;font-size:3.52777767px;font-family:sans-serif;-inkscape-font-specification:sans-serif;writing-mode:lr-tb;stroke-width:0.26458332"
             id="tspan884-0-7">Go to</tspan></text>
        <text
           xml:space="preserve"
           style="font-style:normal;font-weight:normal;font-size:10.58333302px;line-height:1.25;font-family:sans-serif;letter-spacing:0px;word-spacing:0px;fill:#000000;fill-opacity:1;stroke:none;stroke-width:0.26458332"
           x="16.821705"
           y="83.957169"
           id="text827-1-3-5-8"><tspan
             sodipodi:role="line"
             x="16.821705"
             y="83.957169"
             style="font-style:normal;font-variant:normal;font-weight:normal;font-stretch:normal;font-size:3.52777767px;font-family:sans-serif;-inkscape-font-specification:sans-serif;writing-mode:lr-tb;stroke-width:0.26458332"
             id="tspan884-8-2-8">Dropoff</tspan></text>
      </g>
    </g>
    <path
       style="fill:none;stroke:#000000;stroke-width:0.35;stroke-linecap:butt;stroke-linejoin:miter;stroke-miterlimit:4;stroke-dasharray:none;stroke-opacity:1;marker-start:url(#marker26429-0);marker-end:url(#marker13073-7-72-9-4)"
       d="M 70.279787,137 H 64.724733"
       id="path5400-6-8-7-9-9-6"
       inkscape:connector-curvature="0" />
    <g
       id="g1341"
       transform="translate(-6.614922,8.9143466)">
      <rect
         ry="2.1647737"
         y="122.13253"
         x="52.278393"
         height="11.906247"
         width="18.520832"
         id="rect823-6-8-6-6"
         style="opacity:1;fill:#f2f2f2;fill-opacity:1;stroke:#646464;stroke-width:0.5;stroke-linejoin:round;stroke-miterlimit:4;stroke-dasharray:2.00000006, 2.00000006;stroke-dashoffset:0;stroke-opacity:1" />
      <g
         transform="translate(38.87982,47.198809)"
         id="g910-2-1-7">
        <text
           xml:space="preserve"
           style="font-style:normal;font-weight:normal;font-size:10.58333302px;line-height:1.25;font-family:sans-serif;letter-spacing:0px;word-spacing:0px;fill:#000000;fill-opacity:1;stroke:none;stroke-width:0.26458332"
           x="17.877195"
           y="80.384842"
           id="text827-1-7-1-7"><tspan
             sodipodi:role="line"
             x="17.877195"
             y="80.384842"
             style="font-style:normal;font-variant:normal;font-weight:normal;font-stretch:normal;font-size:3.52777767px;font-family:sans-serif;-inkscape-font-specification:sans-serif;writing-mode:lr-tb;stroke-width:0.26458332"
             id="tspan884-0-7-4">Go to</tspan></text>
        <text
           xml:space="preserve"
           style="font-style:normal;font-weight:normal;font-size:10.58333302px;line-height:1.25;font-family:sans-serif;letter-spacing:0px;word-spacing:0px;fill:#000000;fill-opacity:1;stroke:none;stroke-width:0.26458332"
           x="18.06237"
           y="83.957169"
           id="text827-1-3-5-8-9"><tspan
             sodipodi:role="line"
             x="18.06237"
             y="83.957169"
             style="font-style:normal;font-variant:normal;font-weight:normal;font-stretch:normal;font-size:3.52777767px;font-family:sans-serif;-inkscape-font-specification:sans-serif;writing-mode:lr-tb;stroke-width:0.26458332"
             id="tspan884-8-2-8-0">Dock</tspan></text>
      </g>
    </g>
    <path
       style="fill:none;stroke:#000000;stroke-width:0.35;stroke-linecap:butt;stroke-linejoin:miter;stroke-miterlimit:4;stroke-dasharray:none;stroke-opacity:1;marker-start:url(#marker26429-9);marker-end:url(#marker13073-7-72-9-7)"
       d="m 120.30094,155 h -5.55506"
       id="path5400-6-8-7-9-9-3"
       inkscape:connector-curvature="0" />
    <g
       id="g1370"
       transform="translate(-4.5435799,1.9246386)">
      <rect
         ry="2.1647737"
         y="147.12224"
         x="100.32008"
         height="11.906247"
         width="18.520832"
         id="rect823-6-0"
         style="opacity:1;fill:#f2f2f2;fill-opacity:1;stroke:#646464;stroke-width:0.5;stroke-linejoin:round;stroke-miterlimit:4;stroke-dasharray:none;stroke-dashoffset:0;stroke-opacity:1" />
      <g
         transform="translate(86.196317,71.877589)"
         id="g910-27">
        <text
           xml:space="preserve"
           style="font-style:normal;font-weight:normal;font-size:10.58333302px;line-height:1.25;font-family:sans-serif;letter-spacing:0px;word-spacing:0px;fill:#000000;fill-opacity:1;stroke:none;stroke-width:0.26458332"
           x="17.139946"
           y="80.384842"
           id="text827-1-1"><tspan
             sodipodi:role="line"
             x="17.139946"
             y="80.384842"
             style="font-style:normal;font-variant:normal;font-weight:normal;font-stretch:normal;font-size:3.52777767px;font-family:sans-serif;-inkscape-font-specification:sans-serif;writing-mode:lr-tb;stroke-width:0.26458332"
             id="tspan884-6">Wait at</tspan></text>
        <text
           xml:space="preserve"
           style="font-style:normal;font-weight:normal;font-size:10.58333302px;line-height:1.25;font-family:sans-serif;letter-spacing:0px;word-spacing:0px;fill:#000000;fill-opacity:1;stroke:none;stroke-width:0.26458332"
           x="17.612785"
           y="83.957169"
           id="text827-1-3-2"><tspan
             sodipodi:role="line"
             x="17.612785"
             y="83.957169"
             style="font-style:normal;font-variant:normal;font-weight:normal;font-stretch:normal;font-size:3.52777767px;font-family:sans-serif;-inkscape-font-specification:sans-serif;writing-mode:lr-tb;stroke-width:0.26458332"
             id="tspan884-8-0">Pickup</tspan></text>
      </g>
    </g>
    <g
       id="g1349"
       transform="translate(-4.5435852,9.7161502)">
      <rect
         ry="2.1647737"
         y="121.33073"
         x="75.330391"
         height="11.906247"
         width="18.520832"
         id="rect823-6-0-4"
         style="opacity:1;fill:#f2f2f2;fill-opacity:1;stroke:#646464;stroke-width:0.5;stroke-linejoin:round;stroke-miterlimit:4;stroke-dasharray:none;stroke-dashoffset:0;stroke-opacity:1" />
      <g
         transform="translate(60.145965,46.031825)"
         id="g910-27-8">
        <text
           xml:space="preserve"
           style="font-style:normal;font-weight:normal;font-size:10.58333302px;line-height:1.25;font-family:sans-serif;letter-spacing:0px;word-spacing:0px;fill:#000000;fill-opacity:1;stroke:none;stroke-width:0.26458332"
           x="17.468521"
           y="80.384842"
           id="text827-1-1-2"><tspan
             sodipodi:role="line"
             x="17.468521"
             y="80.384842"
             style="font-style:normal;font-variant:normal;font-weight:normal;font-stretch:normal;font-size:3.52777767px;font-family:sans-serif;-inkscape-font-specification:sans-serif;writing-mode:lr-tb;stroke-width:0.26458332"
             id="tspan884-6-2">Reroute</tspan></text>
        <text
           xml:space="preserve"
           style="font-style:normal;font-weight:normal;font-size:10.58333302px;line-height:1.25;font-family:sans-serif;letter-spacing:0px;word-spacing:0px;fill:#000000;fill-opacity:1;stroke:none;stroke-width:0.26458332"
           x="17.376366"
           y="83.957169"
           id="text827-1-3-2-3"><tspan
             sodipodi:role="line"
             x="17.376366"
             y="83.957169"
             style="font-style:normal;font-variant:normal;font-weight:normal;font-stretch:normal;font-size:3.52777767px;font-family:sans-serif;-inkscape-font-specification:sans-serif;writing-mode:lr-tb;stroke-width:0.26458332"
             id="tspan884-8-0-3">Pending</tspan></text>
      </g>
    </g>
    <g
       id="g1362"
       transform="translate(-3.8754092,2.8600787)">
      <rect
         ry="2.1647737"
         y="146.1868"
         x="24.549179"
         height="11.906247"
         width="18.520832"
         id="rect823-2"
         style="opacity:1;fill:#f2f2f2;fill-opacity:1;stroke:#646464;stroke-width:0.5;stroke-linejoin:round;stroke-miterlimit:4;stroke-dasharray:2.00000006, 2.00000006;stroke-dashoffset:0;stroke-opacity:1" />
      <text
         id="text827-7"
         y="153.11316"
         x="27.06496"
         style="font-style:normal;font-weight:normal;font-size:10.58333302px;line-height:1.25;font-family:sans-serif;letter-spacing:0px;word-spacing:0px;fill:#000000;fill-opacity:1;stroke:none;stroke-width:0.26458332"
         xml:space="preserve"><tspan
           style="font-style:normal;font-variant:normal;font-weight:normal;font-stretch:normal;font-size:3.52777767px;font-family:sans-serif;-inkscape-font-specification:sans-serif;stroke-width:0.26458332"
           y="153.11316"
           x="27.06496"
           id="tspan825-2"
           sodipodi:role="line">Dropoff</tspan></text>
    </g>
    <g
       id="g1383"
       transform="translate(-10.824418,1.1228198)">
      <rect
         ry="2.1647737"
         y="147.92406"
         x="131.59062"
         height="11.906247"
         width="18.520832"
         id="rect823-4"
         style="opacity:1;fill:#f2f2f2;fill-opacity:1;stroke:#646464;stroke-width:0.5;stroke-linejoin:round;stroke-miterlimit:4;stroke-dasharray:2.00000006, 2.00000006;stroke-dashoffset:0;stroke-opacity:1" />
      <text
         id="text827-5"
         y="154.85042"
         x="135.07964"
         style="font-style:normal;font-weight:normal;font-size:10.58333302px;line-height:1.25;font-family:sans-serif;letter-spacing:0px;word-spacing:0px;fill:#000000;fill-opacity:1;stroke:none;stroke-width:0.26458332"
         xml:space="preserve"><tspan
           style="font-style:normal;font-variant:normal;font-weight:normal;font-stretch:normal;font-size:3.52777767px;font-family:sans-serif;-inkscape-font-specification:sans-serif;stroke-width:0.26458332"
           y="154.85042"
           x="135.07964"
           id="tspan825-4"
           sodipodi:role="line">Pickup</tspan></text>
    </g>
    <path
       style="fill:none;stroke:#000000;stroke-width:0.35;stroke-linecap:butt;stroke-linejoin:miter;stroke-miterlimit:4;stroke-dasharray:none;stroke-opacity:1;marker-end:url(#marker13509)"
       d="m 64.190664,79.004669 h 6.09793"
       id="path5400-6-6"
       inkscape:connector-curvature="0" />
    <path
       style="fill:none;stroke:#000000;stroke-width:0.35;stroke-linecap:butt;stroke-linejoin:miter;stroke-miterlimit:4;stroke-dasharray:none;stroke-opacity:1;marker-end:url(#marker13173)"
       d="M 54.923887,91.546243 V 85.448318"
       id="path5400-6-6-8-8"
       inkscape:connector-curvature="0" />
    <g
       id="g1393"
       transform="translate(-10.289879,28.689772)">
      <rect
         ry="2.1647737"
         y="44.357105"
         x="55.95335"
         height="11.906247"
         width="18.520832"
         id="rect823-1"
         style="opacity:1;fill:#f2f2f2;fill-opacity:1;stroke:#646464;stroke-width:0.5;stroke-linejoin:round;stroke-miterlimit:4;stroke-dasharray:none;stroke-dashoffset:0;stroke-opacity:1" />
      <text
         id="text827-6"
         y="51.625393"
         x="58.627605"
         style="font-style:normal;font-weight:normal;font-size:10.58333302px;line-height:1.25;font-family:sans-serif;letter-spacing:0px;word-spacing:0px;fill:#000000;fill-opacity:1;stroke:none;stroke-width:0.26458332"
         xml:space="preserve"><tspan
           style="font-style:normal;font-variant:normal;font-weight:normal;font-stretch:normal;font-size:3.52777767px;font-family:sans-serif;-inkscape-font-specification:sans-serif;stroke-width:0.26458332"
           y="51.625393"
           x="58.627605"
           id="tspan825-8"
           sodipodi:role="line">Docked</tspan></text>
    </g>
    <path
       style="fill:none;stroke:#000000;stroke-width:0.35;stroke-linecap:butt;stroke-linejoin:miter;stroke-miterlimit:4;stroke-dasharray:none;stroke-opacity:1;marker-end:url(#marker13063)"
       d="m 70.811519,96.995332 h -6.09793"
       id="path5400-6-6-8"
       inkscape:connector-curvature="0" />
    <g
       id="g1325"
       transform="translate(-9.6217049,25.17457)">
      <rect
         ry="2.1647737"
         y="65.872307"
         x="55.285175"
         height="11.906247"
         width="18.520832"
         id="rect823-6-8-6-6-0"
         style="opacity:1;fill:#f2f2f2;fill-opacity:1;stroke:#646464;stroke-width:0.5;stroke-linejoin:round;stroke-miterlimit:4;stroke-dasharray:2.00000006, 2.00000006;stroke-dashoffset:0;stroke-opacity:1" />
      <g
         transform="translate(39.531449,-9.3723354)"
         id="g910-2-1-7-4">
        <text
           xml:space="preserve"
           style="font-style:normal;font-weight:normal;font-size:10.58333302px;line-height:1.25;font-family:sans-serif;letter-spacing:0px;word-spacing:0px;fill:#000000;fill-opacity:1;stroke:none;stroke-width:0.26458332"
           x="20.417522"
           y="80.384842"
           id="text827-1-7-1-7-8"><tspan
             sodipodi:role="line"
             x="20.417522"
             y="80.384842"
             style="font-style:normal;font-variant:normal;font-weight:normal;font-stretch:normal;font-size:3.52777767px;font-family:sans-serif;-inkscape-font-specification:sans-serif;writing-mode:lr-tb;stroke-width:0.26458332"
             id="tspan884-0-7-4-8">Dock</tspan></text>
        <text
           xml:space="preserve"
           style="font-style:normal;font-weight:normal;font-size:10.58333302px;line-height:1.25;font-family:sans-serif;letter-spacing:0px;word-spacing:0px;fill:#000000;fill-opacity:1;stroke:none;stroke-width:0.26458332"
           x="17.969784"
           y="83.957169"
           id="text827-1-3-5-8-9-3"><tspan
             sodipodi:role="line"
             x="17.969784"
             y="83.957169"
             style="font-style:normal;font-variant:normal;font-weight:normal;font-stretch:normal;font-size:3.52777767px;font-family:sans-serif;-inkscape-font-specification:sans-serif;writing-mode:lr-tb;stroke-width:0.26458332"
             id="tspan884-8-2-8-0-5">Landing</tspan></text>
      </g>
    </g>
    <path
       style="fill:none;stroke:#000000;stroke-width:0.35;stroke-linecap:butt;stroke-linejoin:miter;stroke-miterlimit:4;stroke-dasharray:none;stroke-opacity:1;marker-end:url(#marker13073)"
       d="m 80.047222,84.369314 v 6.097929"
       id="path5400-6-8"
       inkscape:connector-curvature="0" />
    <g
       id="g1333"
       transform="translate(-17.506155,25.308214)">
      <rect
         ry="2.1647737"
         y="65.738663"
         x="88.292961"
         height="11.906247"
         width="18.520832"
         id="rect823-6-8-6-6-2"
         style="opacity:1;fill:#f2f2f2;fill-opacity:1;stroke:#646464;stroke-width:0.5;stroke-linejoin:round;stroke-miterlimit:4;stroke-dasharray:none;stroke-dashoffset:0;stroke-opacity:1" />
      <g
         transform="translate(73.431946,-9.1640538)"
         id="g910-2-1-7-47">
        <text
           xml:space="preserve"
           style="font-style:normal;font-weight:normal;font-size:10.58333302px;line-height:1.25;font-family:sans-serif;letter-spacing:0px;word-spacing:0px;fill:#000000;fill-opacity:1;stroke:none;stroke-width:0.26458332"
           x="17.877195"
           y="80.384842"
           id="text827-1-7-1-7-4"><tspan
             sodipodi:role="line"
             x="17.877195"
             y="80.384842"
             style="font-style:normal;font-variant:normal;font-weight:normal;font-stretch:normal;font-size:3.52777767px;font-family:sans-serif;-inkscape-font-specification:sans-serif;writing-mode:lr-tb;stroke-width:0.26458332"
             id="tspan884-0-7-4-7">Wait at</tspan></text>
        <text
           xml:space="preserve"
           style="font-style:normal;font-weight:normal;font-size:10.58333302px;line-height:1.25;font-family:sans-serif;letter-spacing:0px;word-spacing:0px;fill:#000000;fill-opacity:1;stroke:none;stroke-width:0.26458332"
           x="19.524813"
           y="83.957169"
           id="text827-1-3-5-8-9-5"><tspan
             sodipodi:role="line"
             x="19.524813"
             y="83.957169"
             style="font-style:normal;font-variant:normal;font-weight:normal;font-stretch:normal;font-size:3.52777767px;font-family:sans-serif;-inkscape-font-specification:sans-serif;writing-mode:lr-tb;stroke-width:0.26458332"
             id="tspan884-8-2-8-0-6">Dock</tspan></text>
      </g>
    </g>
    <g
       id="g1398"
       transform="translate(-18.17433,27.620695)">
      <rect
         ry="2.1647737"
         y="45.426182"
         x="88.961136"
         height="11.906247"
         width="18.520832"
         id="rect823-5"
         style="opacity:1;fill:#f2f2f2;fill-opacity:1;stroke:#646464;stroke-width:0.5;stroke-linejoin:round;stroke-miterlimit:4;stroke-dasharray:2.00000006, 2.00000006;stroke-dashoffset:0;stroke-opacity:1" />
      <text
         id="text827-76"
         y="52.694469"
         x="91.985931"
         style="font-style:normal;font-weight:normal;font-size:10.58333302px;line-height:1.25;font-family:sans-serif;letter-spacing:0px;word-spacing:0px;fill:#000000;fill-opacity:1;stroke:none;stroke-width:0.26458332"
         xml:space="preserve"><tspan
           style="font-style:normal;font-variant:normal;font-weight:normal;font-stretch:normal;font-size:3.52777767px;font-family:sans-serif;-inkscape-font-specification:sans-serif;stroke-width:0.26458332"
           y="52.694469"
           x="91.985931"
           id="tspan825-9"
           sodipodi:role="line">Takeoff</tspan></text>
    </g>
    <g
       id="g1403"
       transform="translate(-53.516568,70.06399)">
      <rect
         ry="2.1647737"
         y="20.982887"
         x="74.190338"
         height="11.906247"
         width="18.520832"
         id="rect823-5-7"
         style="opacity:1;fill:#f2f2f2;fill-opacity:1;stroke:#646464;stroke-width:0.5;stroke-linejoin:round;stroke-miterlimit:4;stroke-dasharray:none;stroke-dashoffset:0;stroke-opacity:1" />
      <text
         id="text827-76-0"
         y="28.251177"
         x="74.673508"
         style="font-style:normal;font-weight:normal;font-size:10.58333302px;line-height:1.25;font-family:sans-serif;letter-spacing:0px;word-spacing:0px;fill:#000000;fill-opacity:1;stroke:none;stroke-width:0.26458332"
         xml:space="preserve"><tspan
           style="font-style:normal;font-variant:normal;font-weight:normal;font-stretch:normal;font-size:3.52777767px;font-family:sans-serif;-inkscape-font-specification:sans-serif;stroke-width:0.26458332"
           y="28.251177"
           x="74.673508"
           id="tspan825-9-3"
           sodipodi:role="line">Shutdown</tspan></text>
    </g>
    <g
       id="g1298"
       transform="translate(-12.178969,-54.023802)">
      <rect
         ry="2.1480837"
         y="167.07068"
         x="82.965775"
         height="11.906247"
         width="18.520832"
         id="rect823-6-5"
         style="opacity:1;fill:#f2f2f2;fill-opacity:1;stroke:#646464;stroke-width:0.5;stroke-linejoin:round;stroke-miterlimit:4;stroke-dasharray:2.00000006, 2.00000006;stroke-dashoffset:0;stroke-opacity:1" />
      <g
         id="g5279-9"
         clip-path="url(#clipPath5295-9)"
         transform="translate(-47.060845,62.77201)">
        <path
           sodipodi:nodetypes="ccc"
           mask="none"
           inkscape:connector-curvature="0"
           id="path5137-1"
           d="m 133.48397,102.74312 -1.98624,2.4174 -2.42437,2.95062"
           style="fill:none;stroke:#bebebe;stroke-width:0.26458332px;stroke-linecap:butt;stroke-linejoin:miter;stroke-opacity:1" />
        <path
           sodipodi:nodetypes="ccc"
           mask="none"
           inkscape:connector-curvature="0"
           id="path5137-9-2"
           d="m 136.7245,103.49599 -3.01676,3.66052 -3.68218,4.46795"
           style="fill:none;stroke:#bebebe;stroke-width:0.26458332px;stroke-linecap:butt;stroke-linejoin:miter;stroke-opacity:1" />
        <path
           sodipodi:nodetypes="ccc"
           mask="none"
           inkscape:connector-curvature="0"
           id="path5137-9-4-6"
           d="m 140.74894,103.31231 -4.82861,5.85381 -5.89371,7.14506"
           style="fill:none;stroke:#bebebe;stroke-width:0.26458332px;stroke-linecap:butt;stroke-linejoin:miter;stroke-opacity:1" />
        <path
           sodipodi:nodetypes="ccc"
           mask="none"
           inkscape:connector-curvature="0"
           id="path5137-9-4-8-4"
           d="m 144.86475,103.01748 -5.3755,6.51337 -6.56121,7.95012"
           style="fill:none;stroke:#bebebe;stroke-width:0.26458332px;stroke-linecap:butt;stroke-linejoin:miter;stroke-opacity:1" />
        <path
           sodipodi:nodetypes="ccc"
           mask="none"
           inkscape:connector-curvature="0"
           id="path5137-9-4-8-2-7"
           d="m 148.23609,103.6224 -5.21694,6.32175 -6.36768,7.71623"
           style="fill:none;stroke:#bebebe;stroke-width:0.26458332px;stroke-linecap:butt;stroke-linejoin:miter;stroke-opacity:1" />
        <path
           sodipodi:nodetypes="ccc"
           mask="none"
           inkscape:connector-curvature="0"
           id="path5137-9-4-8-2-3-9"
           d="m 149.45749,106.82246 -3.94972,4.79032 -4.82093,5.84698"
           style="fill:none;stroke:#bebebe;stroke-width:0.26458332px;stroke-linecap:butt;stroke-linejoin:miter;stroke-opacity:1" />
        <path
           sodipodi:nodetypes="ccc"
           mask="none"
           inkscape:connector-curvature="0"
           id="path5137-9-4-8-2-3-6-3"
           d="m 149.73601,111.15951 -2.29415,2.78952 -2.80017,3.40484"
           style="fill:none;stroke:#bebebe;stroke-width:0.26458332px;stroke-linecap:butt;stroke-linejoin:miter;stroke-opacity:1" />
      </g>
      <g
         transform="translate(67.302483,92.167962)"
         id="g910-1">
        <text
           xml:space="preserve"
           style="font-style:normal;font-weight:normal;font-size:10.58333302px;line-height:1.25;font-family:sans-serif;letter-spacing:0px;word-spacing:0px;fill:#000000;fill-opacity:1;stroke:none;stroke-width:0.26458332"
           x="17.170521"
           y="80.384842"
           id="text827-1-5"><tspan
             sodipodi:role="line"
             x="17.170521"
             y="80.384842"
             style="font-style:normal;font-variant:normal;font-weight:normal;font-stretch:normal;font-size:3.52777767px;font-family:sans-serif;-inkscape-font-specification:sans-serif;writing-mode:lr-tb;stroke-width:0.26458332"
             id="tspan884-1">Obstacle</tspan></text>
        <text
           xml:space="preserve"
           style="font-style:normal;font-weight:normal;font-size:10.58333302px;line-height:1.25;font-family:sans-serif;letter-spacing:0px;word-spacing:0px;fill:#000000;fill-opacity:1;stroke:none;stroke-width:0.26458332"
           x="16.821705"
           y="83.957169"
           id="text827-1-3-1"><tspan
             sodipodi:role="line"
             x="16.821705"
             y="83.957169"
             style="font-style:normal;font-variant:normal;font-weight:normal;font-stretch:normal;font-size:3.52777767px;font-family:sans-serif;-inkscape-font-specification:sans-serif;writing-mode:lr-tb;stroke-width:0.26458332"
             id="tspan884-8-5">Detected</tspan></text>
      </g>
    </g>
    <rect
       style="opacity:1;fill:#c8c8c8;fill-opacity:1;stroke:#646464;stroke-width:0.1;stroke-linejoin:round;stroke-miterlimit:4;stroke-dasharray:none;stroke-dashoffset:0;stroke-opacity:1"
       id="rect3652"
       width="25.070526"
       height="50.462696"
       x="110.61222"
       y="76.853088"
       ry="0" />
    <g
       id="g1317-6"
       transform="translate(61.016717,-61.360318)">
      <rect
         ry="2.1647737"
         y="146.45406"
         x="52.870316"
         height="11.906247"
         width="18.520832"
         id="rect823-6-7"
         style="opacity:1;fill:#f2f2f2;fill-opacity:1;stroke:#646464;stroke-width:0.5;stroke-linejoin:round;stroke-miterlimit:4;stroke-dasharray:2, 2;stroke-dashoffset:0;stroke-opacity:1" />
      <g
         transform="translate(36.928833,71.497079)"
         id="g910-8">
        <text
           xml:space="preserve"
           style="font-style:normal;font-weight:normal;font-size:10.58333302px;line-height:1.25;font-family:sans-serif;letter-spacing:0px;word-spacing:0px;fill:#000000;fill-opacity:1;stroke:none;stroke-width:0.26458332"
           x="21.187502"
           y="80.384842"
           id="text827-1-6"><tspan
             sodipodi:role="line"
             x="21.187502"
             y="80.384842"
             style="font-style:normal;font-variant:normal;font-weight:normal;font-stretch:normal;font-size:3.52777767px;font-family:sans-serif;-inkscape-font-specification:sans-serif;writing-mode:lr-tb;stroke-width:0.26458332"
             id="tspan884-2">Auto</tspan></text>
        <text
           xml:space="preserve"
           style="font-style:normal;font-weight:normal;font-size:10.58333302px;line-height:1.25;font-family:sans-serif;letter-spacing:0px;word-spacing:0px;fill:#000000;fill-opacity:1;stroke:none;stroke-width:0.26458332"
           x="16.821705"
           y="83.957169"
           id="text827-1-3-51"><tspan
             sodipodi:role="line"
             x="16.821705"
             y="83.957169"
             style="font-style:normal;font-variant:normal;font-weight:normal;font-stretch:normal;font-size:3.52777767px;font-family:sans-serif;-inkscape-font-specification:sans-serif;writing-mode:lr-tb;stroke-width:0.26458332"
             id="tspan884-8-00">Transition</tspan></text>
      </g>
    </g>
    <g
       id="g1317-6-0"
       transform="translate(61.016717,-47.383749)">
      <rect
         ry="2.1647737"
         y="146.45406"
         x="52.870316"
         height="11.906247"
         width="18.520832"
         id="rect823-6-7-8"
         style="opacity:1;fill:#f2f2f2;fill-opacity:1;stroke:#646464;stroke-width:0.5;stroke-linejoin:round;stroke-miterlimit:4;stroke-dasharray:none;stroke-dashoffset:0;stroke-opacity:1" />
      <g
         transform="translate(36.881032,71.551339)"
         id="g910-8-2">
        <text
           xml:space="preserve"
           style="font-style:normal;font-weight:normal;font-size:10.58333302px;line-height:1.25;font-family:sans-serif;letter-spacing:0px;word-spacing:0px;fill:#000000;fill-opacity:1;stroke:none;stroke-width:0.26458332"
           x="18.826321"
           y="80.384842"
           id="text827-1-6-8"><tspan
             sodipodi:role="line"
             x="18.826321"
             y="80.384842"
             style="font-style:normal;font-variant:normal;font-weight:normal;font-stretch:normal;font-size:3.52777767px;font-family:sans-serif;-inkscape-font-specification:sans-serif;writing-mode:lr-tb;stroke-width:0.26458332"
             id="tspan884-2-8">Manual</tspan></text>
        <text
           xml:space="preserve"
           style="font-style:normal;font-weight:normal;font-size:10.58333302px;line-height:1.25;font-family:sans-serif;letter-spacing:0px;word-spacing:0px;fill:#000000;fill-opacity:1;stroke:none;stroke-width:0.26458332"
           x="16.869505"
           y="83.957169"
           id="text827-1-3-51-7"><tspan
             sodipodi:role="line"
             x="16.869505"
             y="83.957169"
             style="font-style:normal;font-variant:normal;font-weight:normal;font-stretch:normal;font-size:3.52777767px;font-family:sans-serif;-inkscape-font-specification:sans-serif;writing-mode:lr-tb;stroke-width:0.26458332"
             id="tspan884-8-00-0">Transition</tspan></text>
      </g>
    </g>
    <g
       id="g1317-6-0-1"
       transform="translate(61.016717,-33.407179)">
      <rect
         ry="2.1647737"
         y="146.45406"
         x="52.870316"
         height="11.906247"
         width="18.520832"
         id="rect823-6-7-8-5"
         style="opacity:1;fill:#f2f2f2;fill-opacity:1;stroke:#646464;stroke-width:0.5;stroke-linejoin:round;stroke-miterlimit:4;stroke-dasharray:none;stroke-dashoffset:0;stroke-opacity:1" />
      <g
         id="g5279-0"
         clip-path="url(#clipPath5295-7)"
         transform="translate(-77.156304,42.155386)">
        <path
           sodipodi:nodetypes="ccc"
           mask="none"
           inkscape:connector-curvature="0"
           id="path5137-0"
           d="m 133.48397,102.74312 -1.98624,2.4174 -2.42437,2.95062"
           style="fill:none;stroke:#bebebe;stroke-width:0.26458332px;stroke-linecap:butt;stroke-linejoin:miter;stroke-opacity:1" />
        <path
           sodipodi:nodetypes="ccc"
           mask="none"
           inkscape:connector-curvature="0"
           id="path5137-9-0"
           d="m 136.7245,103.49599 -3.01676,3.66052 -3.68218,4.46795"
           style="fill:none;stroke:#bebebe;stroke-width:0.26458332px;stroke-linecap:butt;stroke-linejoin:miter;stroke-opacity:1" />
        <path
           sodipodi:nodetypes="ccc"
           mask="none"
           inkscape:connector-curvature="0"
           id="path5137-9-4-4"
           d="m 140.74894,103.31231 -4.82861,5.85381 -5.89371,7.14506"
           style="fill:none;stroke:#bebebe;stroke-width:0.26458332px;stroke-linecap:butt;stroke-linejoin:miter;stroke-opacity:1" />
        <path
           sodipodi:nodetypes="ccc"
           mask="none"
           inkscape:connector-curvature="0"
           id="path5137-9-4-8-0"
           d="m 144.86475,103.01748 -5.3755,6.51337 -6.56121,7.95012"
           style="fill:none;stroke:#bebebe;stroke-width:0.26458332px;stroke-linecap:butt;stroke-linejoin:miter;stroke-opacity:1" />
        <path
           sodipodi:nodetypes="ccc"
           mask="none"
           inkscape:connector-curvature="0"
           id="path5137-9-4-8-2-8"
           d="m 148.23609,103.6224 -5.21694,6.32175 -6.36768,7.71623"
           style="fill:none;stroke:#bebebe;stroke-width:0.26458332px;stroke-linecap:butt;stroke-linejoin:miter;stroke-opacity:1" />
        <path
           sodipodi:nodetypes="ccc"
           mask="none"
           inkscape:connector-curvature="0"
           id="path5137-9-4-8-2-3-1"
           d="m 149.45749,106.82246 -3.94972,4.79032 -4.82093,5.84698"
           style="fill:none;stroke:#bebebe;stroke-width:0.26458332px;stroke-linecap:butt;stroke-linejoin:miter;stroke-opacity:1" />
        <path
           sodipodi:nodetypes="ccc"
           mask="none"
           inkscape:connector-curvature="0"
           id="path5137-9-4-8-2-3-6-1"
           d="m 149.73601,111.15951 -2.29415,2.78952 -2.80017,3.40484"
           style="fill:none;stroke:#bebebe;stroke-width:0.26458332px;stroke-linecap:butt;stroke-linejoin:miter;stroke-opacity:1" />
      </g>
      <g
         transform="translate(36.738922,71.155153)"
         id="g910-8-2-0">
        <text
           xml:space="preserve"
           style="font-style:normal;font-weight:normal;font-size:10.58333302px;line-height:1.25;font-family:sans-serif;letter-spacing:0px;word-spacing:0px;fill:#000000;fill-opacity:1;stroke:none;stroke-width:0.26458332"
           x="20.994146"
           y="80.384842"
           id="text827-1-6-8-8"><tspan
             sodipodi:role="line"
             x="20.994146"
             y="80.384842"
             style="font-style:normal;font-variant:normal;font-weight:normal;font-stretch:normal;font-size:3.52777767px;font-family:sans-serif;-inkscape-font-specification:sans-serif;writing-mode:lr-tb;stroke-width:0.26458332"
             id="tspan884-2-8-0">From</tspan></text>
        <text
           xml:space="preserve"
           style="font-style:normal;font-weight:normal;font-size:10.58333302px;line-height:1.25;font-family:sans-serif;letter-spacing:0px;word-spacing:0px;fill:#000000;fill-opacity:1;stroke:none;stroke-width:0.26458332"
           x="16.869505"
           y="83.957169"
           id="text827-1-3-51-7-7"><tspan
             sodipodi:role="line"
             x="16.869505"
             y="83.957169"
             style="font-style:normal;font-variant:normal;font-weight:normal;font-stretch:normal;font-size:3.52777767px;font-family:sans-serif;-inkscape-font-specification:sans-serif;writing-mode:lr-tb;stroke-width:0.26458332"
             id="tspan884-8-00-0-1">Any State</tspan></text>
      </g>
    </g>
    <text
       xml:space="preserve"
       style="font-style:normal;font-weight:normal;font-size:10.58333302px;line-height:1.25;font-family:sans-serif;letter-spacing:0px;word-spacing:0px;fill:#000000;fill-opacity:1;stroke:none;stroke-width:0.26458332"
       x="118.67039"
       y="82.178352"
       id="text3656"><tspan
         sodipodi:role="line"
         id="tspan3654"
         x="118.67039"
         y="82.178352"
         style="font-size:4.93888903px;stroke-width:0.26458332">key</tspan></text>
    <g
       id="g34118"
       style="opacity:0.4">
      <path
         inkscape:connector-curvature="0"
         id="path10867-5"
         d="m 38.505625,124.33789 7.25234,7.25233"
         style="fill:none;stroke:#000000;stroke-width:0.34999999;stroke-linecap:butt;stroke-linejoin:miter;stroke-miterlimit:4;stroke-dasharray:none;stroke-opacity:1;marker-end:url(#marker13279-8)" />
      <path
         inkscape:connector-curvature="0"
         id="path5400-6-6-8-8-1"
         d="m 29.934361,113.11199 v -9.46841"
         style="fill:none;stroke:#000000;stroke-width:0.35000002;stroke-linecap:butt;stroke-linejoin:miter;stroke-miterlimit:4;stroke-dasharray:none;stroke-opacity:1;marker-end:url(#marker13173-2)" />
      <g
         transform="translate(-111.94052,-5.8577404)"
         id="g1388-5"
         style="">
        <rect
           style="opacity:1;fill:#f2f2f2;fill-opacity:1;stroke:#646464;stroke-width:0.5;stroke-linejoin:round;stroke-miterlimit:4;stroke-dasharray:none;stroke-dashoffset:0;stroke-opacity:1"
           id="rect823-4-2-1"
           width="18.520832"
           height="11.906247"
           x="132.61429"
           y="118.90462"
           ry="2.1647737" />
        <g
           transform="translate(2.5876687,14.605948)"
           clip-path="url(#clipPath5295-0)"
           id="g5279"
           style="">
          <path
             style="fill:none;stroke:#bebebe;stroke-width:0.26458332px;stroke-linecap:butt;stroke-linejoin:miter;stroke-opacity:1"
             d="m 133.48397,102.74312 -1.98624,2.4174 -2.42437,2.95062"
             id="path5137"
             inkscape:connector-curvature="0"
             mask="none"
             sodipodi:nodetypes="ccc" />
          <path
             style="fill:none;stroke:#bebebe;stroke-width:0.26458332px;stroke-linecap:butt;stroke-linejoin:miter;stroke-opacity:1"
             d="m 136.7245,103.49599 -3.01676,3.66052 -3.68218,4.46795"
             id="path5137-9"
             inkscape:connector-curvature="0"
             mask="none"
             sodipodi:nodetypes="ccc" />
          <path
             style="fill:none;stroke:#bebebe;stroke-width:0.26458332px;stroke-linecap:butt;stroke-linejoin:miter;stroke-opacity:1"
             d="m 140.74894,103.31231 -4.82861,5.85381 -5.89371,7.14506"
             id="path5137-9-4"
             inkscape:connector-curvature="0"
             mask="none"
             sodipodi:nodetypes="ccc" />
          <path
             style="fill:none;stroke:#bebebe;stroke-width:0.26458332px;stroke-linecap:butt;stroke-linejoin:miter;stroke-opacity:1"
             d="m 144.86475,103.01748 -5.3755,6.51337 -6.56121,7.95012"
             id="path5137-9-4-8"
             inkscape:connector-curvature="0"
             mask="none"
             sodipodi:nodetypes="ccc" />
          <path
             style="fill:none;stroke:#bebebe;stroke-width:0.26458332px;stroke-linecap:butt;stroke-linejoin:miter;stroke-opacity:1"
             d="m 148.23609,103.6224 -5.21694,6.32175 -6.36768,7.71623"
             id="path5137-9-4-8-2"
             inkscape:connector-curvature="0"
             mask="none"
             sodipodi:nodetypes="ccc" />
          <path
             style="fill:none;stroke:#bebebe;stroke-width:0.26458332px;stroke-linecap:butt;stroke-linejoin:miter;stroke-opacity:1"
             d="m 149.45749,106.82246 -3.94972,4.79032 -4.82093,5.84698"
             id="path5137-9-4-8-2-3"
             inkscape:connector-curvature="0"
             mask="none"
             sodipodi:nodetypes="ccc" />
          <path
             style="fill:none;stroke:#bebebe;stroke-width:0.26458332px;stroke-linecap:butt;stroke-linejoin:miter;stroke-opacity:1"
             d="m 149.73601,111.15951 -2.29415,2.78952 -2.80017,3.40484"
             id="path5137-9-4-8-2-3-6"
             inkscape:connector-curvature="0"
             mask="none"
             sodipodi:nodetypes="ccc" />
        </g>
        <text
           xml:space="preserve"
           style="font-style:normal;font-weight:normal;font-size:10.58333302px;line-height:1.25;font-family:sans-serif;letter-spacing:0px;word-spacing:0px;fill:#000000;fill-opacity:1;stroke:none;stroke-width:0.26458332"
           x="135.45132"
           y="126.17291"
           id="text827-5-3-3"><tspan
             sodipodi:role="line"
             id="tspan825-4-8-3"
             x="135.45132"
             y="126.17291"
             style="font-style:normal;font-variant:normal;font-weight:normal;font-stretch:normal;font-size:3.52777767px;font-family:sans-serif;-inkscape-font-specification:sans-serif;stroke-width:0.26458332">Manual</tspan></text>
      </g>
      <text
         id="text34084"
         y="126.61869"
         x="25.022512"
         style="font-style:normal;font-weight:normal;font-size:10.58333302px;line-height:1.25;font-family:sans-serif;letter-spacing:0px;word-spacing:0px;fill:#000000;fill-opacity:1;stroke:none;stroke-width:0.26458332"
         xml:space="preserve"><tspan
           style="font-size:1.41111112px;line-height:1;stroke-width:0.26458332"
           y="126.61869"
           x="25.022512"
           id="tspan34082"
           sodipodi:role="line">for debugging</tspan></text>
    </g>
  </g>
</svg>
