<?xml version="1.0"?>

<robot xmlns:sensor="http://playerstage.sourceforge.net/gazebo/xmlschema/#sensor"
xmlns:controller="http://playerstage.sourceforge.net/gazebo/xmlschema/#controller"
xmlns:interface="http://playerstage.sourceforge.net/gazebo/xmlschema/#interface"
xmlns:xacro="http://ros.org/wiki/xacro"
>

  <property name="pi" value="3.1415926535897931" />

  <!-- Main quadrotor link -->
  <xacro:macro name="quadrotor_base_macro" params="quad_name">
    <link name="${quad_name}/base">
      <inertial>
        <mass value="1.316" />
        <origin xyz="0 0 0" />
        <inertia ixx="0.0128" ixy="0.0" ixz="0.0" iyy="0.0128" iyz="0.0" izz="0.0218" />
      </inertial>

      <visual>
        <origin xyz="0 0 0" rpy="0 0 0" />
        <geometry>
          <mesh filename="package://raven_rviz/vehicle_models/quadrotor_base.dae"/>
        </geometry>
      </visual>

      <collision>
        <origin xyz="0 0 0" rpy="0 0 0" />
        <geometry>
          <mesh filename="package://raven_rviz/vehicle_models/quadrotor_base.stl"/>
        </geometry>
      </collision>
    </link>
    
  </xacro:macro>
</robot>
