m1: -0.850000  m2: -1.160000  m3: -1.350000  m4: 3.360000
m1: -1.490000  m2: -4.110000  m3: 3.210000  m4: 2.390000
m1: -1.126960  m2: 1.786220  m3: -1.924550  m4: 1.265250
m1: 1.141793  m2: 1.086776  m3: -0.975395  m4: -1.252955
m1: -1.394868  m2: 1.022907  m3: -0.974365  m4: 1.346287
m1: 0.615255  m2: 0.776833  m3: -1.164234  m4: -0.228444
m1: 0.131615  m2: 1.806267  m3: -2.308154  m4: 0.370852
m1: -0.308058  m2: 1.556316  m3: -1.421948  m4: 0.173351
m1: -0.652598  m2: 2.057726  m3: -2.092272  m4: 0.686833
m1: -1.511020  m2: 2.259790  m3: -2.498620  m4: 1.749410
m1: -0.921441  m2: 2.528610  m3: -2.114079  m4: 0.506759
m1: 0.939240  m2: 0.584100  m3: -0.799960  m4: -0.723590
m1: 0.750505  m2: 0.543570  m3: -0.977368  m4: -0.316473
m1: 0.759398  m2: 0.858154  m3: -2.343763  m4: 0.725772
m1: 0.738660  m2: 1.269417  m3: -2.017672  m4: 0.009015
m1: 0.431413  m2: 2.340285  m3: -2.779098  m4: 0.007530
m1: 1.514457  m2: 0.750668  m3: -1.471776  m4: -0.793512
