idx;name;completion_node;completion_tol;
0;goto_b1;B1;0.5;
1;goto_b2;B2;0.5;
2;goto_d1;D1;0.5;
3;goto_d2;D2;0.5;
4;pickup_pkg;NoChange;999;
5;pickup_pkg;NoChange;999;
6;putdown_pkg;NoChange;999;
7;putdown_pkg;NoChange;999;
8;wait;NoChange;999;
9;goto_d3;D3;0.5;
10;goto_r;R;0.5;