<?xml version="1.0" encoding="UTF-8" standalone="no"?>
<!-- Created with Inkscape (http://www.inkscape.org/) -->

<svg
   xmlns:dc="http://purl.org/dc/elements/1.1/"
   xmlns:cc="http://creativecommons.org/ns#"
   xmlns:rdf="http://www.w3.org/1999/02/22-rdf-syntax-ns#"
   xmlns:svg="http://www.w3.org/2000/svg"
   xmlns="http://www.w3.org/2000/svg"
   xmlns:sodipodi="http://sodipodi.sourceforge.net/DTD/sodipodi-0.dtd"
   xmlns:inkscape="http://www.inkscape.org/namespaces/inkscape"
   width="134.66922mm"
   height="134.66922mm"
   viewBox="0 0 134.66923 134.66922"
   version="1.1"
   id="svg8"
   sodipodi:docname="icon.svg"
   inkscape:version="0.92.1 r15371"
   inkscape:export-filename="/home/warr/git/gitlab.com/sztest/nodecore/menu/icon.png"
   inkscape:export-xdpi="24.139999"
   inkscape:export-ydpi="24.139999">
  <defs
     id="defs2">
    <inkscape:perspective
       sodipodi:type="inkscape:persp3d"
       inkscape:vp_x="10.583334 : 113.72616 : 1"
       inkscape:vp_y="87.613106 : 306.00588 : 1"
       inkscape:vp_z="205.46432 : 105.78866 : 1"
       inkscape:persp3d-origin="105.00001 : 98.999985 : 1"
       id="perspective4485" />
  </defs>
  <sodipodi:namedview
     id="base"
     pagecolor="#ffffff"
     bordercolor="#666666"
     borderopacity="1.0"
     inkscape:pageopacity="0.0"
     inkscape:pageshadow="2"
     inkscape:zoom="0.35"
     inkscape:cx="41.97112"
     inkscape:cy="355.38663"
     inkscape:document-units="mm"
     inkscape:current-layer="g89"
     showgrid="false"
     inkscape:snap-bbox="true"
     inkscape:snap-bbox-midpoints="true"
     inkscape:snap-object-midpoints="true"
     inkscape:snap-global="false"
     fit-margin-top="0"
     fit-margin-left="7.730245"
     fit-margin-right="7.730245"
     fit-margin-bottom="0"
     inkscape:pagecheckerboard="true" />
  <metadata
     id="metadata5">
    <rdf:RDF>
      <cc:Work
         rdf:about="">
        <dc:format>image/svg+xml</dc:format>
        <dc:type
           rdf:resource="http://purl.org/dc/dcmitype/StillImage" />
        <dc:title></dc:title>
      </cc:Work>
    </rdf:RDF>
  </metadata>
  <g
     inkscape:label="Layer 1"
     inkscape:groupmode="layer"
     id="layer1"
     transform="translate(-10.038749,-43.6634)">
    <g
       id="g4676"
       transform="matrix(0.94952391,0,0,0.94978823,1.2397197,8.6363235)"
       style="stroke-width:1.05301285">
      <path
         inkscape:transform-center-y="-1.3577723e-06"
         inkscape:transform-center-x="1.0101525e-06"
         d="m 80.180857,43.548355 55.620323,32.112409 0,64.224816 -55.620327,32.11241 -55.620321,-32.11241 2e-6,-64.224819 z"
         inkscape:randomized="0"
         inkscape:rounded="0"
         inkscape:flatsided="true"
         sodipodi:arg2="-1.0471976"
         sodipodi:arg1="-1.5707963"
         sodipodi:r2="55.620323"
         sodipodi:r1="64.224815"
         sodipodi:cy="107.77317"
         sodipodi:cx="80.180855"
         sodipodi:sides="6"
         id="path4515-2"
         style="color:#000000;display:inline;overflow:visible;visibility:visible;fill:#ffffff;fill-opacity:1;fill-rule:evenodd;stroke:#ffffff;stroke-width:6.31807709;stroke-linecap:round;stroke-linejoin:round;stroke-miterlimit:4;stroke-dasharray:none;stroke-dashoffset:0;stroke-opacity:1;marker:none;marker-start:none;marker-mid:none;marker-end:none;enable-background:accumulate"
         sodipodi:type="star" />
      <path
         inkscape:transform-center-y="-1.3577723e-06"
         inkscape:transform-center-x="1.0101525e-06"
         d="m 80.180857,43.548355 55.620323,32.112409 0,64.224816 -55.620327,32.11241 -55.620321,-32.11241 2e-6,-64.224819 z"
         inkscape:randomized="0"
         inkscape:rounded="0"
         inkscape:flatsided="true"
         sodipodi:arg2="-1.0471976"
         sodipodi:arg1="-1.5707963"
         sodipodi:r2="55.620323"
         sodipodi:r1="64.224815"
         sodipodi:cy="107.77317"
         sodipodi:cx="80.180855"
         sodipodi:sides="6"
         id="path4515"
         style="color:#000000;display:inline;overflow:visible;visibility:visible;fill:none;fill-rule:evenodd;stroke:#000000;stroke-width:2.1060257;stroke-linecap:round;stroke-linejoin:round;stroke-miterlimit:4;stroke-dasharray:none;stroke-dashoffset:0;stroke-opacity:1;marker:none;marker-start:none;marker-mid:none;marker-end:none;enable-background:accumulate"
         sodipodi:type="star" />
      <path
         inkscape:connector-curvature="0"
         d="m 80.180857,43.548355 -10e-7,64.224815 m -55.620324,32.11241 55.620323,-32.11241 55.620325,32.11241"
         style="color:#000000;display:inline;overflow:visible;visibility:visible;fill:none;fill-rule:evenodd;stroke:#000000;stroke-width:2.1060257;stroke-linecap:round;stroke-linejoin:round;stroke-miterlimit:4;stroke-dasharray:none;stroke-dashoffset:0;stroke-opacity:1;marker:none;marker-start:none;marker-mid:none;marker-end:none;enable-background:accumulate"
         id="path4515-7" />
    </g>
    <g
       id="g89"
       transform="translate(-2.5234665,-44.723556)">
      <path
         sodipodi:nodetypes="cccccc"
         inkscape:connector-curvature="0"
         id="path4515-8"
         d="m 79.896826,95.940486 52.104364,29.890544 -1e-5,59.78108 -104.20872,-59.78109 v 59.78109 l 52.104361,29.89054"
         inkscape:transform-center-y="-3.6452217e-06"
         style="color:#000000;display:inline;overflow:visible;visibility:visible;fill:none;fill-rule:evenodd;stroke:#ffffff;stroke-width:15;stroke-linecap:round;stroke-linejoin:round;stroke-miterlimit:4;stroke-dasharray:none;stroke-dashoffset:0;stroke-opacity:1;marker:none;marker-start:none;marker-mid:none;marker-end:none;enable-background:accumulate" />
      <path
         sodipodi:nodetypes="cccccc"
         inkscape:connector-curvature="0"
         id="path4515-3"
         d="m 79.896826,95.940486 52.104364,29.890544 -1e-5,59.78108 -104.20872,-59.78109 v 59.78109 l 52.104361,29.89054"
         inkscape:transform-center-y="-3.6452217e-06"
         style="color:#000000;display:inline;overflow:visible;visibility:visible;fill:none;fill-rule:evenodd;stroke:#000000;stroke-width:8;stroke-linecap:round;stroke-linejoin:round;stroke-miterlimit:4;stroke-dasharray:none;stroke-dashoffset:0;stroke-opacity:1;marker:none;marker-start:none;marker-mid:none;marker-end:none;enable-background:accumulate" />
    </g>
  </g>
</svg>
