{
  "name": "General Store",
  "sellExchangeMultiplier": 0.5,
  "ceilPrice": true,
  "buysItems": true,
  "items": [
    { "id": "ItemId.LOBSTER" },
    { "id": "ItemId.SWORDFISH" },
    { "id": "ItemId.MONKFISH" },
    { "id": "ItemId.SHARK" },
    { "id": "ItemId.DARK_CRAB" },
    { "id": "ItemId.ANGLERFISH" },
    { "id": "ItemId.COOKED_KARAMBWAN" },
    { "id": "ItemId.ANCHOVY_PIZZA" },
    { "id": "ItemId.PINEAPPLE_PIZZA" },
    { "id": "ItemId.PURPLE_SWEETS", "price": 5000 },
    { "id": "ItemId.DWARVEN_ROCK_CAKE_7510", "price": 50000 },
    { "id": "ItemId.ATTACK_POTION_4", "price": 10 },
    { "id": "ItemId.STRENGTH_POTION_4" },
    { "id": "ItemId.DEFENCE_POTION_4" },
    { "id": "ItemId.SUPER_ATTACK_4" },
    { "id": "ItemId.SUPER_STRENGTH_4" },
    { "id": "ItemId.SUPER_DEFENCE_4" },
    { "id": "ItemId.RANGING_POTION_4" },
    { "id": "ItemId.MAGIC_POTION_4", "price": 200 },
    { "id": "ItemId.SUPER_COMBAT_POTION_4" },
    { "id": "ItemId.BASTION_POTION_4" },
    { "id": "ItemId.BATTLEMAGE_POTION_4" },
    { "id": "ItemId.PRAYER_POTION_4", "sellExchangeMultiplier": 0.25 },
    { "id": "ItemId.SUPER_ENERGY_4" },
    { "id": "ItemId.STAMINA_POTION_4" },
    { "id": "ItemId.SUPER_RESTORE_4" },
    { "id": "ItemId.SANFEW_SERUM_4" },
    { "id": "ItemId.SUPERANTIPOISON_4" },
    { "id": "ItemId.ANTIDOTE_PLUS_PLUS_4", "price": 300 },
    { "id": "ItemId.ANTI_VENOM_4" },
    { "id": "ItemId.ANTI_VENOM_PLUS_4" },
    { "id": "ItemId.SARADOMIN_BREW_4" },
    { "id": "ItemId.ANTIFIRE_POTION_4", "price": 200 },
    { "id": "ItemId.SUPER_ANTIFIRE_POTION_4" },
    { "id": "ItemId.GUTHIX_REST_4" },
    { "id": "ItemId.TELEPORT_TO_HOUSE", "price": 500 },
    { "id": "ItemId.VARROCK_TELEPORT", "price": 500 },
    { "id": "ItemId.LUMBRIDGE_TELEPORT", "price": 500 },
    { "id": "ItemId.FALADOR_TELEPORT", "price": 500 },
    { "id": "ItemId.CAMELOT_TELEPORT", "price": 500 },
    { "id": "ItemId.ARDOUGNE_TELEPORT", "price": 500 },
    { "id": "ItemId.TAVERLEY_TELEPORT", "price": 500 },
    { "id": "ItemId.RELLEKKA_TELEPORT", "price": 500 },
    { "id": "ItemId.TROLLHEIM_TELEPORT", "price": 500 },
    { "id": "ItemId.KHARYRLL_TELEPORT", "price": 500 },
    { "id": "ItemId.PADDEWWA_TELEPORT", "price": 500 },
    { "id": "ItemId.HARMONY_ISLAND_TELEPORT", "price": 500 },
    { "id": "ItemId.TELEPORT_CRYSTAL_4", "price": 5000 },
    { "id": "ItemId.CARRALLANGAR_TELEPORT", "price": 500 },
    { "id": "ItemId.DAREEYAK_TELEPORT", "price": 500 },
    { "id": "ItemId.ANNAKARL_TELEPORT", "price": 500 },
    { "id": "ItemId.GHORROCK_TELEPORT", "price": 500 },
    { "id": "ItemId.LUMBERYARD_TELEPORT", "price": 500000 },
    { "id": "ItemId.GAMES_NECKLACE_8", "price": 5000 },
    { "id": "ItemId.LOCKPICK", "price": 500 },
    { "id": "ItemId.CLEANING_CLOTH", "price": 50000 }
  ]
}
