{
  "name": "Donator Shop",
  "items": [
    { "id": "ItemId.CRYSTAL_CROWN", "price": 500000000 },
    { "id": "ItemId.CRYSTAL_OF_ITHELL", "price": 25000000 },
    { "id": "ItemId.CRYSTAL_OF_IORWERTH", "price": 25000000 },
    { "id": "ItemId.CRYSTAL_OF_TRAHAEARN", "price": 25000000 },
    { "id": "ItemId.CRYSTAL_OF_CADARN", "price": 25000000 },
    { "id": "ItemId.CRYSTAL_OF_CRWYS", "price": 25000000 },
    { "id": "ItemId.CRYSTAL_OF_MEILYR", "price": 25000000 },
    { "id": "ItemId.CRYSTAL_OF_HEFIN", "price": 25000000 },
    { "id": "ItemId.CRYSTAL_OF_AMLODD", "price": 25000000 }
  ]
}
