{
    "name": "Bob's Exchange",
    "alwaysSellNoted": true,
    "items": [
      {
        "price": 200,
        "costItems": [
          [ { "id": "ItemId.TIN_ORE_NOTED", "amount": 1 } ],
          [ { "id": "ItemId.COPPER_ORE_NOTED", "amount": 1 } ]
        ],
        "id": "ItemId.BRONZE_BAR"
      },
      {
        "price": 200,
        "costItems": [
          [ { "id": "ItemId.IRON_ORE_NOTED", "amount": 1 } ]
        ],
        "id": "ItemId.IRON_BAR"
      },
      {
        "price": 200,
        "costItems": [
          [ { "id": "ItemId.IRON_ORE_NOTED", "amount": 1 } ],
          [ { "id": "ItemId.COPPER_ORE_NOTED", "amount": 2 } ]
        ],
        "id": "ItemId.STEEL_BAR"
      },
      {
        "price": 200,
        "costItems": [
          [ { "id": "ItemId.GOLD_ORE_NOTED", "amount": 1 } ]
        ],
        "id": "ItemId.GOLD_BAR"
      },
      {
        "price": 200,
        "costItems": [
          [ { "id": "ItemId.MITHRIL_ORE_NOTED", "amount": 1 } ],
          [ { "id": "ItemId.COAL_NOTED", "amount": 4 } ]
        ],
        "id": "ItemId.MITHRIL_BAR"
      },
      {
        "price": 200,
        "costItems": [
          [ { "id": "ItemId.ADAMANTITE_ORE_NOTED", "amount": 1 } ],
          [ { "id": "ItemId.COAL_NOTED", "amount": 6 } ]
        ],
        "id": "ItemId.ADAMANTITE_BAR"
      },
      {
        "price": 200,
        "costItems": [
          [ { "id": "ItemId.RUNITE_ORE_NOTED", "amount": 1 } ],
          [ { "id": "ItemId.COAL_NOTED", "amount": 8 } ]
        ],
        "id": "ItemId.RUNITE_BAR"
      }
    ]
}
