{
  "name": "Clan Wars Shop",
  "freeItems": true,
  "sellState": "UNNOTED",
  "items": [
    { "id": "ItemId.COINS" },
    { "id": "ItemId.ZULRAHS_SCALES" },
    { "id": "ItemId.CRYSTAL_SHARD" },
    { "id": "ItemId.DARK_CRAB" },
    { "id": "ItemId.ANGLERFISH" },
    { "id": "ItemId.COOKED_KARAMBWAN" },
    { "id": "ItemId.PINEAPPLE_PIZZA" },
    { "id": "ItemId.DWARVEN_ROCK_CAKE_7510" },
    { "id": "ItemId.SUPER_COMBAT_POTION_4" },
    { "id": "ItemId.BASTION_POTION_4" },
    { "id": "ItemId.BATTLEMAGE_POTION_4" },
    { "id": "ItemId.SANFEW_SERUM_4" },
    { "id": "ItemId.ANTI_VENOM_PLUS_4" },
    { "id": "ItemId.SARADOMIN_BREW_4" },
    { "id": "ItemId.SUPER_ANTIFIRE_POTION_4" },
    { "id": "ItemId.GUTHIX_REST_4" },
    { "id": "ItemId.IMBUED_HEART" },
    { "id": "ItemId.RUNE_POUCH" },
    { "id": "ItemId.FIRE_RUNE" },
    { "id": "ItemId.WATER_RUNE" },
    { "id": "ItemId.AIR_RUNE" },
    { "id": "ItemId.EARTH_RUNE" },
    { "id": "ItemId.CHAOS_RUNE" },
    { "id": "ItemId.DEATH_RUNE" },
    { "id": "ItemId.WRATH_RUNE" },
    { "id": "ItemId.BLOOD_RUNE" },
    { "id": "ItemId.SOUL_RUNE" },
    { "id": "ItemId.NATURE_RUNE" },
    { "id": "ItemId.ASTRAL_RUNE" },
    { "id": "ItemId.STEAM_RUNE" },
    { "id": "ItemId.MIST_RUNE" },
    { "id": "ItemId.DUST_RUNE" },
    { "id": "ItemId.SMOKE_RUNE" },
    { "id": "ItemId.MUD_RUNE" },
    { "id": "ItemId.LAVA_RUNE" },
    { "id": "ItemId.BURNT_PAGE" },
    { "id": "ItemId.RUNE_ARROW_P_PLUS_PLUS" },
    { "id": "ItemId.DRAGON_ARROW_P_PLUS_PLUS" },
    { "id": "ItemId.OPAL_DRAGON_BOLTS_E" },
    { "id": "ItemId.RUBY_DRAGON_BOLTS_E" },
    { "id": "ItemId.DIAMOND_DRAGON_BOLTS_E" },
    { "id": "ItemId.DRAGONSTONE_DRAGON_BOLTS_E" },
    { "id": "ItemId.ONYX_DRAGON_BOLTS_E" },
    { "id": "ItemId.DRAGON_JAVELIN_P_PLUS_PLUS" },
    { "id": "ItemId.BOLT_RACK" },
    { "id": "ItemId.ANTI_DRAGON_SHIELD" },
    { "id": "ItemId.BLUE_WIZARD_HAT" },
    { "id": "ItemId.BLUE_WIZARD_ROBE" },
    { "id": "ItemId.BLUE_SKIRT" },
    { "id": "ItemId.WIZARD_HAT" },
    { "id": "ItemId.BLACK_ROBE" },
    { "id": "ItemId.BLACK_SKIRT" },
    { "id": "ItemId.MONKS_ROBE_TOP" },
    { "id": "ItemId.MONKS_ROBE" },
    { "id": "ItemId.MITHRIL_GLOVES" },
    { "id": "ItemId.ADAMANT_GLOVES" },
    { "id": "ItemId.RUNE_GLOVES" },
    { "id": "ItemId.BARROWS_GLOVES" },
    { "id": "ItemId.REGEN_BRACELET" },
    { "id": "ItemId.CLIMBING_BOOTS" },
    { "id": "ItemId.PHOENIX_NECKLACE" },
    { "id": "ItemId.AMULET_OF_FURY" },
    { "id": "ItemId.AMULET_OF_THE_DAMNED_FULL" },
    { "id": "ItemId.RING_OF_RECOIL" },
    { "id": "ItemId.UNHOLY_BOOK" },
    { "id": "ItemId.SPIRIT_SHIELD" },
    { "id": "ItemId.BLESSED_SPIRIT_SHIELD" },
    { "id": "ItemId.SPECTRAL_SPIRIT_SHIELD" },
    { "id": "ItemId.ARCANE_SPIRIT_SHIELD" },
    { "id": "ItemId.ELYSIAN_SPIRIT_SHIELD" },
    { "id": "ItemId.DINHS_BULWARK" },
    { "id": "ItemId.VOID_KNIGHT_SET_32289" },
    { "id": "ItemId.GRANITE_MAUL" },
    { "id": "ItemId.DRAGON_DAGGER_P_PLUS_PLUS" },
    { "id": "ItemId.DRAGON_SCIMITAR" },
    { "id": "ItemId.DRAGON_MACE" },
    { "id": "ItemId.DRAGON_LONGSWORD" },
    { "id": "ItemId.DRAGON_WARHAMMER" },
    { "id": "ItemId.DRAGON_CLAWS" },
    { "id": "ItemId.BARRELCHEST_ANCHOR" },
    { "id": "ItemId.ABYSSAL_WHIP" },
    { "id": "ItemId.ABYSSAL_TENTACLE" },
    { "id": "ItemId.BLADE_OF_SAELDOR" },
    { "id": "ItemId.SARAS_BLESSED_SWORD_FULL" },
    { "id": "ItemId.BANDOS_GODSWORD" },
    { "id": "ItemId.ZAMORAK_GODSWORD" },
    { "id": "ItemId.SARADOMIN_GODSWORD" },
    { "id": "ItemId.ARMADYL_GODSWORD" },
    { "id": "ItemId.ELDER_MAUL" },
    { "id": "ItemId.GHRAZI_RAPIER" },
    { "id": "ItemId.VESTAS_LONGSWORD" },
    { "id": "ItemId.STATIUSS_WARHAMMER" },
    { "id": "ItemId.VESTAS_SPEAR" },
    { "id": "ItemId.HELM_OF_NEITIZNOT" },
    { "id": "ItemId.NEITIZNOT_FACEGUARD" },
    { "id": "ItemId.INITIATE_SALLET" },
    { "id": "ItemId.INITIATE_HAUBERK" },
    { "id": "ItemId.INITIATE_CUISSE" },
    { "id": "ItemId.PROSELYTE_SALLET" },
    { "id": "ItemId.PROSELYTE_HAUBERK" },
    { "id": "ItemId.PROSELYTE_CUISSE" },
    { "id": "ItemId.RUNE_PLATEBODY" },
    { "id": "ItemId.RUNE_PLATELEGS" },
    { "id": "ItemId.RUNE_BOOTS" },
    { "id": "ItemId.DRAGON_PLATELEGS" },
    { "id": "ItemId.DRAGON_BOOTS" },
    { "id": "ItemId.GUTHANS_ARMOUR_SET" },
    { "id": "ItemId.VERACS_ARMOUR_SET" },
    { "id": "ItemId.DHAROKS_ARMOUR_SET" },
    { "id": "ItemId.TORAGS_ARMOUR_SET" },
    { "id": "ItemId.BANDOS_CHESTPLATE" },
    { "id": "ItemId.BANDOS_TASSETS" },
    { "id": "ItemId.JUSTICIAR_FACEGUARD" },
    { "id": "ItemId.JUSTICIAR_CHESTGUARD" },
    { "id": "ItemId.JUSTICIAR_LEGGUARDS" },
    { "id": "ItemId.FIGHTER_TORSO" },
    { "id": "ItemId.BERSERKER_HELM" },
    { "id": "ItemId.SERPENTINE_HELM" },
    { "id": "ItemId.BERSERKER_NECKLACE" },
    { "id": "ItemId.AMULET_OF_TORTURE" },
    { "id": "ItemId.FEROCIOUS_GLOVES" },
    { "id": "ItemId.PRIMORDIAL_BOOTS" },
    { "id": "ItemId.RUNE_DEFENDER" },
    { "id": "ItemId.DRAGON_DEFENDER" },
    { "id": "ItemId.AVERNIC_DEFENDER" },
    { "id": "ItemId.BERSERKER_RING_I" },
    { "id": "ItemId.FIRE_CAPE" },
    { "id": "ItemId.INFERNAL_CAPE" },
    { "id": "ItemId.DRAGONFIRE_SHIELD_11284" },
    { "id": "ItemId.MAGIC_SHORTBOW_I" },
    { "id": "ItemId.DARK_BOW" },
    { "id": "ItemId.DRAGON_KNIFE_P_PLUS_PLUS" },
    { "id": "ItemId.DRAGON_DART_P_PLUS_PLUS" },
    { "id": "ItemId.DRAGON_THROWNAXE" },
    { "id": "ItemId.RUNE_CROSSBOW" },
    { "id": "ItemId.DRAGON_CROSSBOW" },
    { "id": "ItemId.ARMADYL_CROSSBOW" },
    { "id": "ItemId.LIGHT_BALLISTA" },
    { "id": "ItemId.HEAVY_BALLISTA" },
    { "id": "ItemId.MORRIGANS_JAVELIN" },
    { "id": "ItemId.MORRIGANS_THROWING_AXE" },
    { "id": "ItemId.BLACK_DHIDE_BODY" },
    { "id": "ItemId.BLACK_DHIDE_CHAPS" },
    { "id": "ItemId.KARILS_ARMOUR_SET" },
    { "id": "ItemId.ARMADYL_HELMET" },
    { "id": "ItemId.ARMADYL_CHESTPLATE" },
    { "id": "ItemId.ARMADYL_CHAINSKIRT" },
    { "id": "ItemId.AVAS_ACCUMULATOR" },
    { "id": "ItemId.AVAS_ASSEMBLER" },
    { "id": "ItemId.ROBIN_HOOD_HAT" },
    { "id": "ItemId.RANGER_BOOTS" },
    { "id": "ItemId.PEGASIAN_BOOTS" },
    { "id": "ItemId.NECKLACE_OF_ANGUISH" },
    { "id": "ItemId.ODIUM_WARD" },
    { "id": "ItemId.TWISTED_BUCKLER" },
    { "id": "ItemId.DRAGONFIRE_WARD_22003" },
    { "id": "ItemId.ARCHERS_RING_I" },
    { "id": "ItemId.ANCIENT_STAFF" },
    { "id": "ItemId.MASTER_WAND" },
    { "id": "ItemId.STAFF_OF_LIGHT" },
    { "id": "ItemId.TOXIC_STAFF_OF_THE_DEAD" },
    { "id": "ItemId.KODAI_WAND" },
    { "id": "ItemId.NIGHTMARE_STAFF" },
    { "id": "ItemId.HARMONISED_NIGHTMARE_STAFF" },
    { "id": "ItemId.VOLATILE_NIGHTMARE_STAFF" },
    { "id": "ItemId.ELDRITCH_NIGHTMARE_STAFF" },
    { "id": "ItemId.ZURIELS_STAFF" },
    { "id": "ItemId.GHOSTLY_HOOD" },
    { "id": "ItemId.GHOSTLY_ROBE" },
    { "id": "ItemId.GHOSTLY_ROBE_6108" },
    { "id": "ItemId.MYSTIC_HAT" },
    { "id": "ItemId.MYSTIC_ROBE_TOP" },
    { "id": "ItemId.MYSTIC_ROBE_BOTTOM" },
    { "id": "ItemId.INFINITY_HAT" },
    { "id": "ItemId.INFINITY_TOP" },
    { "id": "ItemId.INFINITY_BOTTOMS" },
    { "id": "ItemId.INFINITY_BOOTS" },
    { "id": "ItemId.AHRIMS_ARMOUR_SET" },
    { "id": "ItemId.ANCESTRAL_HAT" },
    { "id": "ItemId.ANCESTRAL_ROBE_TOP" },
    { "id": "ItemId.ANCESTRAL_ROBE_BOTTOM" },
    { "id": "ItemId.WIZARD_BOOTS" },
    { "id": "ItemId.ETERNAL_BOOTS" },
    { "id": "ItemId.TORMENTED_BRACELET" },
    { "id": "ItemId.OCCULT_NECKLACE" },
    { "id": "ItemId.TOME_OF_FIRE" },
    { "id": "ItemId.MAGES_BOOK" },
    { "id": "ItemId.MALEDICTION_WARD" },
    { "id": "ItemId.ANCIENT_WYVERN_SHIELD_21634" },
    { "id": "ItemId.SEERS_RING_I" },
    { "id": "ItemId.IMBUED_SARADOMIN_CAPE" },
    { "id": "ItemId.IMBUED_GUTHIX_CAPE" },
    { "id": "ItemId.IMBUED_ZAMORAK_CAPE" }
  ]
}
