{
  "project_info": {
    "project_number": "775491895931",
    "project_id": "hcvet-35643",
    "storage_bucket": "hcvet-35643.appspot.com"
  },
  "client": [
    {
      "client_info": {
        "mobilesdk_app_id": "1:775491895931:android:2fdf1b74678e33338598de",
        "android_client_info": {
          "package_name": "com.ivandelgadog.hcvet"
        }
      },
      "oauth_client": [
        {
          "client_id": "775491895931-cbdhmuopsstnh5ugf5fli5l1ase5sflg.apps.googleusercontent.com",
          "client_type": 3
        }
      ],
      "api_key": [
        {
          "current_key": "AIzaSyCduh3tSVbA-a6jPFjBXTQVxBpQuM_tHgk"
        }
      ],
      "services": {
        "appinvite_service": {
          "other_platform_oauth_client": [
            {
              "client_id": "775491895931-cbdhmuopsstnh5ugf5fli5l1ase5sflg.apps.googleusercontent.com",
              "client_type": 3
            }
          ]
        }
      }
    }
  ],
  "configuration_version": "1"
}